Bug Triage

From Yocto Project
Jump to: navigation, search

Contents

Goal

The output of the bug triage meeting should be that all bugs have an owner, a target milestone, and a priority.

Prior to the meeting, each Product Owner should review their Weekly New and High Bugs and be ready with any opens. An example open would be a bug that may need to change Products.

Roles

  • Call facilitator: Stephen K. Jolley
    • Ensure we keep to the agenda, don't rathole on bug resolution, and stay within our time block.

Agenda

  • Review Queries
    • State number, title, and owner
    • Owner makes any modifications
    • Assign owner, target milestone, and priority.
  • Opens
    • Collect opens
    • Discuss opens

Note: for Minnowboard or MinnowBoard-MAX bugs go to: Minnow Bug Triage

Bug Criteria

  • Priority-Severity
    • High: Two Week
    • Medium+: Milestone
    • Medium: Nice to have for milestone, should have for release
    • Low: Nice to have, but no urgency

Bug Status Dashboards

Weekly - https://wiki.yoctoproject.org/charts/combo.html

Daily - https://wiki.yoctoproject.org/charts/daily/combo.html


Bug Product Searches

Yocto Bug Triage Searches

Non-Prioritized Bugs (!Toaster)

IDSummary (9 tasks) SeverityPMilestoneAssigneeStatusWhiteboardE
9677Update bugzilla instance to 5.X or greaterenhancementUndecided---Michael HalsteadNEW
9678Include automated test execution and reporting in AutobuilderenhancementUndecided2.2 M1Aníbal LimónACCEPTED
9679Add a small section on dependencies in the Writing a New Recipe sectionenhancementUndecided---Scott RifenbarkNEW
9680beaglebone kernel fails in poky-lsb with gcc6majorUndecided---Bruce AshfieldIN PROGRESS REVIEW
9681Running abat script failed in module [intel_agp] and module [i915]normalUndecided---Saul WoldNEW
9682enable xml output in OeTest class for report consumersenhancementUndecided---Benjamin EsquivelNEW
96833.10 says d.getVar("X", expand=False) but that's wrong for 2.1normalUndecided---Scott RifenbarkNEW
9688powertop: "show pids in wakeups list" option fails with exit code 1normalUndecided---Tim OrlingNEW
9689Add support for automatic runtime testing in DUT (master bug)normalUndecided---Benjamin EsquivelNEW
 9       

Non-Targeted Bugs (!Toaster)

IDSummary (8 tasks) SeverityPMilestoneAssigneeStatusWhiteboardE
9677Update bugzilla instance to 5.X or greaterenhancementUndecided---Michael HalsteadNEW
9679Add a small section on dependencies in the Writing a New Recipe sectionenhancementUndecided---Scott RifenbarkNEW
9680beaglebone kernel fails in poky-lsb with gcc6majorUndecided---Bruce AshfieldIN PROGRESS REVIEW
9681Running abat script failed in module [intel_agp] and module [i915]normalUndecided---Saul WoldNEW
9682enable xml output in OeTest class for report consumersenhancementUndecided---Benjamin EsquivelNEW
96833.10 says d.getVar("X", expand=False) but that's wrong for 2.1normalUndecided---Scott RifenbarkNEW
9688powertop: "show pids in wakeups list" option fails with exit code 1normalUndecided---Tim OrlingNEW
9689Add support for automatic runtime testing in DUT (master bug)normalUndecided---Benjamin EsquivelNEW
 8       

Unassigned Bugs

IDSummary (63 tasks) SeverityPMilestoneAssigneeStatusWhiteboardE
6234Implement model for project owner / userenhancementMedium2.3UnassignedNEW2
760[script] no options to use kernel nfs server as nfsrootenhancementLowFutureUnassignedNEWMoved from Laurentiu to Unassigned7
1550Enhance TARGET_VENDOR field supportenhancementLowFutureUnassignedNEWP33
1560Enable recipe specific sysrootsenhancementLowFutureUnassignedACCEPTED5
1658depexp like features without XenhancementLowFutureUnassignedNEW
2025runqemu scripts should attempt sane defaults for unkown machinesminorLowFutureUnassignedNEW3
2086Rewrite bbvars.py to use bitbake to find variablesminorLowFutureUnassignedNEW
2087Address LTP and POSIX compliance testsminorLowFutureUnassignedNEW
2273Evaluate current image space settingsenhancementLowFutureUnassignedNEWMoved from Laurentiu to Unassigned4
2348Cleanup package.bbclass - runstrip and split_and_strip_files checksminorLowFutureUnassignedNEW
2413fri2: enable user input buttonminorLowFutureUnassignedNEWMoved from Kevin to Unassigned10
2421[Performance] Further improvements for turning off doc generation for -native (and similar) packagesenhancementLowFutureUnassignedNEW
2782screen hangs with ttyS0normalLowFutureUnassignedNEW
2951Review and remove unnecessary uses of _prepend/_appendminorLowFutureUnassignedNEW
3256Debugging tools and binaries need to be attached to target run timeminorLowFutureUnassignedNEW
3763generate error if file in FILES is not foundenhancementLowFutureUnassignedNEW
4929Add support for pacman as package_pacman/xy.bbclassenhancementLowFutureUnassignedNEW
5005Ability to use rpmbuild to build packages (via the SDK)enhancementLowFutureUnassignedNEWMoved from Laurentiu to Unassigned
5430Notification systemenhancementLowFutureUnassignedNEW
5605Add ptest for libavenhancementLowFutureUnassignedNEW
5695python: ptest cases failednormalLowFutureUnassignedNEWMoved from Laurentiu to Unassigned
5782Do not configure sftp for the ssh daemon by defaultminorLowFutureUnassignedIN PROGRESS DESIGNRoxanna is no longer at Intel
5785Make it possible to sync up configurations with defconfigenhancementLowFutureUnassignedNEW
6303Perforce does not take variables from executing shellenhancementLowFutureUnassignedNEW
6498Latencytop -d does not work for qemuppc and qemuarmnormalLowFutureUnassignedWaitForUpstreamRoxanna is no longer at Intel
6573meta-toolchain-qte: Cannot be used to produce "Debug" and "Release" builds of Qt application outside Yocto buildsystemnormalLowFutureUnassignedNEW
6950bitbake errors must have unique ids to make them easily greppable in the sourceenhancementLowFutureUnassignedNEW
7219Show the file size of the license manifest when available for download in the build dashboardenhancementLowFutureUnassignedNEWbuild dashboard page
7294For QA Issues errors and warnings, toaster should recognize the error and provide suggestions to the user on how the error can be repairedenhancementLowFutureUnassignedNEWGUI design pending
8109fail to build glibc for aarch64 on fedora 22 i686normalLowFutureUnassignedNEW
8123the aarch64 toolchain can not build iptables on i686 hostnormalLowFutureUnassignedNEW
139Set default gcc instruction generation to TARGET_ARCH on targetenhancementMediumFutureUnassignedNEW5
256Sync up RPM version policy with rest of system (including support '~' in version strings)enhancementMediumFutureUnassignedNEWMoved from Laurentiu to Unassigned10
3463Define PREEMPT_RT validation suiteenhancementMediumFutureUnassignedACCEPTED3
3887Merge buildstats into build history and have one data collection mechanismenhancementMediumFutureUnassignedIN PROGRESS DESIGN
3976Support ~ in package versionsenhancementMediumFutureUnassignedNEWMoved from Laurentiu to Unassigned
4059init-install.sh assumes boot device is the same as the one selected when it is runnormalMediumFutureUnassignedNEW
4402Customise the summary of all the information available for one build + image recipe combinationenhancementMediumFutureUnassignedNEW10
4436Add ptest for glibcenhancementMediumFutureUnassignedNEWMoved from Laurentiu to Unassigned5
4437Add ptest for gccenhancementMediumFutureUnassignedNEWMoved from Laurentiu to Unassigned5
4525Use buildhistory to log key values and track regressionenhancementMediumFutureUnassignedNEW
4526Record image size from buildhistory to track regressionenhancementMediumFutureUnassignedNEW1.5
4578x32 ABI performance comparisonenhancementMediumFutureUnassignedNEW
5538Implement Backend API controller for buildbotenhancementMediumFutureUnassignedNEW
5955Enhance PATCHTOOL = "git" to be able to pop off patch seriesenhancementMediumFutureUnassignedNEW
6649Ability to report locked sigs deltaenhancementMediumFutureUnassignedNEW5
6670all compatible recipes page should link to layer source recipe with the layer nameenhancementMediumFutureUnassignedNEW
6706Include maintainers list for layersenhancementMediumFutureUnassignedNEW
6778Add "import layer" to layer suggestions drop downenhancementMediumFutureUnassignedNEWproject configuration page
6840Seeing builds delta in ToasterenhancementMediumFutureUnassignedNEWGUI design pending
6897Customise the Django admin interfaceenhancementMediumFutureUnassignedNEWGUI design pending
6978For the local release in Toaster, show local path to layer directory instead of Git URLenhancementMediumFutureUnassignedNEWproject configuration page
7038For cached tasks, indicate in which URL the sstate object was foundenhancementMediumFutureUnassignedNEW
7355Strange outcome in Toaster 'covered' tasks queriesnormalMediumFutureUnassignedNEW
7457Split "Previous Build" tasksenhancementMediumFutureUnassignedNEW
7503Add support for MultiPath TCP for YP Linux images/specific imageenhancementMediumFutureUnassignedNEW
7527Integrate Toaster with JenkinsenhancementMediumFutureUnassignedNEW10
7727toaster: show bbappend information for recipesenhancementMediumFutureUnassignedNEWGUI design pending4
7742Remove constraints when setting the layers checkout directoryenhancementMediumFutureUnassignedNEW
7748Provide a way to do a Toaster cleanup and start again if you get the initial set up wrongenhancementMediumFutureUnassignedNEW
7954pigz has resource race issuesnormalMediumFutureUnassignedNEW
8008Expose branch mapping through the layer index UIenhancementMediumFutureUnassignedNEW
4284Presenting information provided by the diffsigs toolenhancementMedium+FutureUnassignedNEW5
 63       

New This Week

IDSummary (30 tasks) SeverityPMilestoneAssigneeStatusWhiteboardE
9678Include automated test execution and reporting in AutobuilderenhancementUndecided2.2 M1Aníbal LimónACCEPTED
9661upgrade oe-selftest to python 3normalMedium+2.2 M1Leonardo Sandoval GonzalezIN PROGRESS IMPLEMENTATION3
9673perl ptest package tries to include generate_uudmap host executablemajorMedium+2.2 M2Renato CaldasIN PROGRESS REVIEW1
9680beaglebone kernel fails in poky-lsb with gcc6majorUndecided---Bruce AshfieldIN PROGRESS REVIEW
9660Create a YP-2.2 test plan for SWUpdnormalMedium+2.2 M1Benjamin EsquivelNEW
9662patchdir fails silently if no trailing slash is presentnormalMedium+2.2 M2Markus LehtonenNEW
9663do_populate_lic assumes that license basenames are uniquenormalMedium2.2Markus LehtonenNEW
9664The old gstreamer1.0-plugins-bad recipe is causing errors and conflictsnormalMedium+2.2 M1Jussi KukkonenNEW
9665quoting bug in poky/scripts/contrib/mkefidisk.shnormalMedium2.2Troy D. HansonNEW
9667Image types in quick start guide should be appropriate and consistentnormalMedium+2.2 M2Jussi KukkonenNEW
9668libarchive doesn't respect disable-aclnormalMedium2.2Maxin B. JohnNEW
9669No category for OE-core/recipes-extendednormalMediumFutureMichael HalsteadNEW
9670Toaster does not set a correct MIME type for tasks' logs filesnormalLow2.2Elliot SmithNEW
9671UPSTREAM_CHECK_* variables needs documentationenhancementMedium2.2Scott RifenbarkNEW
9672Add documentation for package installation during runtime testingenhancementMedium2.2Scott RifenbarkNEW
9675Replacing/updating smartpm/createrepoenhancementMedium+2.2 M1Mark HatleNEW
9676ToasterTables does not take into account the target when displaying package dependenciesnormalMedium+2.2 M1Michael WoodNEW
9677Update bugzilla instance to 5.X or greaterenhancementUndecided---Michael HalsteadNEW
9679Add a small section on dependencies in the Writing a New Recipe sectionenhancementUndecided---Scott RifenbarkNEW
9681Running abat script failed in module [intel_agp] and module [i915]normalUndecided---Saul WoldNEW
9682enable xml output in OeTest class for report consumersenhancementUndecided---Benjamin EsquivelNEW
96833.10 says d.getVar("X", expand=False) but that's wrong for 2.1normalUndecided---Scott RifenbarkNEW
9684"Edit Columns" Button on the Compatible layers view is missingnormalUndecided---Toaster default assigneeNEW
9686"Compatible image recipes" view does not show proper label messagenormalUndecided---Toaster default assigneeNEW
9687[Test Case 1099] Check if build succeeded when project release is changedcriticalUndecided---Toaster default assigneeNEW
9688powertop: "show pids in wakeups list" option fails with exit code 1normalUndecided---Tim OrlingNEW
9689Add support for automatic runtime testing in DUT (master bug)normalUndecided---Benjamin EsquivelNEW
9666esdk: 'devtool build' fails due to certificates problemnormalMedium+2.2 M1Paul EggletonRESOLVED
9685Image recipes (Cancel, this was created by mistake)normalUndecided---Toaster default assigneeRESOLVED
9674Rename qemux86_64 to qemux86-64 in adt repo for 2.0.2 rc1normalUndecided---Bill RandleVERIFIED0.1
 30      4.1

Medium+ Bugs

IDSummary (107 tasks) SeverityPMilestoneAssigneeStatusWhiteboardE
7469SDL package cannot be found on OpenSUSE 13.2normalMedium+1.6.4Juro BystrickyIN PROGRESS REVIEW2
8487PTEST image does not install on hdd on 1.8.1normalMedium+1.7.4Armin KusterIN PROGRESS IMPLEMENTATION1
7641CVE-2014-9365 python: failure to validate certificates in the HTTP client with TLS (PEP 476)normalMedium+1.7.4Armin KusterACCEPTED5
9653Boot and install from USB failed after GRUB black screen is displayedmajorMedium+1.8.2Jianxun ZhangREOPENED
9652boot and install from USB failed getting [sdc] error messagemajorMedium+1.8.3Jianxun ZhangNEW
9654Ogg media file audio is not working on NUC and MMaxnormalMedium+1.8.3Saul WoldNEW
9353yocto-bsp: script using different kernel than the one given when creating bspnormalMedium+2.0.2Humberto IbarraIN PROGRESS REVIEW0.5
8028Garbage in SDK manifest filenormalMedium+2.0.2Mariano LopezIN PROGRESS REVIEW3
7991qemuppc bootup failure with oe-core toolchain (with systemd)normalMedium+2.0.2Mark HatleIN PROGRESS IMPLEMENTATION
8092Implementation of the function glXChooseFBConfig in the libGL.so does not match OpenGL documentationnormalMedium+2.0.2Otavio SalvadorWaitForUpstream
8877WebKitGTK+ Security AdvisoriesnormalMedium+2.0.2ytaoNEW
9302Failed to start qemu with toolchain sysrootnormalMedium+2.1.1brian averyNEW
9362Failed to run and debug a project to qemux86 in EclipsenormalMedium+2.1.1brian averyNEW3
9472[NO USB support ] Beaglebone black latest yoctomajorMedium+2.1.1Kevin HaoIN PROGRESS REVIEW1
9520test_parselogs failed on udevd[342] inotify_add_watch /dev/loop when running test imagenormalMedium+2.1.1Saul WoldNEW
9105[MARS] Cannot install eclipse-poky pluginnormalMedium+2.1.1Tim OrlingIN PROGRESS IMPLEMENTATION1.5
7968empty page states for no information in the databasenormalMedium+2.2Belen Barros PenaNEWGUI design pending5
1989Default module selections need attentionminorMedium+2.2Bruce AshfieldIN PROGRESS IMPLEMENTATION4
8037External link to recipe file links to non-existing page when recipe information comes from a buildnormalMedium+2.2David ReynaIN PROGRESS IMPLEMENTATION5
8440Toaster has some issues when showing builds that fail at the build request stagenormalMedium+2.2Elliot SmithIN PROGRESS REVIEWGUI design available8
8556Toaster: bitbake variables image_fstypes not being passed to build processnormalMedium+2.2Elliot SmithIN PROGRESS IMPLEMENTATION15
9594Toaster is not showing properly image files for buildsnormalMedium+2.2Elliot SmithNEW
8078useradd.bbclass: useradd_preinst not run when rebuilding on second MACHINEmajorMedium+2.2Maxin B. JohnACCEPTED3
8952Changes to the revision of an imported layer are not savednormalMedium+2.2Michael WoodNEW
9124Location of kernel sources is incorrectnormalMedium+2.2Tom ZanussiIN PROGRESS REVIEW2
8192python3.4.3 os.fork and os.waitpidminorMedium+2.2 M1Alejandro HernandezACCEPTED15
8142avahi daemon fails to start on systemd while testing core-image-satonormalMedium+2.2 M1Aníbal LimónACCEPTED5
8771test_smart_channel_add (oeqa.runtime.smart.SmartRepoTest) failed in AutobuildernormalMedium+2.2 M1Aníbal LimónIN PROGRESS DESIGN5
9660Create a YP-2.2 test plan for SWUpdnormalMedium+2.2 M1Benjamin EsquivelNEW
9617Create Toaster Docker production containernormalMedium+2.2 M1brian averyNEW1.5
9584upgrade toaster to Python3normalMedium+2.2 M1Ed BartoshIN PROGRESS IMPLEMENTATION5
9397[Autobuilder] - public WIC buildset artifactsnormalMedium+2.2 M1Beth FlanaganNEW0.5
9536oe-selftest: test_sstate_noop_samesigs failed due qmmp LICENSE_FLAGS_WHITELISTnormalMedium+2.2 M1Francisco PedrazaNEEDINFO1
9507Misleading error message when conf/bblayers has problemsnormalMedium+2.2 M1Geoffroy Van CutsemIN PROGRESS REVIEW1
8245dmesg qa check: fbcon_init: detected unhandled fb_set_par error (timeout case)normalMedium+2.2 M1Jianxun ZhangIN PROGRESS REVIEW0.1
9452[meta-swupd] update to latest swupd and adapt to changesnormalMedium+2.2 M1Joshua LockNEW2
9664The old gstreamer1.0-plugins-bad recipe is causing errors and conflictsnormalMedium+2.2 M1Jussi KukkonenNEW
9572sudoku-savant tarball not found when SDK testing on core-image-satonormalMedium+2.2 M1Leonardo Sandoval GonzalezACCEPTED1
9573openssh, subversion and ghostscript URLs fail on do_checkuri testnormalMedium+2.2 M1Leonardo Sandoval GonzalezIN PROGRESS REVIEW1
9661upgrade oe-selftest to python 3normalMedium+2.2 M1Leonardo Sandoval GonzalezIN PROGRESS IMPLEMENTATION3
9249patchwork: test that CVE patches contain the proper formattingnormalMedium+2.2 M1Leonardo Sandoval GonzalezACCEPTED1
9575Test SDK EXT failed on core-image-sato for MIPS architecturecriticalMedium+2.2 M1Robert YangNEW5
9577gen-lockedsig-cache fails when populating sdk ext on PPC architecturenormalMedium+2.2 M1Robert YangNEW3
8570problems with gdk-pixbuf and pango loading on multilibnormalMedium+2.2 M1Robert YangNEW2
8879opkg-utils is built when build lib32-imagemajorMedium+2.2 M1Robert YangIN PROGRESS IMPLEMENTATION5
9474epiphany doesn't work on ARMnormalMedium+2.2 M1Robert YangIN PROGRESS REVIEW1
9639cmake-native autodetects libidn-nativenormalMedium+2.2 M1Robert YangNEW
9064do_unpack does not wipe old source treemajorMedium+2.2 M1Markus LehtonenIN PROGRESS REVIEW1
9351Issues using bitbake with externalsrc and gitnormalMedium+2.2 M1Markus LehtonenIN PROGRESS REVIEW1
9455When I try to make a new project toaster cries "Fields missing: projectversion"normalMedium+2.2 M1Michael WoodIN PROGRESS IMPLEMENTATION4
9676ToasterTables does not take into account the target when displaying package dependenciesnormalMedium+2.2 M1Michael WoodNEW
9038extensible sdk - generates empty manifests/needs file with what is installednormalMedium+2.2 M1Paul EggletonNEW2
9083Extensible SDK: SDK installation ERROR: Unexpected tasks left over to be executednormalMedium+2.2 M1Paul EggletonACCEPTED1
9177Failed to install jethro eSDK image from AutobuildermajorMedium+2.2 M1Paul EggletonNEW1
9626ERROR: core-image-sato-1.0-r0 do_testsdkext: Couldn't install the SDK EXT:normalMedium+2.2 M1Paul EggletonNEW
9317pseudo: incorrect xattr semantic for hardlinksnormalMedium+2.2 M1SeebsACCEPTED
8616arm64's multilib SDK is brokenmajorMedium+2.2 M1Chen QiIN PROGRESS REVIEW3
8642The "32" is a broken symlink in aarch64's mutilib SDKnormalMedium+2.2 M1Chen QiACCEPTED3
9608pkg-config 0.29 compilation error after gcc update (5.3 -> 6.1)criticalMedium+2.2 M1Khem RajIN PROGRESS REVIEW
9659hidden symbol pthread_atforkmajorMedium+2.2 M1Khem RajNEW
9555Create Toaster Docker containernormalMedium+2.2 M1Randy WittNEW1.5
9513Failed to install sdk_ext for i686normalMedium+2.2 M1Richard PurdieNEEDINFONIR 05/22
8988test_rpm_query_nonroot (oeqa.runtime.rpm.RpmInstallRemoveTest) - Failed to create new usernormalMedium+2.2 M1Ross BurtonNEWJethro Backport1
9554Add section for on-target debuggingnormalMedium+2.2 M1Ross BurtonNEW2
8273openjade-native doesn't remove from sysroot correctlynormalMedium+2.2 M1Ross BurtonNEW1
8555Reading shlibs providers sometimes failsnormalMedium+2.2 M1Ross BurtonNEW2
9104ffmpeg libraries are missing -dbg packagingnormalMedium+2.2 M1Ross BurtonNEW5
9242Relocate segments in native binaries when restoring from sstatenormalMedium+2.2 M1Ross BurtonNEW3
9281Changing SDK_OS hits warnings unless you wipe tmpnormalMedium+2.2 M1Ross BurtonNEW1
9342Vet subprocess callsnormalMedium+2.2 M1Ross BurtonNEW2
9508cross-localedef-native_2.22 fails to build on aarch64 hostnormalMedium+2.2 M1Ross BurtonIN PROGRESS REVIEW1
9606libjpeg-turbo fail to build with mips64-nf (soft float)normalMedium+2.2 M1Ross BurtonNEW
9655zip/unzip: needs to update SRC_URI failing in checkurinormalMedium+2.2 M1Ross BurtonIN PROGRESS REVIEW
9369Extensible SDK: oe-selftest test does not test that update actually worksnormalMedium+2.2 M1Stephano CetolaIN PROGRESS DESIGN2
8525selftest needs to control distro configurationnormalMedium+2.2 M1Bill RandleACCEPTED10
9632gcc: Security fix CVE-2016-4490normalMedium+2.2 M2Armin KusterNEW
9285Failed to build gobject-introspection for qemumips64 on i686 hostsnormalMedium+2.2 M2Alexander KanavinNEW1
9286Failed to build gst-player for qemuarm64 on Fedora23 i686normalMedium+2.2 M2Alexander KanavinNEW3
7095Can't install kernel-dev and kernel-devsrc togethernormalMedium+2.2 M2Bruce AshfieldIN PROGRESS IMPLEMENTATION4
8210Should be able to restart a crashed vnc servernormalMedium+2.2 M2Beth FlanaganNEW3
8443Builds that failed at the build request stage need a custom dashboardnormalMedium+2.2 M2Elliot SmithIN PROGRESS IMPLEMENTATIONLook at 84403
9475db locking - Nothing happens when you click the "Create custom image" buttonnormalMedium+2.2 M2Elliot SmithIN PROGRESS IMPLEMENTATION20
9667Image types in quick start guide should be appropriate and consistentnormalMedium+2.2 M2Jussi KukkonenNEW
9416rpm: tmpfile creation failsnormalMedium+2.2 M2Markus LehtonenACCEPTED3
9499license.bbclass find_license_files does not process LICENSE_pn variables correctlynormalMedium+2.2 M2Markus LehtonenACCEPTED1
9662patchdir fails silently if no trailing slash is presentnormalMedium+2.2 M2Markus LehtonenNEW
5470bitbake-layers cannot be used with memory resident bitbake runningnormalMedium+2.2 M2Paul EggletonIN PROGRESS IMPLEMENTATION5
8884Locked signature warning is shown even if package can be fetched from SSTATE_MIRRORSnormalMedium+2.2 M2Paul EggletonNEW1
9532useradd / extrausers chain pseudo, causing stack overflows (segfaults)normalMedium+2.2 M2SeebsNEW
9673perl ptest package tries to include generate_uudmap host executablemajorMedium+2.2 M2Renato CaldasIN PROGRESS REVIEW1
8508Remove knowledge of MACHINE from distutils3normalMedium+2.2 M2Ross BurtonNEW3
9287Failed to build nativesdk-glibc for qemumips and qemumips64 on Fedora 23 i686normalMedium+2.2 M2Ross BurtonNEW1
9440SERIAL_CONSOLES_CHECK doesn't work if kernel console name and device node name differnormalMedium+2.2 M2Ross BurtonNEW1
9509Backport binutils bugfix: fix build of webkitgtk4 on aarch64normalMedium+2.2 M2Ross BurtonNEW1
9510gcc-cross-initial parallel make problem / build break (found on aarch64)normalMedium+2.2 M2Ross BurtonNEW2
9566devtool documentation is duplicated in dev and sdk manualsnormalMedium+2.2 M2Scott RifenbarkNEW
9491Enable explicit removal of support packages when not needednormalMedium+2.2 M2Stephano CetolaACCEPTED
7828Impossible to add a new image type in ToasternormalMedium+2.2 M2Sujith HACCEPTEDGUI design available4
9133Eclipse plugin testing integrate into ABnormalMedium+2.2 M3Aníbal LimónNEW5
5319Need a test to verify firstboot postinst script ordernormalMedium+2.2 M3Jose Perez CNEW43
9620Update layer index to django 1.8 ltsnormalMedium+2.2 M4Elliot SmithNEW5
8576QemuRunner logging for qemu start failure does not log anything to the console in oe-selftestmajorMedium+2.2 M4Jose Perez CNEW2
8578opkg-make-index skips some packages so the package index is not up to date during rootfs generationnormalMedium+2.2 M4Robert YangNEW5
8435some layers have duplicate entries for recipesnormalMedium+FuturePaul EggletonNEW1
94701.8.1. documentation missing from the websitenormalMedium+Q2Michael HalsteadNEW
9522Documentation isn't cachablenormalMedium+Q2Michael HalsteadACCEPTED
9558Documentation for 1.7.3 is missingnormalMedium+Q2Michael HalsteadNEW
 107       

Medium+ Enhancements

IDSummary (125 tasks) SeverityPMilestoneAssigneeStatusWhiteboardE
6238delete projects/builds through the toaster UIenhancementMedium+2.2Belen Barros PenaNEWGUI design pending2
6319Automated storage and graphing of build performance metricsenhancementMedium+2.2Benjamin EsquivelNEW5
8563Improve detection and presentation of build artifactsenhancementMedium+2.2Elliot SmithNEW5
9023Improve the content of the "other artifacts" sectionenhancementMedium+2.2Elliot SmithNEWGUI design pending4
9631add state Transitions to progress bar as well as build progress.enhancementMedium+2.2Elliot SmithNEWGUI design pending10
6362Runtime machine configurationenhancementMedium+2.2Jianxun ZhangACCEPTED10
8482Support multi-nodes interoperability testingenhancementMedium+2.2jingwangNEW
9184Cannot delete layer from toaster databaseenhancementMedium+2.2Michael WoodNEWGUI design pending
3433Create Interactive bitbake commandline modeenhancementMedium+2.2Richard PurdieNEW15
7555make oe-init-build-env-memres default for 2.2enhancementMedium+2.2Richard PurdieNEW3
8318Avoid unnecessary package feed churn due to packages rebuildingenhancementMedium+2.2Stephano CetolaACCEPTED4
4209Extend our developer experience to enable system and app development on Windows or MacOSenhancementMedium+2.2Tim OrlingNEWThis is a placeholder bug for Eclipse for non Linux platform bug, the estimate will be reflected in the blocking bugs25
7820Replace Hob with Toaster in EclipseenhancementMedium+2.2Tim OrlingIN PROGRESS IMPLEMENTATION10
8640Remove vala from oe-core?enhancementMedium+2.2 M1Alexander KanavinACCEPTED2
9132Toaster integrate testing into AB/buildbotenhancementMedium+2.2 M1Aníbal LimónIN PROGRESS IMPLEMENTATION5
8773refactor yocto-kernel-cache common-pc / intel-common scc/cfg file to reduce delta & overlapenhancementMedium+2.2 M1California SullivanACCEPTED11
7561Port beaglebone BSP to use xf86-video-modesettingsenhancementMedium+2.2 M1Plauchu EdwinIN PROGRESS REVIEW1
9335[Autobuilder] Add support for display bitbake log errors in buildbot pageenhancementMedium+2.2 M1Beth FlanaganIN PROGRESS DESIGN4
9450Add automated runtime tests that use the musl libc rather than glibcenhancementMedium+2.2 M1Beth FlanaganNEW2
9563yocto-kernel script should use argparse instead of optparse libraryenhancementMedium+2.2 M1Humberto IbarraACCEPTED5
9564yocto-layer script should use argparse instead of optparse libraryenhancementMedium+2.2 M1Humberto IbarraACCEPTED5
9635buildhistory-diff script should use argparse instead of optparse libraryenhancementMedium+2.2 M1Humberto IbarraACCEPTED5
9636wic script should use argparse instead of optparse libraryenhancementMedium+2.2 M1Humberto IbarraACCEPTED5
8761[RMC]: Handle machine specific kernel command line differencesenhancementMedium+2.2 M1Jianxun ZhangIN PROGRESS IMPLEMENTATION15
9292Update Graphic recipes with candidate versions in planned Graphic Stack 2016Q1 ReleaseenhancementMedium+2.2 M1Jianxun ZhangACCEPTED0.1
8530runexported.py parameter support for: -m <machine arch>enhancementMedium+2.2 M1jingwangIN PROGRESS IMPLEMENTATION1
8531runexported.py parameter support for: -f <manifest>enhancementMedium+2.2 M1jingwangNEW
8533runexported.py parameter support for: -x <xunit>enhancementMedium+2.2 M1jingwangNEW
7654patchwork: ensure superseded patches are marked as suchenhancementMedium+2.2 M1Jose LamegoIN PROGRESS IMPLEMENTATION2
8704patchwork: support history tracking of patch statusenhancementMedium+2.2 M1Jose LamegoIN PROGRESS REVIEW3
8714Patchwork frontend page for incoming patch testingenhancementMedium+2.2 M1Jose LamegoNEWGUI design pending6
8715Update patchwork / build status page on patch test build completionenhancementMedium+2.2 M1Jose LamegoACCEPTED2
8716Build summary page for incoming patch testingenhancementMedium+2.2 M1Jose LamegoNEWGUI design pending4
8717patchwork: keep build page up-to-date with important patch status changesenhancementMedium+2.2 M1Jose LamegoNEW2
9449[meta-swupd] Add libarchive backend to swupd-server to improve runtime of do_swupd_updateenhancementMedium+2.2 M1Joshua LockNEW5
9493Support dummy/empty bundlesenhancementMedium+2.2 M1Joshua LockIN PROGRESS IMPLEMENTATION1
9527Implement initial support for a stateless OSenhancementMedium+2.2 M1Joshua LockNEW10
9599Reduce bundle overheads by not depending on os-core when generating bundle sysrootsenhancementMedium+2.2 M1Joshua LockIN PROGRESS IMPLEMENTATION4
3169Implement Shuku proposalenhancementMedium+2.2 M1Jussi KukkonenIN PROGRESS IMPLEMENTATION15
9244patchtest-oe: Create tests to validate recipes, classes or config filesenhancementMedium+2.2 M1Leonardo Sandoval GonzalezACCEPTED5
9401patchtest: show assertion messages on summaryenhancementMedium+2.2 M1Leonardo Sandoval GonzalezACCEPTED1
9403patchtest-oe: show the solution on the assertion messageenhancementMedium+2.2 M1Leonardo Sandoval GonzalezACCEPTED1
8880Need better allarch multilib sanity or automated QA testsenhancementMedium+2.2 M1Robert YangNEW5
9454improve on why a recipe is builtenhancementMedium+2.2 M1Robert YangNEW10
7850Handle native and target test dependency binaries in build test and export testenhancementMedium+2.2 M1Mariano LopezIN PROGRESS DESIGN10
8384Exported tests needs a test suiteenhancementMedium+2.2 M1Mariano LopezNEW2
8478Decoupling export test with Yocto build environmentenhancementMedium+2.2 M1Mariano LopezIN PROGRESS REVIEW5
8481Generate test tar balls for export testenhancementMedium+2.2 M1Mariano LopezIN PROGRESS REVIEW5
8536support un-extracted package (e.g. rpm) as one type of test binariesenhancementMedium+2.2 M1Mariano LopezIN PROGRESS REVIEW5
8694Add support for multiple binaries in one testenhancementMedium+2.2 M1Mariano LopezIN PROGRESS REVIEW5
9432Add test for exported test functionalityenhancementMedium+2.2 M1Mariano LopezNEW3
9675Replacing/updating smartpm/createrepoenhancementMedium+2.2 M1Mark HatleNEW
8974Add eSDK benchmarkingenhancementMedium+2.2 M1Markus LehtonenNEW2
9377Enable automated build performance testing in AutobuilderenhancementMedium+2.2 M1Markus LehtonenACCEPTED
9623Rewrite build-perf-test.sh in pythonenhancementMedium+2.2 M1Markus LehtonenNEW4
9624build-perf-test: store test results in GitenhancementMedium+2.2 M1Markus LehtonenNEW
9625build-perf-test: re-organize test output dataenhancementMedium+2.2 M1Markus LehtonenNEW
6432Document an example SDK usage workflowenhancementMedium+2.2 M1Paul EggletonACCEPTED2
6437Document how to set up the Yocto Project for production workenhancementMedium+2.2 M1Paul EggletonACCEPTED2
8657extensible SDK: improve handling for sanity checksenhancementMedium+2.2 M1Paul EggletonNEW1
9537recipetool: support node.js code outside of npmenhancementMedium+2.2 M1Paul EggletonNEW
9004Produce container image providing extensible SDKenhancementMedium+2.2 M1Randy WittNEW4
9502Add a way to build container images using oe-coreenhancementMedium+2.2 M1Randy WittNEW3
9589Create a script for consuming a "build descriptor"enhancementMedium+2.2 M1Randy WittNEW5.34
2398make bitbake work using python 3.xenhancementMedium+2.2 M1Richard PurdieIN PROGRESS IMPLEMENTATION
5534Bitbake resident server autoloading/unloadingenhancementMedium+2.2 M1Richard PurdieACCEPTED3
8554Support for self-contained "baremetal" CPU meta-layersenhancementMedium+2.2 M1Richard PurdieNEW3
9037Consider alternate methods for maintain Yocto releases after 1yrenhancementMedium+2.2 M1Richard PurdieNEW1
9255Allow rootfs tasks to run in parallel with rpmenhancementMedium+2.2 M1Richard PurdieNEW0.5
4634BitBake default 'dirs' in exec_func (${B}) causes build failuresenhancementMedium+2.2 M1Ross BurtonNEW5
8548Document best practises/style guide for selftest tests and update testsenhancementMedium+2.2 M1Ross BurtonNEW2
9261Can't distinguish between delayed and failed postinstenhancementMedium+2.2 M1Ross BurtonNEW3
9481Add example to "5.23. Debugging With the GNU Project Debugger (GDB) Remotely"enhancementMedium+2.2 M1Scott RifenbarkNEW
8532runexported.py parameter support for: -a <tag>enhancementMedium+2.2 M1Bill RandleACCEPTED15
8534need export manifest files to SDK package under /conf/test/ folders of every layerenhancementMedium+2.2 M1Bill RandleIN PROGRESS REVIEW15
8535export the test scripts under all layers' ./lib/oeqaenhancementMedium+2.2 M1Bill RandleIN PROGRESS REVIEW15
8724Automate information collection for runtime errorsenhancementMedium+2.2 M1Bill RandleIN PROGRESS DESIGN410
6945kernel-dev: multiple kernel buildenhancementMedium+2.2 M1He ZheIN PROGRESS REVIEW4
8480Extendable structure for test controller to support kinds of image flash methods and communication methods with DUTenhancementMedium+2.2 M2Aníbal LimónNEW7
8962AUH: Add support for meta-intelenhancementMedium+2.2 M2Aníbal LimónNEW3
9088Extensible SDK add tests for devtoolenhancementMedium+2.2 M2Aníbal LimónNEW3
9090extensible sdk test compatibility with sdkenhancementMedium+2.2 M2Aníbal LimónNEW1
9299Enable Tracing boot and process times in testing imagesenhancementMedium+2.2 M2Aníbal LimónNEW5
9466enhance kernel configuration audit to include reasons for missing configs, and required config checkingenhancementMedium+2.2 M2Bruce AshfieldIN PROGRESS DESIGN COMPLETE7
9460Provide a way to automate testing of meta-mingw and meta-darwin layers.enhancementMedium+2.2 M2Beth FlanaganNEW3
9439Verify that the REST API works with httpsenhancementMedium+2.2 M2Elliot SmithIN PROGRESS REVIEW1
8938oe-selftest: refactor command line arguments so usage is simplerenhancementMedium+2.2 M2Humberto IbarraACCEPTED3
4527create a Runtime performance test layer to enable runtime performance testsenhancementMedium+2.2 M2Jose Perez CNEW3
5369Create test plan to do performance analysis of x32 runtimeenhancementMedium+2.2 M2Jose Perez CNEW3
8699offer a way to use sstate-object hashes as dependencies of builds/packagesenhancementMedium+2.2 M2Joshua LockACCEPTED4
9448Add mechanism for running image level QA checksenhancementMedium+2.2 M2Joshua LockACCEPTED1
9538Review common security hardening flags and expand security_flags.incenhancementMedium+2.2 M2Joshua LockNEW10
9556The EFI bootloaders should deploy startup.nsh for wicenhancementMedium+2.2 M2Christopher LarsonIN PROGRESS REVIEW
9391refactor syslinux.bbclass, grub-efi.bbclass and gummiboot.bbclassenhancementMedium+2.2 M2Robert YangNEW10
7515Add CVE testing toolenhancementMedium+2.2 M2Mariano LopezIN PROGRESS REVIEW10
9515update-rcd class should add build dependencies if requiredenhancementMedium+2.2 M2Mariano LopezNEW1
9338Support building optimised Python (with profile-opt make target)enhancementMedium+2.2 M2Markus LehtonenNEW
8489Update DirectFB to git?enhancementMedium+2.2 M2Maxin B. JohnNEW1
9519Consolidate used API into it's own viewenhancementMedium+2.2 M2Michael WoodNEW
7683Provide means of turning a recipe change into a bbappendenhancementMedium+2.2 M2Paul EggletonNEW4
9361Failed to reconfigure a project in Eclipse with eSDKenhancementMedium+2.2 M2Paul EggletonNEW3
9387Extensible SDK: add image customisation functionalityenhancementMedium+2.2 M2Paul EggletonNEW5
9613Extensible SDK: Improve perceived performance of preparation during installenhancementMedium+2.2 M2Paul EggletonNEW
6428Improve the ability to isolate changes that have caused a rebuildenhancementMedium+2.2 M2Richard PurdieNEW5
6803Comprehensive large file supportenhancementMedium+2.2 M2Ross BurtonNEW5
8179It should be possible to disable kernel features using config fragmentsenhancementMedium+2.2 M3Bruce AshfieldIN PROGRESS IMPLEMENTATION10
4144Runtime performance testingenhancementMedium+2.2 M3Jose Perez CNEW2
4528boot time should be tracked for systemd and SysVinitenhancementMedium+2.2 M3Jose Perez CNEW2
5477Check for any performance degradations with gcc security flags enabledenhancementMedium+2.2 M3Jose Perez CIN PROGRESS IMPLEMENTATION2
5478test build time performance degradations with gcc security flags enabledenhancementMedium+2.2 M3Jose Perez CIN PROGRESS IMPLEMENTATION2
6296Add support for runtime performance tests to image_testsenhancementMedium+2.2 M3Jose Perez CNEW2
6359Include QA tests for kernel-dev manual tasksenhancementMedium+2.2 M3Jose Perez CNEW10
8433Add test for package postinstsenhancementMedium+2.2 M3Leonardo Sandoval GonzalezNEW4
8132Implement deleting custom imagesenhancementMedium+2.2 M3Michael WoodNEWGUI design available4
6707Add ptest for curlenhancementMedium+2.2 M3Ross BurtonNEW3
6862input subsystem testingenhancementMedium+2.2 M3Ross BurtonNEW5
8584Enable building API documentationenhancementMedium+2.2 M3Ross BurtonNEW10
8851Add bashism checks for shell script functionsenhancementMedium+2.2 M3Ross BurtonIN PROGRESS IMPLEMENTATION5
7376oe-selftest doesn't run lib/oe/tests/*enhancementMedium+2.2 M4Jose Perez CIN PROGRESS DESIGN3
6640Customise BitBake and layer versions in a projectenhancementMedium+2.3Belen Barros PenaNEWGUI design pending7
8493Automate manual BSP test casesenhancementMedium+2.3Leonardo Sandoval GonzalezNEW5
8505Add Bluetooth testing suiteenhancementMedium+2.3Leonardo Sandoval GonzalezNEW5
8506Add WiFi testing suiteenhancementMedium+2.3Leonardo Sandoval GonzalezNEW5
8507Add NFC testing suiteenhancementMedium+2.3Leonardo Sandoval GonzalezNEW5
4284Presenting information provided by the diffsigs toolenhancementMedium+FutureUnassignedNEW5
 125       

High Enhancements/Bugs

IDSummary (21 tasks) SeverityPMilestoneAssigneeStatusWhiteboardE
7583Gather and allow reporting all types of errors, not just task failuresenhancementHigh2.2 M1Aníbal LimónIN PROGRESS DESIGNGUI desing pending5
9293bitbake: Add support for trigger event on errors like exceptionsenhancementHigh2.2 M1Aníbal LimónIN PROGRESS IMPLEMENTATION5
9517Move to Bootstrap 3enhancementHigh2.2 M1Belen Barros PenaNEW
9559test reporting tool planenhancementHigh2.2 M1Benjamin EsquivelNEW5
9394bootstrap v2 License is not compatible with bitbake/toaster license.criticalHigh2.2 M1brian averyNEW
9298Autobuilder enable KVM on the cluster for x86, x86-64enhancementHigh2.2 M1Beth FlanaganNEW4.5
9581CVE-2016-2107, CVE-2016-2108, CVE-2016-2105, CVE-2016-2106, CVE-2016-2109, CVE-2016-2176majorHigh2.2 M1Jussi KukkonenIN PROGRESS REVIEW
9457patchtest: security check on incoming patchesenhancementHigh2.2 M1Leonardo Sandoval GonzalezACCEPTED5
9131Prelink breaks fork IFUNCmajorHigh2.2 M1Mark HatleIN PROGRESS IMPLEMENTATION10
4078A method to validate the contents of changes to recipes, configuration files and classesenhancementHigh2.2 M1Michael HalsteadNEWNIR 04/24, 05/01, 05/085
4431Set up buildhistory-web for autobuilderenhancementHigh2.2 M1Michael HalsteadACCEPTED3
7658patchwork: provide means of recording additional patch statusesenhancementHigh2.2 M1Michael HalsteadNEWNIR 04/24, 05/01, 05/084
8648Automatic testing of incoming patchesenhancementHigh2.2 M1Michael HalsteadNEWNIR 04/24, 05/01, 05/0810
8649Script to assemble patches for autobuilder testingenhancementHigh2.2 M1Michael HalsteadNEWNIR 04/24, 05/01, 05/0815
9130Update OE patchwork instanceenhancementHigh2.2 M1Michael HalsteadACCEPTED
9112pseudo connection startup/reworkenhancementHigh2.2 M1SeebsNEW
9588Create a method for describing builds and desired output. aka a build descriptorenhancementHigh2.2 M1Randy WittNEW5
9592Add a mechanism for creating build appliance as a container imageenhancementHigh2.2 M1Randy WittNEW4
7518Build multiple machines in the same bitbake invocationenhancementHigh2.2 M1Richard PurdieNEW15
9383Move to LSB 5enhancementHigh2.2 M2Ross BurtonNEW3
8647Script to analyse what areas a patch changes and what tests need runningenhancementHigh2.2 M3Leonardo Sandoval GonzalezACCEPTED13
 21       

Medium+ Bugs and Enhancements by Owner !(Future, 2.3)

IDSummary (225 tasks) SeverityPMilestoneAssigneeStatusWhiteboardE
 0       
Armin Kuster
8487PTEST image does not install on hdd on 1.8.1normalMedium+1.7.4Armin KusterIN PROGRESS IMPLEMENTATION1
7641CVE-2014-9365 python: failure to validate certificates in the HTTP client with TLS (PEP 476)normalMedium+1.7.4Armin KusterACCEPTED5
9632gcc: Security fix CVE-2016-4490normalMedium+2.2 M2Armin KusterNEW
 3       
Alejandro Hernandez
8192python3.4.3 os.fork and os.waitpidminorMedium+2.2 M1Alejandro HernandezACCEPTED15
 1       
Alexander Kanavin
8640Remove vala from oe-core?enhancementMedium+2.2 M1Alexander KanavinACCEPTED2
9285Failed to build gobject-introspection for qemumips64 on i686 hostsnormalMedium+2.2 M2Alexander KanavinNEW1
9286Failed to build gst-player for qemuarm64 on Fedora23 i686normalMedium+2.2 M2Alexander KanavinNEW3
 3       
Aníbal Limón
8142avahi daemon fails to start on systemd while testing core-image-satonormalMedium+2.2 M1Aníbal LimónACCEPTED5
8771test_smart_channel_add (oeqa.runtime.smart.SmartRepoTest) failed in AutobuildernormalMedium+2.2 M1Aníbal LimónIN PROGRESS DESIGN5
9132Toaster integrate testing into AB/buildbotenhancementMedium+2.2 M1Aníbal LimónIN PROGRESS IMPLEMENTATION5
8480Extendable structure for test controller to support kinds of image flash methods and communication methods with DUTenhancementMedium+2.2 M2Aníbal LimónNEW7
9088Extensible SDK add tests for devtoolenhancementMedium+2.2 M2Aníbal LimónNEW3
9090extensible sdk test compatibility with sdkenhancementMedium+2.2 M2Aníbal LimónNEW1
8962AUH: Add support for meta-intelenhancementMedium+2.2 M2Aníbal LimónNEW3
9299Enable Tracing boot and process times in testing imagesenhancementMedium+2.2 M2Aníbal LimónNEW5
9133Eclipse plugin testing integrate into ABnormalMedium+2.2 M3Aníbal LimónNEW5
 9       
Belen Barros Pena
6238delete projects/builds through the toaster UIenhancementMedium+2.2Belen Barros PenaNEWGUI design pending2
7968empty page states for no information in the databasenormalMedium+2.2Belen Barros PenaNEWGUI design pending5
 2       
Benjamin Esquivel
6319Automated storage and graphing of build performance metricsenhancementMedium+2.2Benjamin EsquivelNEW5
9660Create a YP-2.2 test plan for SWUpdnormalMedium+2.2 M1Benjamin EsquivelNEW
 2       
brian avery
9302Failed to start qemu with toolchain sysrootnormalMedium+2.1.1brian averyNEW
9362Failed to run and debug a project to qemux86 in EclipsenormalMedium+2.1.1brian averyNEW3
9617Create Toaster Docker production containernormalMedium+2.2 M1brian averyNEW1.5
 3       
Bruce Ashfield
1989Default module selections need attentionminorMedium+2.2Bruce AshfieldIN PROGRESS IMPLEMENTATION4
7095Can't install kernel-dev and kernel-devsrc togethernormalMedium+2.2 M2Bruce AshfieldIN PROGRESS IMPLEMENTATION4
9466enhance kernel configuration audit to include reasons for missing configs, and required config checkingenhancementMedium+2.2 M2Bruce AshfieldIN PROGRESS DESIGN COMPLETE7
8179It should be possible to disable kernel features using config fragmentsenhancementMedium+2.2 M3Bruce AshfieldIN PROGRESS IMPLEMENTATION10
 4       
California Sullivan
8773refactor yocto-kernel-cache common-pc / intel-common scc/cfg file to reduce delta & overlapenhancementMedium+2.2 M1California SullivanACCEPTED11
 1       
David Reyna
8037External link to recipe file links to non-existing page when recipe information comes from a buildnormalMedium+2.2David ReynaIN PROGRESS IMPLEMENTATION5
 1       
Ed Bartosh
9584upgrade toaster to Python3normalMedium+2.2 M1Ed BartoshIN PROGRESS IMPLEMENTATION5
 1       
Plauchu Edwin
7561Port beaglebone BSP to use xf86-video-modesettingsenhancementMedium+2.2 M1Plauchu EdwinIN PROGRESS REVIEW1
 1       
Beth Flanagan
9335[Autobuilder] Add support for display bitbake log errors in buildbot pageenhancementMedium+2.2 M1Beth FlanaganIN PROGRESS DESIGN4
9397[Autobuilder] - public WIC buildset artifactsnormalMedium+2.2 M1Beth FlanaganNEW0.5
9450Add automated runtime tests that use the musl libc rather than glibcenhancementMedium+2.2 M1Beth FlanaganNEW2
8210Should be able to restart a crashed vnc servernormalMedium+2.2 M2Beth FlanaganNEW3
9460Provide a way to automate testing of meta-mingw and meta-darwin layers.enhancementMedium+2.2 M2Beth FlanaganNEW3
 5       
Elliot Smith
8440Toaster has some issues when showing builds that fail at the build request stagenormalMedium+2.2Elliot SmithIN PROGRESS REVIEWGUI design available8
8556Toaster: bitbake variables image_fstypes not being passed to build processnormalMedium+2.2Elliot SmithIN PROGRESS IMPLEMENTATION15
8563Improve detection and presentation of build artifactsenhancementMedium+2.2Elliot SmithNEW5
9023Improve the content of the "other artifacts" sectionenhancementMedium+2.2Elliot SmithNEWGUI design pending4
9594Toaster is not showing properly image files for buildsnormalMedium+2.2Elliot SmithNEW
9631add state Transitions to progress bar as well as build progress.enhancementMedium+2.2Elliot SmithNEWGUI design pending10
9439Verify that the REST API works with httpsenhancementMedium+2.2 M2Elliot SmithIN PROGRESS REVIEW1
8443Builds that failed at the build request stage need a custom dashboardnormalMedium+2.2 M2Elliot SmithIN PROGRESS IMPLEMENTATIONLook at 84403
9475db locking - Nothing happens when you click the "Create custom image" buttonnormalMedium+2.2 M2Elliot SmithIN PROGRESS IMPLEMENTATION20
9620Update layer index to django 1.8 ltsnormalMedium+2.2 M4Elliot SmithNEW5
 10       
Francisco Pedraza
9536oe-selftest: test_sstate_noop_samesigs failed due qmmp LICENSE_FLAGS_WHITELISTnormalMedium+2.2 M1Francisco PedrazaNEEDINFO1
 1       
Geoffroy Van Cutsem
9507Misleading error message when conf/bblayers has problemsnormalMedium+2.2 M1Geoffroy Van CutsemIN PROGRESS REVIEW1
 1       
Humberto Ibarra
9353yocto-bsp: script using different kernel than the one given when creating bspnormalMedium+2.0.2Humberto IbarraIN PROGRESS REVIEW0.5
9563yocto-kernel script should use argparse instead of optparse libraryenhancementMedium+2.2 M1Humberto IbarraACCEPTED5
9564yocto-layer script should use argparse instead of optparse libraryenhancementMedium+2.2 M1Humberto IbarraACCEPTED5
9635buildhistory-diff script should use argparse instead of optparse libraryenhancementMedium+2.2 M1Humberto IbarraACCEPTED5
9636wic script should use argparse instead of optparse libraryenhancementMedium+2.2 M1Humberto IbarraACCEPTED5
8938oe-selftest: refactor command line arguments so usage is simplerenhancementMedium+2.2 M2Humberto IbarraACCEPTED3
 6       
Jianxun Zhang
9653Boot and install from USB failed after GRUB black screen is displayedmajorMedium+1.8.2Jianxun ZhangREOPENED
9652boot and install from USB failed getting [sdc] error messagemajorMedium+1.8.3Jianxun ZhangNEW
6362Runtime machine configurationenhancementMedium+2.2Jianxun ZhangACCEPTED10
8761[RMC]: Handle machine specific kernel command line differencesenhancementMedium+2.2 M1Jianxun ZhangIN PROGRESS IMPLEMENTATION15
9292Update Graphic recipes with candidate versions in planned Graphic Stack 2016Q1 ReleaseenhancementMedium+2.2 M1Jianxun ZhangACCEPTED0.1
8245dmesg qa check: fbcon_init: detected unhandled fb_set_par error (timeout case)normalMedium+2.2 M1Jianxun ZhangIN PROGRESS REVIEW0.1
 6       
jingwang
8482Support multi-nodes interoperability testingenhancementMedium+2.2jingwangNEW
8530runexported.py parameter support for: -m <machine arch>enhancementMedium+2.2 M1jingwangIN PROGRESS IMPLEMENTATION1
8531runexported.py parameter support for: -f <manifest>enhancementMedium+2.2 M1jingwangNEW
8533runexported.py parameter support for: -x <xunit>enhancementMedium+2.2 M1jingwangNEW
 4       
Jose Lamego
8715Update patchwork / build status page on patch test build completionenhancementMedium+2.2 M1Jose LamegoACCEPTED2
7654patchwork: ensure superseded patches are marked as suchenhancementMedium+2.2 M1Jose LamegoIN PROGRESS IMPLEMENTATION2
8704patchwork: support history tracking of patch statusenhancementMedium+2.2 M1Jose LamegoIN PROGRESS REVIEW3
8714Patchwork frontend page for incoming patch testingenhancementMedium+2.2 M1Jose LamegoNEWGUI design pending6
8716Build summary page for incoming patch testingenhancementMedium+2.2 M1Jose LamegoNEWGUI design pending4
8717patchwork: keep build page up-to-date with important patch status changesenhancementMedium+2.2 M1Jose LamegoNEW2
 6       
Jose Perez C
4527create a Runtime performance test layer to enable runtime performance testsenhancementMedium+2.2 M2Jose Perez CNEW3
5369Create test plan to do performance analysis of x32 runtimeenhancementMedium+2.2 M2Jose Perez CNEW3
5319Need a test to verify firstboot postinst script ordernormalMedium+2.2 M3Jose Perez CNEW43
6359Include QA tests for kernel-dev manual tasksenhancementMedium+2.2 M3Jose Perez CNEW10
4144Runtime performance testingenhancementMedium+2.2 M3Jose Perez CNEW2
6296Add support for runtime performance tests to image_testsenhancementMedium+2.2 M3Jose Perez CNEW2
4528boot time should be tracked for systemd and SysVinitenhancementMedium+2.2 M3Jose Perez CNEW2
5477Check for any performance degradations with gcc security flags enabledenhancementMedium+2.2 M3Jose Perez CIN PROGRESS IMPLEMENTATION2
5478test build time performance degradations with gcc security flags enabledenhancementMedium+2.2 M3Jose Perez CIN PROGRESS IMPLEMENTATION2
7376oe-selftest doesn't run lib/oe/tests/*enhancementMedium+2.2 M4Jose Perez CIN PROGRESS DESIGN3
8576QemuRunner logging for qemu start failure does not log anything to the console in oe-selftestmajorMedium+2.2 M4Jose Perez CNEW2
 11       
Joshua Lock
9449[meta-swupd] Add libarchive backend to swupd-server to improve runtime of do_swupd_updateenhancementMedium+2.2 M1Joshua LockNEW5
9452[meta-swupd] update to latest swupd and adapt to changesnormalMedium+2.2 M1Joshua LockNEW2
9493Support dummy/empty bundlesenhancementMedium+2.2 M1Joshua LockIN PROGRESS IMPLEMENTATION1
9599Reduce bundle overheads by not depending on os-core when generating bundle sysrootsenhancementMedium+2.2 M1Joshua LockIN PROGRESS IMPLEMENTATION4
9527Implement initial support for a stateless OSenhancementMedium+2.2 M1Joshua LockNEW10
8699offer a way to use sstate-object hashes as dependencies of builds/packagesenhancementMedium+2.2 M2Joshua LockACCEPTED4
9448Add mechanism for running image level QA checksenhancementMedium+2.2 M2Joshua LockACCEPTED1
9538Review common security hardening flags and expand security_flags.incenhancementMedium+2.2 M2Joshua LockNEW10
 8       
Juro Bystricky
7469SDL package cannot be found on OpenSUSE 13.2normalMedium+1.6.4Juro BystrickyIN PROGRESS REVIEW2
 1       
Jussi Kukkonen
9664The old gstreamer1.0-plugins-bad recipe is causing errors and conflictsnormalMedium+2.2 M1Jussi KukkonenNEW
3169Implement Shuku proposalenhancementMedium+2.2 M1Jussi KukkonenIN PROGRESS IMPLEMENTATION15
9667Image types in quick start guide should be appropriate and consistentnormalMedium+2.2 M2Jussi KukkonenNEW
 3       
Christopher Larson
9556The EFI bootloaders should deploy startup.nsh for wicenhancementMedium+2.2 M2Christopher LarsonIN PROGRESS REVIEW
 1       
Kevin Hao
9472[NO USB support ] Beaglebone black latest yoctomajorMedium+2.1.1Kevin HaoIN PROGRESS REVIEW1
 1       
Leonardo Sandoval Gonzalez
9572sudoku-savant tarball not found when SDK testing on core-image-satonormalMedium+2.2 M1Leonardo Sandoval GonzalezACCEPTED1
9573openssh, subversion and ghostscript URLs fail on do_checkuri testnormalMedium+2.2 M1Leonardo Sandoval GonzalezIN PROGRESS REVIEW1
9661upgrade oe-selftest to python 3normalMedium+2.2 M1Leonardo Sandoval GonzalezIN PROGRESS IMPLEMENTATION3
9244patchtest-oe: Create tests to validate recipes, classes or config filesenhancementMedium+2.2 M1Leonardo Sandoval GonzalezACCEPTED5
9249patchwork: test that CVE patches contain the proper formattingnormalMedium+2.2 M1Leonardo Sandoval GonzalezACCEPTED1
9401patchtest: show assertion messages on summaryenhancementMedium+2.2 M1Leonardo Sandoval GonzalezACCEPTED1
9403patchtest-oe: show the solution on the assertion messageenhancementMedium+2.2 M1Leonardo Sandoval GonzalezACCEPTED1
8433Add test for package postinstsenhancementMedium+2.2 M3Leonardo Sandoval GonzalezNEW4
 8       
Robert Yang
9575Test SDK EXT failed on core-image-sato for MIPS architecturecriticalMedium+2.2 M1Robert YangNEW5
9577gen-lockedsig-cache fails when populating sdk ext on PPC architecturenormalMedium+2.2 M1Robert YangNEW3
9454improve on why a recipe is builtenhancementMedium+2.2 M1Robert YangNEW10
8570problems with gdk-pixbuf and pango loading on multilibnormalMedium+2.2 M1Robert YangNEW2
8879opkg-utils is built when build lib32-imagemajorMedium+2.2 M1Robert YangIN PROGRESS IMPLEMENTATION5
8880Need better allarch multilib sanity or automated QA testsenhancementMedium+2.2 M1Robert YangNEW5
9474epiphany doesn't work on ARMnormalMedium+2.2 M1Robert YangIN PROGRESS REVIEW1
9639cmake-native autodetects libidn-nativenormalMedium+2.2 M1Robert YangNEW
9391refactor syslinux.bbclass, grub-efi.bbclass and gummiboot.bbclassenhancementMedium+2.2 M2Robert YangNEW10
8578opkg-make-index skips some packages so the package index is not up to date during rootfs generationnormalMedium+2.2 M4Robert YangNEW5
 10       
Mariano Lopez
8028Garbage in SDK manifest filenormalMedium+2.0.2Mariano LopezIN PROGRESS REVIEW3
9432Add test for exported test functionalityenhancementMedium+2.2 M1Mariano LopezNEW3
7850Handle native and target test dependency binaries in build test and export testenhancementMedium+2.2 M1Mariano LopezIN PROGRESS DESIGN10
8384Exported tests needs a test suiteenhancementMedium+2.2 M1Mariano LopezNEW2
8478Decoupling export test with Yocto build environmentenhancementMedium+2.2 M1Mariano LopezIN PROGRESS REVIEW5
8481Generate test tar balls for export testenhancementMedium+2.2 M1Mariano LopezIN PROGRESS REVIEW5
8536support un-extracted package (e.g. rpm) as one type of test binariesenhancementMedium+2.2 M1Mariano LopezIN PROGRESS REVIEW5
8694Add support for multiple binaries in one testenhancementMedium+2.2 M1Mariano LopezIN PROGRESS REVIEW5
7515Add CVE testing toolenhancementMedium+2.2 M2Mariano LopezIN PROGRESS REVIEW10
9515update-rcd class should add build dependencies if requiredenhancementMedium+2.2 M2Mariano LopezNEW1
 10       
Mark Hatle
7991qemuppc bootup failure with oe-core toolchain (with systemd)normalMedium+2.0.2Mark HatleIN PROGRESS IMPLEMENTATION
9675Replacing/updating smartpm/createrepoenhancementMedium+2.2 M1Mark HatleNEW
 2       
Markus Lehtonen
9377Enable automated build performance testing in AutobuilderenhancementMedium+2.2 M1Markus LehtonenACCEPTED
9623Rewrite build-perf-test.sh in pythonenhancementMedium+2.2 M1Markus LehtonenNEW4
9624build-perf-test: store test results in GitenhancementMedium+2.2 M1Markus LehtonenNEW
9625build-perf-test: re-organize test output dataenhancementMedium+2.2 M1Markus LehtonenNEW
9064do_unpack does not wipe old source treemajorMedium+2.2 M1Markus LehtonenIN PROGRESS REVIEW1
9351Issues using bitbake with externalsrc and gitnormalMedium+2.2 M1Markus LehtonenIN PROGRESS REVIEW1
8974Add eSDK benchmarkingenhancementMedium+2.2 M1Markus LehtonenNEW2
9338Support building optimised Python (with profile-opt make target)enhancementMedium+2.2 M2Markus LehtonenNEW
9416rpm: tmpfile creation failsnormalMedium+2.2 M2Markus LehtonenACCEPTED3
9499license.bbclass find_license_files does not process LICENSE_pn variables correctlynormalMedium+2.2 M2Markus LehtonenACCEPTED1
9662patchdir fails silently if no trailing slash is presentnormalMedium+2.2 M2Markus LehtonenNEW
 11       
Maxin B. John
8078useradd.bbclass: useradd_preinst not run when rebuilding on second MACHINEmajorMedium+2.2Maxin B. JohnACCEPTED3
8489Update DirectFB to git?enhancementMedium+2.2 M2Maxin B. JohnNEW1
 2       
Michael Wood
8952Changes to the revision of an imported layer are not savednormalMedium+2.2Michael WoodNEW
9184Cannot delete layer from toaster databaseenhancementMedium+2.2Michael WoodNEWGUI design pending
9455When I try to make a new project toaster cries "Fields missing: projectversion"normalMedium+2.2 M1Michael WoodIN PROGRESS IMPLEMENTATION4
9676ToasterTables does not take into account the target when displaying package dependenciesnormalMedium+2.2 M1Michael WoodNEW
9519Consolidate used API into it's own viewenhancementMedium+2.2 M2Michael WoodNEW
8132Implement deleting custom imagesenhancementMedium+2.2 M3Michael WoodNEWGUI design available4
 6       
Michael Halstead
94701.8.1. documentation missing from the websitenormalMedium+Q2Michael HalsteadNEW
9522Documentation isn't cachablenormalMedium+Q2Michael HalsteadACCEPTED
9558Documentation for 1.7.3 is missingnormalMedium+Q2Michael HalsteadNEW
 3       
Otavio Salvador
8092Implementation of the function glXChooseFBConfig in the libGL.so does not match OpenGL documentationnormalMedium+2.0.2Otavio SalvadorWaitForUpstream
 1       
Paul Eggleton
6432Document an example SDK usage workflowenhancementMedium+2.2 M1Paul EggletonACCEPTED2
6437Document how to set up the Yocto Project for production workenhancementMedium+2.2 M1Paul EggletonACCEPTED2
8657extensible SDK: improve handling for sanity checksenhancementMedium+2.2 M1Paul EggletonNEW1
9038extensible sdk - generates empty manifests/needs file with what is installednormalMedium+2.2 M1Paul EggletonNEW2
9083Extensible SDK: SDK installation ERROR: Unexpected tasks left over to be executednormalMedium+2.2 M1Paul EggletonACCEPTED1
9177Failed to install jethro eSDK image from AutobuildermajorMedium+2.2 M1Paul EggletonNEW1
9537recipetool: support node.js code outside of npmenhancementMedium+2.2 M1Paul EggletonNEW
9626ERROR: core-image-sato-1.0-r0 do_testsdkext: Couldn't install the SDK EXT:normalMedium+2.2 M1Paul EggletonNEW
5470bitbake-layers cannot be used with memory resident bitbake runningnormalMedium+2.2 M2Paul EggletonIN PROGRESS IMPLEMENTATION5
8884Locked signature warning is shown even if package can be fetched from SSTATE_MIRRORSnormalMedium+2.2 M2Paul EggletonNEW1
7683Provide means of turning a recipe change into a bbappendenhancementMedium+2.2 M2Paul EggletonNEW4
9361Failed to reconfigure a project in Eclipse with eSDKenhancementMedium+2.2 M2Paul EggletonNEW3
9387Extensible SDK: add image customisation functionalityenhancementMedium+2.2 M2Paul EggletonNEW5
9613Extensible SDK: Improve perceived performance of preparation during installenhancementMedium+2.2 M2Paul EggletonNEW
 14       
Seebs
9317pseudo: incorrect xattr semantic for hardlinksnormalMedium+2.2 M1SeebsACCEPTED
9532useradd / extrausers chain pseudo, causing stack overflows (segfaults)normalMedium+2.2 M2SeebsNEW
 2       
Chen Qi
8616arm64's multilib SDK is brokenmajorMedium+2.2 M1Chen QiIN PROGRESS REVIEW3
8642The "32" is a broken symlink in aarch64's mutilib SDKnormalMedium+2.2 M1Chen QiACCEPTED3
 2       
Khem Raj
9608pkg-config 0.29 compilation error after gcc update (5.3 -> 6.1)criticalMedium+2.2 M1Khem RajIN PROGRESS REVIEW
9659hidden symbol pthread_atforkmajorMedium+2.2 M1Khem RajNEW
 2       
Randy Witt
9004Produce container image providing extensible SDKenhancementMedium+2.2 M1Randy WittNEW4
9502Add a way to build container images using oe-coreenhancementMedium+2.2 M1Randy WittNEW3
9589Create a script for consuming a "build descriptor"enhancementMedium+2.2 M1Randy WittNEW5.34
9555Create Toaster Docker containernormalMedium+2.2 M1Randy WittNEW1.5
 4       
Richard Purdie
3433Create Interactive bitbake commandline modeenhancementMedium+2.2Richard PurdieNEW15
7555make oe-init-build-env-memres default for 2.2enhancementMedium+2.2Richard PurdieNEW3
2398make bitbake work using python 3.xenhancementMedium+2.2 M1Richard PurdieIN PROGRESS IMPLEMENTATION
5534Bitbake resident server autoloading/unloadingenhancementMedium+2.2 M1Richard PurdieACCEPTED3
8554Support for self-contained "baremetal" CPU meta-layersenhancementMedium+2.2 M1Richard PurdieNEW3
9255Allow rootfs tasks to run in parallel with rpmenhancementMedium+2.2 M1Richard PurdieNEW0.5
9037Consider alternate methods for maintain Yocto releases after 1yrenhancementMedium+2.2 M1Richard PurdieNEW1
9513Failed to install sdk_ext for i686normalMedium+2.2 M1Richard PurdieNEEDINFONIR 05/22
6428Improve the ability to isolate changes that have caused a rebuildenhancementMedium+2.2 M2Richard PurdieNEW5
 9       
Renato Caldas
9673perl ptest package tries to include generate_uudmap host executablemajorMedium+2.2 M2Renato CaldasIN PROGRESS REVIEW1
 1       
Ross Burton
8548Document best practises/style guide for selftest tests and update testsenhancementMedium+2.2 M1Ross BurtonNEW2
8988test_rpm_query_nonroot (oeqa.runtime.rpm.RpmInstallRemoveTest) - Failed to create new usernormalMedium+2.2 M1Ross BurtonNEWJethro Backport1
4634BitBake default 'dirs' in exec_func (${B}) causes build failuresenhancementMedium+2.2 M1Ross BurtonNEW5
9554Add section for on-target debuggingnormalMedium+2.2 M1Ross BurtonNEW2
8273openjade-native doesn't remove from sysroot correctlynormalMedium+2.2 M1Ross BurtonNEW1
8555Reading shlibs providers sometimes failsnormalMedium+2.2 M1Ross BurtonNEW2
9104ffmpeg libraries are missing -dbg packagingnormalMedium+2.2 M1Ross BurtonNEW5
9242Relocate segments in native binaries when restoring from sstatenormalMedium+2.2 M1Ross BurtonNEW3
9261Can't distinguish between delayed and failed postinstenhancementMedium+2.2 M1Ross BurtonNEW3
9281Changing SDK_OS hits warnings unless you wipe tmpnormalMedium+2.2 M1Ross BurtonNEW1
9342Vet subprocess callsnormalMedium+2.2 M1Ross BurtonNEW2
9508cross-localedef-native_2.22 fails to build on aarch64 hostnormalMedium+2.2 M1Ross BurtonIN PROGRESS REVIEW1
9606libjpeg-turbo fail to build with mips64-nf (soft float)normalMedium+2.2 M1Ross BurtonNEW
9655zip/unzip: needs to update SRC_URI failing in checkurinormalMedium+2.2 M1Ross BurtonIN PROGRESS REVIEW
6803Comprehensive large file supportenhancementMedium+2.2 M2Ross BurtonNEW5
8508Remove knowledge of MACHINE from distutils3normalMedium+2.2 M2Ross BurtonNEW3
9287Failed to build nativesdk-glibc for qemumips and qemumips64 on Fedora 23 i686normalMedium+2.2 M2Ross BurtonNEW1
9440SERIAL_CONSOLES_CHECK doesn't work if kernel console name and device node name differnormalMedium+2.2 M2Ross BurtonNEW1
9509Backport binutils bugfix: fix build of webkitgtk4 on aarch64normalMedium+2.2 M2Ross BurtonNEW1
9510gcc-cross-initial parallel make problem / build break (found on aarch64)normalMedium+2.2 M2Ross BurtonNEW2
6862input subsystem testingenhancementMedium+2.2 M3Ross BurtonNEW5
6707Add ptest for curlenhancementMedium+2.2 M3Ross BurtonNEW3
8584Enable building API documentationenhancementMedium+2.2 M3Ross BurtonNEW10
8851Add bashism checks for shell script functionsenhancementMedium+2.2 M3Ross BurtonIN PROGRESS IMPLEMENTATION5
 24       
Saul Wold
9654Ogg media file audio is not working on NUC and MMaxnormalMedium+1.8.3Saul WoldNEW
9520test_parselogs failed on udevd[342] inotify_add_watch /dev/loop when running test imagenormalMedium+2.1.1Saul WoldNEW
 2       
Scott Rifenbark
9481Add example to "5.23. Debugging With the GNU Project Debugger (GDB) Remotely"enhancementMedium+2.2 M1Scott RifenbarkNEW
9566devtool documentation is duplicated in dev and sdk manualsnormalMedium+2.2 M2Scott RifenbarkNEW
 2       
Stephano Cetola
8318Avoid unnecessary package feed churn due to packages rebuildingenhancementMedium+2.2Stephano CetolaACCEPTED4
9369Extensible SDK: oe-selftest test does not test that update actually worksnormalMedium+2.2 M1Stephano CetolaIN PROGRESS DESIGN2
9491Enable explicit removal of support packages when not needednormalMedium+2.2 M2Stephano CetolaACCEPTED
 3       
Sujith H
7828Impossible to add a new image type in ToasternormalMedium+2.2 M2Sujith HACCEPTEDGUI design available4
 1       
Tim Orling
9105[MARS] Cannot install eclipse-poky pluginnormalMedium+2.1.1Tim OrlingIN PROGRESS IMPLEMENTATION1.5
4209Extend our developer experience to enable system and app development on Windows or MacOSenhancementMedium+2.2Tim OrlingNEWThis is a placeholder bug for Eclipse for non Linux platform bug, the estimate will be reflected in the blocking bugs25
7820Replace Hob with Toaster in EclipseenhancementMedium+2.2Tim OrlingIN PROGRESS IMPLEMENTATION10
 3       
Tom Zanussi
9124Location of kernel sources is incorrectnormalMedium+2.2Tom ZanussiIN PROGRESS REVIEW2
 1       
Bill Randle
8525selftest needs to control distro configurationnormalMedium+2.2 M1Bill RandleACCEPTED10
8532runexported.py parameter support for: -a <tag>enhancementMedium+2.2 M1Bill RandleACCEPTED15
8534need export manifest files to SDK package under /conf/test/ folders of every layerenhancementMedium+2.2 M1Bill RandleIN PROGRESS REVIEW15
8535export the test scripts under all layers' ./lib/oeqaenhancementMedium+2.2 M1Bill RandleIN PROGRESS REVIEW15
8724Automate information collection for runtime errorsenhancementMedium+2.2 M1Bill RandleIN PROGRESS DESIGN410
 5       
ytao
8877WebKitGTK+ Security AdvisoriesnormalMedium+2.0.2ytaoNEW
 1       
He Zhe
6945kernel-dev: multiple kernel buildenhancementMedium+2.2 M1He ZheIN PROGRESS REVIEW4
 1       

Medium Bugs and Enhancements by Owner !(Future, 2.3)

IDSummary (370 tasks) SeverityPMilestoneAssigneeStatusWhiteboardE
 0       
Armin Kuster
9601meta-qt5 Krogoth Branch Building Error During 'do_qa_staging'normalMedium2.1.1Armin KusterNEW
 1       
Alejandro Hernandez
8613udev-extraconf: automount does not work with systemd >= 219normalMedium1.8.3Alejandro HernandezIN PROGRESS REVIEWCheck 2.0 also
8397ROOTLESS_X should be used as default for Poky BSPnormalMedium2.2 M1Alejandro HernandezACCEPTED3
7254PATCHRESOLVE's devshell opens up multiple new terminalsminorMedium2.2 M3Alejandro HernandezIN PROGRESS DESIGN7
8730separate code generating python manifest file from manifest information and improve the manifest generationnormalMedium2.2 M3Alejandro HernandezNEW4
 4       
Alexander Kanavin
6020should libmad be replaced with libmpg123 as the default mp3 decoder?enhancementMedium2.2Alexander KanavinNEW5
9212rework oe-core's handling of python and sysrootsnormalMedium2.2Alexander KanavinNEW10
9486security_flags.inc has many exception packages compiled without -PIE security flagnormalMedium2.2Alexander KanavinNEW5
9489security_flags.inc has exception packages compiled without any -fstack-protectornormalMedium2.2Alexander KanavinNEW5
 4       
Alexandru Roman
9484Port QA UI tests to Toaster's Django+Selenium frameworknormalMedium2.2 M1Alexandru RomanNEW25
 1       
Aníbal Limón
8667populate_sdk task fails when Debian packaging used in FIDOnormalMedium1.8.3Aníbal LimónACCEPTED3
9349Jethro build fails for core-image-x11 with package_debnormalMedium2.0.2Aníbal LimónIN PROGRESS DESIGN2
9017Sync and Upgrade AB configurationenhancementMedium2.2 M1Aníbal LimónNEW4
8727fetcher: should not log errors but pass them for handlingnormalMedium2.2 M2Aníbal LimónNEW2
9602Run automated tests on alternative C librariesnormalMedium2.2 M2Aníbal LimónNEW2
7557distrodata/distro_check should use BPNenhancementMedium2.2 M2Aníbal LimónNEW2
7588devtool: improve devtool build outputenhancementMedium2.2 M2Aníbal LimónNEW5
8156lib/bb/fetch2/svn.py should support latest_versionstring()enhancementMedium2.2 M3Aníbal LimónNEW1
7494AUH: Parallelize running bitbake inside AUH scriptenhancementMedium2.2 M3Aníbal LimónNEW5
8735AUH: Use tinfoil instead of parse the recipe itselfenhancementMedium2.2 M3Aníbal LimónNEW5
6996cyclic symlinks in rootfs cause user-space qemu to infinite loop on startupnormalMedium2.2 M3Aníbal LimónNEW10
 11       
Belen Barros Pena
7744Improve messaging in empty states when Toaster does not have any layer informationenhancementMedium2.2Belen Barros PenaNEWGUI design pending3
8034typeahead search cneeds words to indicate it is constrained to the added layers.normalMedium2.2Belen Barros PenaNEW2
9611Under Project->Bitbake variable, We disallow variables with a '/' in themnormalMedium2.2Belen Barros PenaNEW
 3       
brian avery
9597swtbot initial implementation so that we can automate testing of the pluginnormalMedium2.2brian averyNEW
7972lsof needed by start/stop toaster script but not needed on system to run Yocto builds.normalMedium2.2brian averyNEW2
8189Variable history shows full paths to files inside the /bitbake directorynormalMedium2.2brian averyNEW2
9621ostro.layers not copied from conf to workspacenormalMedium2.2 M1brian averyNEW
 4       
Bruce Ashfield
9656NFS boot failed due No working init found kernel panic on qemunormalMedium1.8.3Bruce AshfieldNEW
7096Document how to use initramfs featuresenhancementMedium2.2Bruce AshfieldIN PROGRESS DESIGN2
96094.1.x: musb fails to compilenormalMedium2.2Bruce AshfieldWaitForUpstream
9480linux-yocto: make it work with arm big endianenhancementMedium2.2Bruce AshfieldACCEPTED7
8289kernel_configme step should use "oldnoconfig" instead of "allnoconfig" when silently upgrading user defconfignormalMedium2.2 M1Bruce AshfieldIN PROGRESS DESIGN COMPLETE4
8743configme --allnoconfig breaks defconfig generated with kconfig / make savedefconfignormalMedium2.2 M1Bruce AshfieldIN PROGRESS IMPLEMENTATION3
3420Audit *-standard.scc and move non-hardware items up into standard.sccenhancementMedium2.2 M2Bruce AshfieldIN PROGRESS DESIGN6
6630linux-yocto: kernel-dev package does not include target arch scripts binariesenhancementMedium2.2 M2Bruce AshfieldIN PROGRESS IMPLEMENTATION3
6767kernel version mismatched on some BSPsminorMedium2.2 M2Bruce AshfieldIN PROGRESS IMPLEMENTATION2
6022kernel-dev: How do I know which features are available for KERNEL_FEATURES ?enhancementMedium2.2 M2Bruce AshfieldACCEPTED2
7418Perf/kernel-devsrc racenormalMedium2.2 M2Bruce AshfieldIN PROGRESS DESIGN3
7646KBUILD_DEFCONFIG does not work if config file is created as a result of patch to be appliednormalMedium2.2 M3Bruce AshfieldIN PROGRESS IMPLEMENTATION3
8970test_kernel_module fails with AssertionError: 137 != 0 : cd /usr/src/kernel && make scriptsnormalMedium2.2 M3Bruce AshfieldACCEPTED5
9125arm64 dmesg test fails show dmi Firmware registration failednormalMedium2.2 M3Bruce AshfieldACCEPTED2
9069perf: missing python modules for scripts in 'perf report'normalMedium2.2 M4Bruce AshfieldIN PROGRESS REVIEW3
 15       
California Sullivan
9202[Test Case 898] Piglit 3D testing NUC (6i5SYH) s getting stuck when running script.normalMedium2.2California SullivanWaitForUpstream3
9267test_parselogs (oeqa.runtime.parselogs.ParseLogsTest) failed on NUC 6i5SYH, firmware load for i915/skl_guc_ver4.bin failednormalMedium2.2California SullivanACCEPTED3
9406dmesg test_parseLogs failed corei7-64 on NUC error BAR 14 and 15normalMedium2.2California SullivanACCEPTED2
9525Make install prompt available on all consolesenhancementMedium2.2California SullivanNEW4
95874.1.x: gpio-pca953x.c fails to compile without CONFIG_ACPInormalMedium2.2California SullivanNEW
 5       
Cristina Agurida
8961sudoku-savant does not get downloaded correctlynormalMedium2.0.2Cristina AguridaNEW
 1       
Daniel Istrate
6370QA/oe-selftest: add test suite for recipe testingenhancementMedium2.2Daniel IstrateIN PROGRESS REVIEW10
8332Add a broken recipe for testing purposesenhancementMedium2.2Daniel IstrateNEW2
 2       
dengke
8810Some strace ptests failnormalMedium2.2dengkeACCEPTED3
 1       
Ed Bartosh
8719Ensure bootable images can be supported by wic for all reference BSPsenhancementMedium2.2Ed BartoshIN PROGRESS DESIGN
9076The detection of the image type is incorrectly matching a wrong typenormalMedium2.2Ed BartoshIN PROGRESS REVIEW3
7973stopping toaster kills ALL django apps running on the machine.normalMedium2.2Ed BartoshNEW2
8806Refactor localhostbecontrollernormalMedium2.2Ed BartoshNEW20
8886Toaster thinks do_shared_workdir is a shared state tasknormalMedium2.2Ed BartoshNEW3
8918Change the way we handle queued buildsnormalMedium2.2Ed BartoshNEW
9518Rationalise the directory structure generated by ToasterenhancementMedium2.2Ed BartoshNEW
9585verify/fix eventreplaynormalMedium2.2Ed BartoshNEW
 8       
Plauchu Edwin
9204Cleanup should be made after testing smartnormalMedium2.2 M1Plauchu EdwinNEW1
7909RRS: Track patches and Upstream-Status informationenhancementMedium2.2 M1Plauchu EdwinNEW5
8133RRS should handle upstream repositories without version tagsenhancementMedium2.2 M1Plauchu EdwinIN PROGRESS DESIGNGUI design available2
8400rrs: add the cause of an unknown recipe versionenhancementMedium2.2 M1Plauchu EdwinNEW3
8943add a function hook that would process upstream and recipe versionsenhancementMedium2.2 M1Plauchu EdwinNEW2
9081RRS should respect DEFAULT_PREFERENCE when multiple versions of the same recipe are availablenormalMedium2.2 M1Plauchu EdwinIN PROGRESS DESIGN2
9551Resolve string formatting issues in unzipnormalMedium2.2 M1Plauchu EdwinIN PROGRESS REVIEW1.5
8200Add acl to default DISTRO_FEATURES?enhancementMedium2.2 M2Plauchu EdwinNEW1
 8       
Beth Flanagan
9604nightly-wic invokes wic with options that aren't available in fido/1.8.xnormalMedium1.8.3Beth FlanaganNEW
8044Stop building lsb-qt3 imagesnormalMedium2.2Beth FlanaganNEW2
6284Random package/image builder (fuzzy build)enhancementMedium2.2 M1Beth FlanaganNEW4
7693Convert Autobuilder docs to docbookenhancementMedium2.2 M1Beth FlanaganNEW5
8760Autobuilder additional task log availabilitynormalMedium2.2 M1Beth FlanaganNEW2
9018Extend existing AutoBuilder script to schedule buildsenhancementMedium2.2 M1Beth FlanaganACCEPTED3
7568Create an image to run regular build tests for no-X11 caseenhancementMedium2.2 M2Beth FlanaganNEW3
7695Automated QA tests for the autobuilderenhancementMedium2.2 M2Beth FlanaganNEW5
7963Release process needs to generate correct toasterconf.json files for tar.gz releasesnormalMedium2.2 M2Beth FlanaganNEW2
8193add wiki reporting to public ABenhancementMedium2.2 M2Beth FlanaganNEW3
9315nightly-world & nightly-world-lsb failed at PublishingArtifactsnormalMedium2.2 M2Beth FlanaganNEW2
9596Build "minimal" extensible SDK installers instead of "full" onesenhancementMedium2.2 M2Beth FlanaganNEW
1789[Autobuilder] Optionally generate a HTML logenhancementMedium2.2 M2Beth FlanaganACCEPTED2
8841COPY_LIC_DIRS should use beginline and endline from LIC_FILES_CHKSUMenhancementMedium2.2 M2Beth FlanaganNEW1
7691Locking of branch/repoenhancementMedium2.2 M3Beth FlanaganNEW1
4183Reference material for how a user creates a build that meets GPL obligations given a reference BSP, standard rootfs/kernel...etc.enhancementMedium2.2 M4Beth FlanaganNEW2
 16       
Elliot Smith
8188The variable history is missing the layer namenormalMedium2.2Elliot SmithNEW10
8190The 'set in file' filters in the BitBake variables table seem to return the wrong informationnormalMedium2.2Elliot SmithNEW6
8363Assess which non-ToasterTable pages need refactoring and howenhancementMedium2.2Elliot SmithNEW2
9395Cleanly support unicode throughout ToasterenhancementMedium2.2Elliot SmithNEW15
9485Fix typeaheads for Bootstrap 3normalMedium2.2Elliot SmithNEW3
9494Custom images created from the build history pages fail to buildnormalMedium2.2Elliot SmithNEW3
9500In multitarget builds, Toaster shows software recipes in the list of imagesnormalMedium2.2Elliot SmithNEW4
9514Builds of software recipes should not show a "New custom image" buttonnormalMedium2.2Elliot SmithNEW2
9530Arrows in directory structure do not expand directoriesnormalMedium2.2Elliot SmithNEW
9630Show tasks currently running as part of progress bar updateenhancementMedium2.2Elliot SmithNEWGUI design pending5
 10       
Francisco Pedraza
7202Test for linux-dummyenhancementMedium2.2Francisco PedrazaIN PROGRESS REVIEW1
8502Store BSPs Firmware and HW info for BSP test casesenhancementMedium2.2Francisco PedrazaNEW2
8504Identify and add if needed BSP test cases specific to meta-intelenhancementMedium2.2Francisco PedrazaNEW5
 3       
Heinz Wrobel
9407bitbake reports log_check warning without stating in which log/recipe the problem occurrednormalMedium2.2 M1Heinz WrobelNEEDINFO3
 1       
Hongxu Jia
8832pTest - bash tests fail for 2.1_M1.rc1normalMedium2.2 M2Hongxu JiaNEW
7600syslinux: port extX support patches to syslinux communityenhancementMedium2.2 M2Hongxu JiaIN PROGRESS IMPLEMENTATION15
7018archiver missing tasks between do_unpack and do_patchnormalMedium2.2 M3Hongxu JiaIN PROGRESS REVIEW3
7149rpm: print which pkgname for warningenhancementMedium2.2 M3Hongxu JiaNEW5
8446fix .pyc/.pyo buildpaths issueenhancementMedium2.2 M3Hongxu JiaNEW5
8784IMAGE_LINGUAS did not support multilib correctlynormalMedium2.2 M3Hongxu JiaACCEPTED
9169add fix_buildpaths.bbclass to fix build pathenhancementMedium2.2 M3Hongxu JiaNEW
6420Detect and error when required packages are not producedenhancementMedium2.2 M4Hongxu JiaNEW5
 8       
Humberto Ibarra
8919Code coverage: add ability to create coverage-based test exclusion reportsenhancementMedium2.2 M1Humberto IbarraNEW6
8921Code coverage: add ability to create missing 'coverage area' reportsenhancementMedium2.2 M1Humberto IbarraNEW5
8321yocto-bsp script should use argparse instead of optparse libraryenhancementMedium2.2 M1Humberto IbarraACCEPTED2
 3       
Jianxun Zhang
5351genericx86 auth.err getty[615]: tcgetattr: Input/outputnormalMedium2.2Jianxun ZhangNEW2
9205Add functionality to the formfactor to check for keyboard and/or touchscreenenhancementMedium2.2Jianxun ZhangIN PROGRESS REVIEW0.1
9419Enabling systemd-boot to replace gummibootenhancementMedium2.2 M1Jianxun ZhangIN PROGRESS REVIEW0.1
 3       
jingwang
8483Compatible to run generic pyunit test cases by test runnerenhancementMedium2.2 M1jingwangIN PROGRESS DESIGN
 1       
Jose Lamego
9389oeqa: split configuration from the codeenhancementMedium2.2 M1Jose LamegoIN PROGRESS DESIGN2
7823Convert Eclipse projects to Yocto recipes with devtoolenhancementMedium2.2 M2Jose LamegoIN PROGRESS DESIGNGUI design available1
7824Add functionality to modify existing Yocto recipes with devtoolenhancementMedium2.2 M2Jose LamegoACCEPTED5
8873Create an appropriate Yocto Project Workspace from an existing Eclipse projectenhancementMedium2.2 M2Jose LamegoNEW5
8874Create a new Yocto recipe from an existing Eclipse project using devtoolnormalMedium2.2 M2Jose LamegoNEW5
9390oeqa: don't write anything to local.conf or bblayers.confenhancementMedium2.2 M2Jose LamegoNEW10
 6       
Jose Perez C
8087eglibc patch bugnormalMedium2.2Jose Perez CNEW2
7526add test for checking if fontcache is created inside an imageenhancementMedium2.2Jose Perez CNEW1
8146ptest - some test cases are failing for aclnormalMedium2.2Jose Perez CNEW2
 3       
Joshua Lock
9612functions used in recipes and recipe examples (like bb.utils.contains) not documented.normalMedium2.2Joshua LockNEW0.5
9539Resolve string formatting issues in busyboxnormalMedium2.2Joshua LockNEW3
9540Resolve string formatting issues in console-toolsnormalMedium2.2Joshua LockNEW1.5
9541Resolve string formatting issues in cmakenormalMedium2.2Joshua LockNEW2
9542Resolve string formatting issues in expectnormalMedium2.2Joshua LockNEW1.5
9543Resolve string formatting issues in gccnormalMedium2.2Joshua LockNEW4
9544Resolve string formatting issues in gettextnormalMedium2.2Joshua LockNEW1.5
9545Resolve string formatting issues in kexec-toolsnormalMedium2.2Joshua LockNEW1.5
1882Verify and document package feed creation for each package management backendnormalMedium2.2Joshua LockACCEPTED5
9115Added packages filter seems to show the wrong package listnormalMedium2.2Joshua LockACCEPTED4
9297Toaster: Simplify building extensible SDKenhancementMedium2.2Joshua LockNEWGUI design pending5
9224[meta-swupd] Try to speed up update generation by parallelising calls to swupd_make_packenhancementMedium2.2 M1Joshua LockNEW1
9321[meta-swupd] Enhancements for use within a continuous integration systemenhancementMedium2.2 M1Joshua LockIN PROGRESS DESIGN4
9322[meta-swupd] Improve the algorithm for determining previous versionenhancementMedium2.2 M1Joshua LockNEW1.5
9325[meta-swupd] Copy only required bundle contents, rather than copying the entire mega image and then pruning unwanted filesenhancementMedium2.2 M1Joshua LockIN PROGRESS IMPLEMENTATION2
9187[meta-swupd] implement generic versions of the update helper scripts in oe-swupd-helpersnormalMedium2.2 M2Joshua LockNEW3
9188[meta-swupd] Remove hard-coded paths from swupd-clientnormalMedium2.2 M2Joshua LockWaitForUpstream1
9190[meta-swupd] Try to consolidate OS_VERSION and DISTRO_VERSIONnormalMedium2.2 M2Joshua LockNEW0.5
9511Provide support for swupd manifest includesenhancementMedium2.2 M2Joshua LockNEW5
9192[meta-swupd] Support virtual images generated from a virtual recipenormalMedium2.2 M3Joshua LockNEW5
9189[meta-swupd] Creates a lot of duplicate filesenhancementMedium2.2 M4Joshua LockNEW1
 21       
Juro Bystricky
9357nativesdk-python3 does not buildnormalMedium2.0.2Juro BystrickyIN PROGRESS REVIEW
8072Document using Build Appliance using Virtual BoxenhancementMedium2.2Juro BystrickyIN PROGRESS DESIGN15 Jan 2016: NEEDINFO1
8074Graphic display using Virtual Box differs from VMwarenormalMedium2.2Juro BystrickyIN PROGRESS REVIEW1
3898kernel menuconfig unusablenormalMedium2.2Juro BystrickyWaitForUpstream
9442Please add virtio console to qemux86-64.confenhancementMedium2.2 M1Juro BystrickyACCEPTED
 5       
Jussi Kukkonen
9650Eject icon is displayed as "file" on SATO sdk NUC when plugging USBminorMedium1.8.3Jussi KukkonenNEW
9473bind: CVE-2016-2088 (jethro)majorMedium2.0.2Jussi KukkonenNEW0.5
2646Windows switching failurenormalMedium2.2Jussi KukkonenIN PROGRESS IMPLEMENTATION0.5
6378libfakekey patch to allow shift-ed version of symbol not already in keymapnormalMedium2.2Jussi KukkonenNEW1
1985matchbox-panel doesn't build battery status appletenhancementMedium2.2Jussi KukkonenNEW5
6077piglit depends on libx11enhancementMedium2.2Jussi KukkonenACCEPTED2
8586multilib build includes 32bit connman without good reasonnormalMedium2.2Jussi KukkonenIN PROGRESS REVIEW1
8643GTK+3 depends on libepoxy which depends on eglnormalMedium2.2Jussi KukkonenACCEPTED3
9350As a developer, I want a global variable exist for choosing the default SSL/TLS provider.enhancementMedium2.2Jussi KukkonenNEW
9356piglit needs to be updated to run newer testsnormalMedium2.2Jussi KukkonenNEW
9524Drop libxsettings-clientenhancementMedium2.2Jussi KukkonenNEW
9082Display network information on log-in screensenhancementMedium2.2 M1Jussi KukkonenACCEPTED0.5
 12       
Christopher Larson
7958Implement shallow git clone functionalityenhancementMedium2.2Christopher LarsonIN PROGRESS IMPLEMENTATION2
6372Feature request: recipe hook for source tree preparationenhancementMedium2.2Christopher LarsonNEW
7670Proposal: make TOPDIR or BUILDDIR available to the devshellenhancementMedium2.2Christopher LarsonIN PROGRESS REVIEW
7671Feature request: integrate task-level exports supportenhancementMedium2.2Christopher LarsonNEW
 4       
Kevin Hao
9176Default u-boot script is not able boot from eMMC on BeagleBone BlacknormalMedium2.2Kevin HaoNEW
 1       
Leonardo Sandoval Gonzalez
6618Make the layer name searchable and show item page when search returns only one resultenhancementMedium2.2 M1Leonardo Sandoval GonzalezIN PROGRESS REVIEW2
9308patchtest: improve signal handling when the process is interruptedenhancementMedium2.2 M1Leonardo Sandoval GonzalezACCEPTED1
7724useradd.bbclass users cannot be safely referred to by dependent recipes due to sstate-induced race with base-passwdmajorMedium2.2 M1Leonardo Sandoval GonzalezACCEPTEDTC needed7
5654Add EFI to qemux86 and qemux86-64enhancementMedium2.2 M2Leonardo Sandoval GonzalezWaitForUpstream5
8676devtool: extend oe-selftest testing for devtool upgradeenhancementMedium2.2 M2Leonardo Sandoval GonzalezACCEPTED2
 5       
Libertad
8497Continuous Toaster exploratory testingenhancementMedium2.2LibertadNEW
8678Testing coverage of non-poky Toaster setupenhancementMedium2.2LibertadIN PROGRESS DESIGN1
 2       
Robert Yang
9436lib/bb/fetch2/git.py: print more friendly errors messages when failedlib/bb/fetch2/git.pyenhancementMedium2.2 M1Robert YangNEW3
4827runqemu shouldn't hard-code machine knowledgeenhancementMedium2.2 M1Robert YangIN PROGRESS IMPLEMENTATION15
7610[Multilib] Can't install 64bit packages to 32bit rootfsenhancementMedium2.2 M1Robert YangACCEPTED10
8592smart: make it can understand MLPREFIXenhancementMedium2.2 M1Robert YangNEW10
9048Failed to build iptables with extensible sdk on Fedora 23 i686normalMedium2.2 M1Robert YangACCEPTED5
9408create-pull-request: auto push the branch if not presentenhancementMedium2.2 M1Robert YangNEW3
9409create-pull-request: add the ability to read env varenhancementMedium2.2 M1Robert YangNEW2
9410create-pull-request: automatically add the subject when there is only one patchenhancementMedium2.2 M1Robert YangNEW2
9512insane.bbclass: package_qa_check_license -> do_qa_populate_licnormalMedium2.2 M1Robert YangIN PROGRESS IMPLEMENTATION5
7436kbd build racenormalMedium2.2 M2Robert YangIN PROGRESS DESIGN1
9495Can't boot efi image (iso or vmdk) in virtualboxnormalMedium2.2 M2Robert YangNEW5
9404Smart will remove RECOMMENDS during a remove commandnormalMedium2.2 M2Robert YangNEW3
6120perf top command does not work on QemuPPCnormalMedium2.2 M2Robert YangACCEPTED5
7984RPM backend does not honor package overrides for PACKAGE_ARCHnormalMedium2.2 M3Robert YangNEW5
8967Need a way to cleanup DEPENDS and RDEPENDSenhancementMedium2.2 M3Robert YangNEW5
9423devshell: export CONFIGUREOPTS to envenhancementMedium2.2 M3Robert YangNEW5
8740LTP and LSB NG casesnormalMedium2.2 M3Robert YangIN PROGRESS REVIEW5
7950gcc-cross-canadian-i586 doesn't work PREFERRED_VERSIONnormalMedium2.2 M4Robert YangIN PROGRESS REVIEW2
 18       
Ming Liu
9233As a developer, I want initramfs bundled kernel could be installed into rootfsnormalMedium2.2Ming LiuIN PROGRESS REVIEW
 1       
Mariano Lopez
8650RRS: track ptest-enabled and potentially ptest-enabled statusenhancementMedium2.2 M1Mariano LopezACCEPTEDGUI design available3
9468Export Tests execution (Runexport.py) execution log needs improvementsenhancementMedium2.2 M2Mariano LopezNEW3
9294Error Reporting Tool: Add a 'solutions' relationship to the error entriesenhancementMedium2.2 M4Mariano LopezNEWGUI design pending3
 3       
Mark Hatle
8779update-alternatives.bbclass automatic renaming doesn't happen in sysrootsnormalMedium2.2Mark HatleNEW
9208createrepo fails to correctly update the repodata, image generation then failsnormalMedium2.2Mark HatleNEW
 2       
Markus Lehtonen
6926Create yocto-bsp testsuiteenhancementMedium2.2Markus LehtonenNEW15
9663do_populate_lic assumes that license basenames are uniquenormalMedium2.2Markus LehtonenNEW
 2       
Martin Jansa
9217Many unsolveable QA warnings from build-deps and file-rdepsnormalMedium2.2 M3Martin JansaNEEDINFO10
 1       
Maxin B. John
8471ptest - some valgrind ptests fail on 2.0.rc1normalMedium2.2Maxin B. JohnACCEPTED2
8380multiple pointer devices in qemunormalMedium2.2Maxin B. JohnACCEPTED2
9365Remove xtscal in preference of xinput-calibratorenhancementMedium2.2Maxin B. JohnNEW
9523openssl: dangling libcrypto.a symlinknormalMedium2.2Maxin B. JohnNEW
9668libarchive doesn't respect disable-aclnormalMedium2.2Maxin B. JohnNEW
 5       
Michael Wood
9651Error report web: Optimize searching timesenhancementMedium2.2Michael WoodNEW
7502Show image information if rootfs files are generatednormalMedium2.2Michael WoodNEW4
8051Importing layer fails silently if the layer name already existsnormalMedium2.2Michael WoodNEW2
8131All builds page "Errors"/"Warnings" filters doesn't worknormalMedium2.2Michael WoodACCEPTED4
8275Toaster: Suitable message and build box does not appear in build tab for a project with no buildsnormalMedium2.2Michael WoodNEW4
8456Add feature to add layers to Toaster from external sourceenhancementMedium2.2Michael WoodNEW
8953Toaster ignores the subdirectory when cloning imported layersnormalMedium2.2Michael WoodNEW
9582Replace toasterconf.json with Django fixturesenhancementMedium2.2Michael WoodNEW14
9586document and verify production setup for jenkins ci interactionnormalMedium2.2Michael WoodNEW
9641In the custom image recipe page, the last build information only shows successful buildsnormalMedium2.2Michael WoodNEW
9645The image recipe details does not show "Last build" informationnormalMedium2.2Michael WoodNEW
9274Port oe build selftest tests to django test frameworknormalMedium2.2 M1Michael WoodIN PROGRESS REVIEW4
9093Hide scary errors while importing recipe information from the layer indexnormalMedium2.2 M3Michael WoodNEW2
9097Remove validation messages when layers checkout directory and build directory are correctly setnormalMedium2.2 M3Michael WoodNEW4
9164The toaster-custom-images layer should not show like any other layer, and should not be removablenormalMedium2.2 M4Michael WoodNEWGUI design available4
 15       
Michael Halstead
8162patchwork: clear out the superseded and already merged patchesenhancementMedium2.2 M1Michael HalsteadNEW4
 1       
Paul Eggleton
6128Incorrect wildcard unpack behaviour in fetchernormalMedium2.2Paul EggletonNEW2
6129Local directories unpack to a different location than local filesnormalMedium2.2Paul EggletonNEW2
7852bitbake-layers layerindex-fetch doesn't respect branch (-b|--branch) optionnormalMedium2.2Paul EggletonIN PROGRESS DESIGN1
8703PATCHTOOL = git, triggers error user.name/user.email unsetnormalMedium2.2Paul EggletonIN PROGRESS IMPLEMENTATION0.5
6626Add an example for debugging software with the corresponding -dbg packagenormalMedium2.2Paul EggletonNEW1
9647Refactor the update scriptenhancementMedium2.2Paul EggletonIN PROGRESS REVIEW0.5
5057Conflict when building SDK for image containing dropbear and openssh-sftp-servernormalMedium2.2Paul EggletonACCEPTEDRelease Note4
5546Optimise away meta-oe X init mechanismenhancementMedium2.2Paul EggletonACCEPTED2
5853BitBake should give some status indication when fetching sstate packagesenhancementMedium2.2Paul EggletonIN PROGRESS IMPLEMENTATION
6661devtool: add ability to submit changes for reviewenhancementMedium2.2Paul EggletonNEW10
6972breaks build of software using cmake packages due to hardcoded pathsnormalMedium2.2Paul EggletonNEW1
7142cmake.bbclass fails when rebuilding after MACHINE changesnormalMedium2.2Paul EggletonNEW3
7240Add declaration of image output file globs for ToasterenhancementMedium2.2Paul EggletonNEW1
7336buildhistory-diff reports recipe-wide changes per-subpackageenhancementMedium2.2Paul EggletonNEW1
7617devtool: detect need to re-run configureenhancementMedium2.2Paul EggletonNEW3
7636recipetool: basic spec file conversionenhancementMedium2.2Paul EggletonNEW
7637devtool: add: interactive recipe creationenhancementMedium2.2Paul EggletonNEW5
8278devtool: update compressed patches gracefullynormalMedium2.2Paul EggletonNEW0.5
8325devtool modify could handle patch failure more usefullyenhancementMedium2.2Paul EggletonNEW3
8582Error message not in log filenormalMedium2.2Paul EggletonNEW2
8594devtool: provide easy means of moving a recipe in the workspace to a real layerenhancementMedium2.2Paul EggletonNEW3
8732Branch Support for BuildhistoryenhancementMedium2.2Paul EggletonNEW2
8840Failure to build 32 bit eSDK on a 64 bit hostenhancementMedium2.2Paul EggletonNEW4
9220buildhistory should track native recipesenhancementMedium2.2Paul EggletonNEW2
9360devtool: update-recipe ignores SRC_URI_appendnormalMedium2.2Paul EggletonNEW4
9367Extensible SDK: avoid double invocation of bitbake on installenhancementMedium2.2Paul EggletonIN PROGRESS IMPLEMENTATION4
9479Extensible SDK breaks if python-dependent items added to TOOLCHAIN_HOST_TASKnormalMedium2.2Paul EggletonNEW2
9627devtool seems to mangle incorrectly the .bb file, when modifying the set of patches for a componentnormalMedium2.2Paul EggletonNEW
9638devtool changes the format of the SRC_URI unnecessarilynormalMedium2.2Paul EggletonNEW
8223bbwarn warnings during do_rootfs printed twiceminorMedium2.2 M1Paul EggletonIN PROGRESS IMPLEMENTATION1
9257extensible SDK: need an easy way of installing toolchainsnormalMedium2.2 M1Paul EggletonNEW1
 31       
Chen Qi
8939Lots of [host-user-contaminated] warningnormalMedium1.4.5Chen QiACCEPTED
8812Some util-linux ptests failnormalMedium2.2Chen QiACCEPTED2
8834pTest - attr test fail ln -s fnormalMedium2.2Chen QiACCEPTED2
9053pTest - util-linux (NUC) failed tested on NUC 5425WYK for YP 2.1_M2.rc1normalMedium2.2Chen QiACCEPTED2
9055pTest - acl (NUC) failed tested on NUC 5425WYK for YP 2.1_M2.rc1normalMedium2.2Chen QiACCEPTED2
4420No init scripts in core-image-sato with systemd if 'sysvinit' is not in DISTRO_FEATURESenhancementMedium2.2Chen QiIN PROGRESS IMPLEMENTATION10
5427Extend and tidy up layer sanity checkingenhancementMedium2.2Chen QiIN PROGRESS REVIEW5
6132Have persistent log data (/var/log)enhancementMedium2.2Chen QiIN PROGRESS REVIEW4
6660Compare sstate packages within SDK publishing toolenhancementMedium2.2Chen QiACCEPTED6
7710devtool: deploy-target: interact with target packaging where availableenhancementMedium2.2Chen QiIN PROGRESS DESIGN10
8314warn when ALTERNATIVE_PRIORITY are the sameenhancementMedium2.2Chen QiNEW10
5359[Yocto 1.5] su - USER -c 'COMMAND' env variable issuenormalMedium2.2Chen QiNEW
6016CrossTap has issues on running scheduler script against qemuppcnormalMedium2.2Chen QiNEW5
 13       
Khem Raj
6882Can't log in to successfully built mipsel virtual imagemajorMedium1.6.4Khem RajACCEPTED
8870uclibc fails to build occasionallynormalMedium2.2Khem RajNEW
9417Bring clang/llvm compiler infrastructure to OE-CoreenhancementMedium2.2Khem RajNEW
 3       
Randy Witt
9504knotty doesn't delete lines if the number of output lines is larger than then number of lines in the terminalnormalMedium2.2Randy WittNEW2
5866Reproducible builds: identical binariesenhancementMedium2.2Randy WittNEW5
8789extensible SDK: command disable devtool subcommands based on capabilitiesenhancementMedium2.2Randy WittNEW2
8928extensible SDK - add a way to prepare the sdk for offline usageenhancementMedium2.2Randy WittNEW3
9173extensible sdk: Create a way that sstate will automatically be removed after setsceneenhancementMedium2.2Randy WittNEW1
9503Add a way to add docker metadata to container imagesenhancementMedium2.2Randy WittNEW3
9595Extensible sdk: error early if tasks to be ran cannot be provided from sstatenormalMedium2.2Randy WittNEW
8560xserver fails with xf86OpenConsole: Cannot open /dev/tty0 (No such file or directory)normalMedium2.2Randy WittNEW2
7552Generated SDK has "expect" headers in wrong locationnormalMedium2.2 M3Randy WittNEW1
 9       
Randy MacLeod
3388perf: enable man pages for basic 'help' functionalitynormalMedium2.2Randy MacLeodACCEPTED2
7314Audit all recipes for proper CONFFILES assignmentenhancementMedium2.2Randy MacLeodNEW
 2       
Richard Purdie
4389kernel: Remove "make scripts" requirement for module building from SDK/on targetenhancementMedium2.2Richard PurdieACCEPTED5
8828pTest - lttng-tools tests fail for 2.1_M1.rc1normalMedium2.2Richard PurdieNEW3
4143Support real-time logging when using bitbake interactivelyenhancementMedium2.2Richard PurdieNEW5
5395Nativesdk postinstalls directory issues.normalMedium2.2Richard PurdieNEW5
7846devshell cannot be kept open across rebuildsenhancementMedium2.2Richard PurdieNEW1
7877Depending on the error found, inconsistent line reported.normalMedium2.2Richard PurdieNEW3
7879Depending on the name of a recipe, the build succeeds or fails.normalMedium2.2Richard PurdieNEW3
7985Variable typing support within BitBakeenhancementMedium2.2Richard PurdieNEW15
8161Can't use "\" characters in SRC_URI entries - not even escapednormalMedium2.2Richard PurdieNEW2
8805Detect and warn people naming functions something_remove_somethingnormalMedium2.2Richard PurdieNEW1
9061git fetcher inconsistency for working with PREMIRRORS.normalMedium2.2Richard PurdieNEW5
9175Remove os.chdir from fetch/unpack logicenhancementMedium2.2Richard PurdieNEW5
9279Issue with PREFERRED_PROVIDER interaction with overridesnormalMedium2.2Richard PurdieNEW1
9603bitbake example class uses old getVarFlag() syntaxnormalMedium2.2Richard PurdieNEW
5280For tested hosts, we should use a wild card or other translations to group compatible sstate-cache (and other items)enhancementMedium2.2Richard PurdieNEW3
7298packagegroups are not rebuilt when rdependency pkg name changesnormalMedium2.2Richard PurdieNEW5
7960Feature Request: to enable poky to support building multilib native commandsenhancementMedium2.2Richard PurdieNEW5
8173Wrong dynamic loader because of missing -mfloat-abi=hard in LDFLAGS (in scons)normalMedium2.2Richard PurdieNEW2
9272BBCLASSEXTEND="cross" overrides do_install()normalMedium2.2Richard PurdieNEW1
9251Need flowchart style documentation showing progress of tasks and what they touch in a setscene vs non setscene setting.enhancementMedium2.2 M1Richard PurdieNEW1
 20       
LiRongQing
7554Ownership issue in package contentsmajorMedium2.2LiRongQingACCEPTED
 1       
Ross Burton
9158Cannot build openjdk-8 on fido due to missing autotools patchnormalMedium1.8.3Ross BurtonNEW1
9213Enable thumb for ARM buildsnormalMedium2.2Ross BurtonNEW1
9288depexp does not show bitbake errorsnormalMedium2.2Ross BurtonNEW1
2415connman doesn't provide a 3g configuration utilityenhancementMedium2.2Ross BurtonNEW5
3488Enable Mesa's llvmpipe?enhancementMedium2.2Ross BurtonACCEPTED2
5322Global DNS fallback mechanism not present in poky distroenhancementMedium2.2Ross BurtonACCEPTED3
6278runqemu without /etc/resolv.confenhancementMedium2.2Ross BurtonNEW3
6700systemd's resolved conflicts with connmanenhancementMedium2.2Ross BurtonNEW2
7010systemd-serialgetty cannot create a serial-getty@.service that is not enablednormalMedium2.2Ross BurtonNEWBackport to 1.7.31
7054OprofileUI needs to be updated to reflect new oprofile functionalitynormalMedium2.2Ross BurtonACCEPTED2
7800systemd.bbclass doesn't check for services in systemd/user/ directoryenhancementMedium2.2Ross BurtonNEW3
8302sstate_create_package fails to chmod filenormalMedium2.2Ross BurtonNEW1
8430inaccurate 'du' usage in Image::_get_rootfs_sizeenhancementMedium2.2Ross BurtonACCEPTED1
8454archiver.bbclass does not create subfolder per licensenormalMedium2.2Ross BurtonNEW1
8593The head files of ncurses installing into sysroot seems different in multiple times compilationnormalMedium2.2Ross BurtonNEW2
8688busybox syslog not update-alternatives awarenormalMedium2.2Ross BurtonNEW2
9110Move some oe-pkgdata-util logic into lib/oeenhancementMedium2.2Ross BurtonNEW2
9171Consider limiting the scope of depchains to runtime depsnormalMedium2.2Ross BurtonNEW5
9207Need to fix prelink to iterate mulitlibsnormalMedium2.2Ross BurtonNEW4
9259The rpm database costs lots of disk space after install a packagenormalMedium2.2Ross BurtonNEW3
8064ptest fails tracker bugnormalMedium2.2Ross BurtonNEW
9119ptest fails tracker bug (Cont.)normalMedium2.2Ross BurtonNEW
9346Rename COMPRESS_CMD_* to IMAGE_POSTPROCESS_*?enhancementMedium2.2 M1Ross BurtonNEW1
7136Default PACKAGES value prevents packaging of prebuilt shared librariesnormalMedium2.2 M2Ross BurtonNEW1
6142we need general documentation on Systemd vs SysV related issuesenhancementMedium2.2 M4Ross BurtonACCEPTEDNIR 05/01, 05/08, 5/151
 25       
Saul Wold
7459Implement the use of host USB devices on Linux for qemu machinesenhancementMedium2.2Saul WoldNEW3
 1       
Scott Rifenbark
9580Missing package dependency in quick start guide for FedoranormalMedium2.2Scott RifenbarkNEW
9380The manual does not mention automatically added version restrictionsnormalMedium2.2Scott RifenbarkNEW04 April 2016: NEEDINFO1
9553INHIBIT_PACKAGE_STRIP docs need to be expandednormalMedium2.2Scott RifenbarkNEW
9671UPSTREAM_CHECK_* variables needs documentationenhancementMedium2.2Scott RifenbarkNEW
9672Add documentation for package installation during runtime testingenhancementMedium2.2Scott RifenbarkNEW
7718target:task syntax not mentioned in --helpminorMedium2.2 M1Scott RifenbarkNEW0.5
7546Streamline application development manualenhancementMedium2.2 M4Scott RifenbarkACCEPTED09 April 2015: ACCEPTED3
9451Document a cookbook procedure on how to change kernel versionnormalMedium2.2 M4Scott RifenbarkNEW2
3442Eclipse-plugin for Windows should be documentedenhancementMedium2.2 M4Scott RifenbarkACCEPTED04 May 2015 - ACCEPTED3
8596Document proper way of adding a userspace header for the kernelenhancementMedium2.2 M4Scott RifenbarkACCEPTED1
8909Mention standard fetcher options also in fetcher seaction (not only in SRC_URI in the glossary)enhancementMedium2.2 M4Scott RifenbarkACCEPTED2
9001bootimg.bbclass does not ducument GRUB boot lodader supportnormalMedium2.2 M4Scott RifenbarkNEW27 Jan 2016: NEEDINFO2
8631Fully document sysroot populationenhancementMedium2.2 M4Scott RifenbarkNEW3
9376Enhance descriptions for kernel tasks in the reference manual.enhancementMedium2.2 M4Scott RifenbarkNEW10
7477runqemu should support running poky tinyenhancementMedium2.2 M4Scott RifenbarkNEW2
 15       
Stephano Cetola
9497systemd usersnormalMedium2.2Stephano CetolaIN PROGRESS DESIGN1
9578INHIBIT_PACKAGE_STRIP breaks -dbgnormalMedium2.2Stephano CetolaIN PROGRESS REVIEW1
 2       
Stephen K Jolley
78833G/4G mobile hardware supportenhancementMedium2.2Stephen K JolleyACCEPTED0.1
 1       
Sujith H
9646The validation for DL_DIR and SSTATE_DIR variables fires for valid charactersnormalMedium2.2Sujith HACCEPTED
9598SSTATE_MIRRORS should not be on the list of restricted "Bitbake variables"normalMedium2.2 M2Sujith HACCEPTED
 2       
Tim Orling
9561[Mars] Minimum required Java version is 1.7 for Eclipse Mars (4.5)normalMedium2.1.1Tim OrlingACCEPTED0.2
9649New Yocto Bitbake Commander Project: No error shown when invalid directory givennormalMedium2.1.1Tim OrlingNEW
7819Support multi-image debuggingenhancementMedium2.2Tim OrlingNEW5
9562[Neon] Minimum required Java version is 1.8 for Eclipse Neon (4.6)normalMedium2.2Tim OrlingNEW0.2
9615yocto-bsp: The design for the yocto-bsp wizard needs some workenhancementMedium2.2Tim OrlingNEW
9616yocto-bsp wizard sources the Build location folder every time the field loses focusnormalMedium2.2Tim OrlingNEW
9622build.sh: error trying to generate doc for adt-manualnormalMedium2.2Tim OrlingIN PROGRESS REVIEW0.5
 7       
Todor Minchev
9590Cannot update Zephyr project configenhancementMedium2.2Todor MinchevNEW
9591Zephyr project configuration should allow kernel and app to be in different folder hierachiesenhancementMedium2.2Todor MinchevNEW
9593Enable workspace folder to be changedenhancementMedium2.2Todor MinchevNEW
9570Need a simple way of configuring Zephyr development environment at start of docker sessionnormalMedium2.2 M1Todor MinchevNEW
9571Allow CROPS to install host tools in specified locationnormalMedium2.2 M1Todor MinchevNEW
 5       
Tom Zanussi
9531Need a proper way to fix mismatched arch generated with bare-bone kernel recipenormalMedium2.2Tom ZanussiNEW
6156[crosstap] no trace message output on qemuarmnormalMedium2.2Tom ZanussiACCEPTED5
5520poky-tiny enhancementsenhancementMedium2.2 M2Tom ZanussiACCEPTED40
 3       
Tracy Graydon
6683Produce a script to automate release preparation tasksmajorMedium2.2Tracy GraydonNEW3
8083Add n32 test case to autobuilder nightly-multilibenhancementMedium2.2 M1Tracy GraydonNEW1
7476Improve license manifest descriptionenhancementMedium2.2 M1Tracy GraydonNEW2
6287Release scripts for BSPs/images.enhancementMedium2.2 M1Tracy GraydonNEW5
9107Update spdx.bbclass to work with FOSSology 3.0.0 releasenormalMedium2.2 M2Tracy GraydonACCEPTED5
6469Host system profiler tool.enhancementMedium2.2 M3Tracy GraydonNEW10
8158INCOMPATIBLE_LICENSES has unexpected results with GNU librariesnormalMedium2.2 M3Tracy GraydonNEW10
 7       
Vaduva Alexandru
7067Integrate 'grsecurity' package inside meta-cglenhancementMedium2.1Vaduva AlexandruNEW2
 1       
Bill Randle
8656ptest - perl tests fail for genericx86-64 on NUC - 2.0.rc3normalMedium2.2Bill RandleIN PROGRESS DESIGN4
9424systemd tmpfiles.d warnings (volatile, resolv.conf)minorMedium2.2 M1Bill RandleIN PROGRESS REVIEW1
 2       

Major or Critical

IDSummary (28 tasks) SeverityPMilestoneAssigneeStatusWhiteboardE
6882Can't log in to successfully built mipsel virtual imagemajorMedium1.6.4Khem RajACCEPTED
9653Boot and install from USB failed after GRUB black screen is displayedmajorMedium+1.8.2Jianxun ZhangREOPENED
9652boot and install from USB failed getting [sdc] error messagemajorMedium+1.8.3Jianxun ZhangNEW
9473bind: CVE-2016-2088 (jethro)majorMedium2.0.2Jussi KukkonenNEW0.5
9472[NO USB support ] Beaglebone black latest yoctomajorMedium+2.1.1Kevin HaoIN PROGRESS REVIEW1
6683Produce a script to automate release preparation tasksmajorMedium2.2Tracy GraydonNEW3
7554Ownership issue in package contentsmajorMedium2.2LiRongQingACCEPTED
8078useradd.bbclass: useradd_preinst not run when rebuilding on second MACHINEmajorMedium+2.2Maxin B. JohnACCEPTED3
9394bootstrap v2 License is not compatible with bitbake/toaster license.criticalHigh2.2 M1brian averyNEW
9575Test SDK EXT failed on core-image-sato for MIPS architecturecriticalMedium+2.2 M1Robert YangNEW5
9608pkg-config 0.29 compilation error after gcc update (5.3 -> 6.1)criticalMedium+2.2 M1Khem RajIN PROGRESS REVIEW
7724useradd.bbclass users cannot be safely referred to by dependent recipes due to sstate-induced race with base-passwdmajorMedium2.2 M1Leonardo Sandoval GonzalezACCEPTEDTC needed7
8616arm64's multilib SDK is brokenmajorMedium+2.2 M1Chen QiIN PROGRESS REVIEW3
8879opkg-utils is built when build lib32-imagemajorMedium+2.2 M1Robert YangIN PROGRESS IMPLEMENTATION5
9064do_unpack does not wipe old source treemajorMedium+2.2 M1Markus LehtonenIN PROGRESS REVIEW1
9131Prelink breaks fork IFUNCmajorHigh2.2 M1Mark HatleIN PROGRESS IMPLEMENTATION10
9177Failed to install jethro eSDK image from AutobuildermajorMedium+2.2 M1Paul EggletonNEW1
9581CVE-2016-2107, CVE-2016-2108, CVE-2016-2105, CVE-2016-2106, CVE-2016-2109, CVE-2016-2176majorHigh2.2 M1Jussi KukkonenIN PROGRESS REVIEW
9659hidden symbol pthread_atforkmajorMedium+2.2 M1Khem RajNEW
9673perl ptest package tries to include generate_uudmap host executablemajorMedium+2.2 M2Renato CaldasIN PROGRESS REVIEW1
8576QemuRunner logging for qemu start failure does not log anything to the console in oe-selftestmajorMedium+2.2 M4Jose Perez CNEW2
5331error play video via gstreamer with "mfw_isink"criticalMediumFutureOtavio SalvadorNEW
4155i.MX6: VPU plugins for GStreamer do not work with appsinkmajorMediumFutureOtavio SalvadorIN PROGRESS REVIEW
6806Smart failure when running bitbake over and overmajorMediumFutureRobert YangACCEPTED5
7945Toaster startup script assumes it's in a git repositorymajorMediumFutureToaster default assigneeNEW2
8391vncserver setup/tear down not concurrency safemajorMediumFuturebrian averyACCEPTED8
9687[Test Case 1099] Check if build succeeded when project release is changedcriticalUndecided---Toaster default assigneeNEW
9680beaglebone kernel fails in poky-lsb with gcc6majorUndecided---Bruce AshfieldIN PROGRESS REVIEW
 28       

NEEDINFO

IDSummary (6 tasks) AssigneeStatusSeverityPMilestoneWhiteboard
2442feature request: manifest files per licenseFrans MeulenbroeksNEEDINFOenhancementLowFuture
8652meta/recipes-devtools/ruby/ uses --disable-versioned-paths, but no such option exists NEEDINFOminorLow2.2 M1
9217Many unsolveable QA warnings from build-deps and file-rdepsMartin JansaNEEDINFOnormalMedium2.2 M3
9407bitbake reports log_check warning without stating in which log/recipe the problem occurredHeinz WrobelNEEDINFOnormalMedium2.2 M1
9513Failed to install sdk_ext for i686Richard PurdieNEEDINFOnormalMedium+2.2 M1NIR 05/22
9536oe-selftest: test_sstate_noop_samesigs failed due qmmp LICENSE_FLAGS_WHITELISTFrancisco PedrazaNEEDINFOnormalMedium+2.2 M1
 6      

Re-Opened

IDSummaryAssigneeStatusSeverityPMilestoneWhiteboard
9653Boot and install from USB failed after GRUB black screen is displayedJianxun ZhangREOPENEDmajorMedium+1.8.2
 1      

Old Milestone

IDSummaryAssigneeStatusSeverityPMilestoneWhiteboard
9653Boot and install from USB failed after GRUB black screen is displayedJianxun ZhangREOPENEDmajorMedium+1.8.2
 1      

Future Dot Releases

IDSummary (32 tasks) AssigneeStatusSeverityPMilestoneWhiteboard
8939Lots of [host-user-contaminated] warningChen QiACCEPTEDnormalMedium1.4.5
6882Can't log in to successfully built mipsel virtual imageKhem RajACCEPTEDmajorMedium1.6.4
7469SDL package cannot be found on OpenSUSE 13.2Juro BystrickyIN PROGRESS REVIEWnormalMedium+1.6.4
7641CVE-2014-9365 python: failure to validate certificates in the HTTP client with TLS (PEP 476)Armin KusterACCEPTEDnormalMedium+1.7.4
8487PTEST image does not install on hdd on 1.8.1Armin KusterIN PROGRESS IMPLEMENTATIONnormalMedium+1.7.4
7814Weston fails to build with core-image-weston on imx6qsabresdOtavio SalvadorNEWnormalLow1.8.3
8613udev-extraconf: automount does not work with systemd >= 219Alejandro HernandezIN PROGRESS REVIEWnormalMedium1.8.3Check 2.0 also
8667populate_sdk task fails when Debian packaging used in FIDOAníbal LimónACCEPTEDnormalMedium1.8.3
9100uclibc image fails to buildArmin KusterNEWnormalLow1.8.3
9158Cannot build openjdk-8 on fido due to missing autotools patchRoss BurtonNEWnormalMedium1.8.3
9604nightly-wic invokes wic with options that aren't available in fido/1.8.xBeth FlanaganNEWnormalMedium1.8.3
9650Eject icon is displayed as "file" on SATO sdk NUC when plugging USBJussi KukkonenNEWminorMedium1.8.3
9652boot and install from USB failed getting [sdc] error messageJianxun ZhangNEWmajorMedium+1.8.3
9654Ogg media file audio is not working on NUC and MMaxSaul WoldNEWnormalMedium+1.8.3
9656NFS boot failed due No working init found kernel panic on qemuBruce AshfieldNEWnormalMedium1.8.3
7991qemuppc bootup failure with oe-core toolchain (with systemd)Mark HatleIN PROGRESS IMPLEMENTATIONnormalMedium+2.0.2
8028Garbage in SDK manifest fileMariano LopezIN PROGRESS REVIEWnormalMedium+2.0.2
8092Implementation of the function glXChooseFBConfig in the libGL.so does not match OpenGL documentationOtavio SalvadorWaitForUpstreamnormalMedium+2.0.2
8877WebKitGTK+ Security AdvisoriesytaoNEWnormalMedium+2.0.2
8961sudoku-savant does not get downloaded correctlyCristina AguridaNEWnormalMedium2.0.2
9349Jethro build fails for core-image-x11 with package_debAníbal LimónIN PROGRESS DESIGNnormalMedium2.0.2
9353yocto-bsp: script using different kernel than the one given when creating bspHumberto IbarraIN PROGRESS REVIEWnormalMedium+2.0.2
9357nativesdk-python3 does not buildJuro BystrickyIN PROGRESS REVIEWnormalMedium2.0.2
9473bind: CVE-2016-2088 (jethro)Jussi KukkonenNEWmajorMedium2.0.2
9105[MARS] Cannot install eclipse-poky pluginTim OrlingIN PROGRESS IMPLEMENTATIONnormalMedium+2.1.1
9302Failed to start qemu with toolchain sysrootbrian averyNEWnormalMedium+2.1.1
9362Failed to run and debug a project to qemux86 in Eclipsebrian averyNEWnormalMedium+2.1.1
9472[NO USB support ] Beaglebone black latest yoctoKevin HaoIN PROGRESS REVIEWmajorMedium+2.1.1
9520test_parselogs failed on udevd[342] inotify_add_watch /dev/loop when running test imageSaul WoldNEWnormalMedium+2.1.1
9561[Mars] Minimum required Java version is 1.7 for Eclipse Mars (4.5)Tim OrlingACCEPTEDnormalMedium2.1.1
9601meta-qt5 Krogoth Branch Building Error During 'do_qa_staging'Armin KusterNEWnormalMedium2.1.1
9649New Yocto Bitbake Commander Project: No error shown when invalid directory givenTim OrlingNEWnormalMedium2.1.1
 32      

YP Toaster and Layer Index Bugs needing Triage

  • New Toaster bugs (No Priority)
IDSummary (3 tasks) AssigneeStatusSeverityPMilestoneWhiteboard
9684"Edit Columns" Button on the Compatible layers view is missingToaster default assigneeNEWnormalUndecided---
9686"Compatible image recipes" view does not show proper label messageToaster default assigneeNEWnormalUndecided---
9687[Test Case 1099] Check if build succeeded when project release is changedToaster default assigneeNEWcriticalUndecided---
 3      
  • New Layer Index bugs (No Priority)
IDSummaryAssigneeStatusSeverityPMilestoneWhiteboard
 0      
  • New Toaster bugs (No milestone)
IDSummary (3 tasks) SeverityPMilestoneAssigneeStatusWhiteboardE
9684"Edit Columns" Button on the Compatible layers view is missingnormalUndecided---Toaster default assigneeNEW
9686"Compatible image recipes" view does not show proper label messagenormalUndecided---Toaster default assigneeNEW
9687[Test Case 1099] Check if build succeeded when project release is changedcriticalUndecided---Toaster default assigneeNEW
 3       
  • New Layer Index bugs (No milestone)
IDSummarySeverityPMilestoneAssigneeStatusWhiteboardE
 0       
  • NEEDINFO - Toaster
IDSummaryAssigneeStatusSeverityPMilestoneWhiteboard
 0      
  • NEEDINFO - Layer Index
IDSummaryAssigneeStatusSeverityPMilestoneWhiteboard
 0      
  • REOPENDED - Toaster
IDSummaryAssigneeStatusSeverityPMilestoneWhiteboard
 0      
  • REOPENDED - Layer Index
IDSummaryAssigneeStatusSeverityPMilestoneWhiteboard
 0      
  • Old Milestone - Toaster
IDSummaryAssigneeStatusSeverityPMilestoneWhiteboard
 0      
  • Old Milestone Layer Index
IDSummaryAssigneeStatusSeverityPMilestoneWhiteboard
 0      
  • YP 2.2 remaining Toaster Enhancements
IDSummary (21 tasks) AssigneeStatusSeverityPMilestoneWhiteboard
6546Supporting use of local layers in ToasterBelen Barros PenaNEWenhancementLow2.2GUI design available
6607Auto-detect client locale and use for date formattingBelen Barros PenaNEWenhancementLow2.2
9002Move directory scan logic out of toaster.bbclass into buildinfohelperElliot SmithNEWenhancementLow2.2
7744Improve messaging in empty states when Toaster does not have any layer informationBelen Barros PenaNEWenhancementMedium2.2GUI design pending
8363Assess which non-ToasterTable pages need refactoring and howElliot SmithNEWenhancementMedium2.2
8456Add feature to add layers to Toaster from external sourceMichael WoodNEWenhancementMedium2.2
8678Testing coverage of non-poky Toaster setupLibertadIN PROGRESS DESIGNenhancementMedium2.2
9297Toaster: Simplify building extensible SDKJoshua LockNEWenhancementMedium2.2GUI design pending
9395Cleanly support unicode throughout ToasterElliot SmithNEWenhancementMedium2.2
9518Rationalise the directory structure generated by ToasterEd BartoshNEWenhancementMedium2.2
9582Replace toasterconf.json with Django fixturesMichael WoodNEWenhancementMedium2.2
9630Show tasks currently running as part of progress bar updateElliot SmithNEWenhancementMedium2.2GUI design pending
6238delete projects/builds through the toaster UIBelen Barros PenaNEWenhancementMedium+2.2GUI design pending
8563Improve detection and presentation of build artifactsElliot SmithNEWenhancementMedium+2.2
9023Improve the content of the "other artifacts" sectionElliot SmithNEWenhancementMedium+2.2GUI design pending
9184Cannot delete layer from toaster databaseMichael WoodNEWenhancementMedium+2.2GUI design pending
9631add state Transitions to progress bar as well as build progress.Elliot SmithNEWenhancementMedium+2.2GUI design pending
9517Move to Bootstrap 3Belen Barros PenaNEWenhancementHigh2.2 M1
9519Consolidate used API into it's own viewMichael WoodNEWenhancementMedium+2.2 M2
5811the variable history should collect and display the variable value for each modification sequenceElliot SmithACCEPTEDenhancementLow2.2 M3GUI design available; needs data completion test
8132Implement deleting custom imagesMichael WoodNEWenhancementMedium+2.2 M3GUI design available
 21      
  • YP 2.2 remaining Layer Index Enhancements
IDSummary (3 tasks) AssigneeStatusSeverityPMilestoneWhiteboard
9647Refactor the update scriptPaul EggletonIN PROGRESS REVIEWenhancementMedium2.2
6618Make the layer name searchable and show item page when search returns only one resultLeonardo Sandoval GonzalezIN PROGRESS REVIEWenhancementMedium2.2 M1
9439Verify that the REST API works with httpsElliot SmithIN PROGRESS REVIEWenhancementMedium+2.2 M2
 3      
  • Toaster default assignee
IDSummary (17 tasks) SeverityPMilestoneAssigneeStatusWhiteboardE
9418Support using existing OE setupsenhancementMedium2.3Toaster default assigneeNEW
8685Enter button doesn't apply your modification to bitbake variablesnormalLowFutureToaster default assigneeNEW
8769Integrating wic into ToasterenhancementLowFutureToaster default assigneeNEW
9117Allow "project builds" and "all builds" to be sorted by time and recipe namenormalLowFutureToaster default assigneeNEW
9118Dead paths for meta-toaster-custom layer left behind in bblayers.confnormalLowFutureToaster default assigneeNEW
7945Toaster startup script assumes it's in a git repositorymajorMediumFutureToaster default assigneeNEW2
8705Store valid values for variables in the Toaster databaseenhancementMediumFutureToaster default assigneeNEW
8790Boostrapping package information for image customisation purposesnormalMediumFutureToaster default assigneeNEW
8866Home-brew JSON encoding is ad hoc and incompleteenhancementMediumFutureToaster default assigneeNEW
8896Enable sorting by number of dependenciesenhancementMediumFutureToaster default assigneeNEWGUI design pending
8955Recipe explorerenhancementMediumFutureToaster default assigneeNEW
8959Allow Toaster to run images on simulator, even a custom oneenhancementMediumFutureToaster default assigneeNEW
9109Apply sleep 0.5 to other database operationsnormalMediumFutureToaster default assigneeNEW
9583Refactor Toaster database schemaenhancementMediumFutureToaster default assigneeNEW
9684"Edit Columns" Button on the Compatible layers view is missingnormalUndecided---Toaster default assigneeNEW
9686"Compatible image recipes" view does not show proper label messagenormalUndecided---Toaster default assigneeNEW
9687[Test Case 1099] Check if build succeeded when project release is changedcriticalUndecided---Toaster default assigneeNEW
 17       

Future Milestones

IDSummary (434 tasks) AssigneeStatusSeverityPMilestoneWhiteboard
110Review GTK+ on VGAJussi KukkonenNEWnormalLowFuture
270native packages should use siteinfo filesJeff PolkACCEPTEDenhancementLowFuture
418uvesafb is required to be a module on qemux86/qemux86-64 targetDarren HartACCEPTEDnormalLowFutureNew Owner
760[script] no options to use kernel nfs server as nfsrootUnassignedNEWenhancementLowFutureMoved from Laurentiu to Unassigned
922"rpm -qa" can not run for non-root user: Permission deniedMark HatleNEWnormalLowFuture
1402x32: valgrind fails to compileAlejandro HernandezNEWminorLowFuture
1467Sync class header comments with reference manualPaul EggletonNEWenhancementLowFuture
1525[multilib] Triggering building a 64 bit kernel with a 32 bit userspaceBruce AshfieldIN PROGRESS DESIGNenhancementLowFuture(Scheduled)
1550Enhance TARGET_VENDOR field supportUnassignedNEWenhancementLowFutureP3
1560Enable recipe specific sysrootsUnassignedACCEPTEDenhancementLowFuture
1570ICU fails if target endian != build host endianRoss BurtonACCEPTEDnormalLowFutureTested on qemuppc, ask for Gary to have a try. May24, 2012
1593Implement factory resetAníbal LimónNEWenhancementLowFuture
1639Tracing: tuna, oscilloscope recipesDarren HartNEWminorLowFuture(Scheduled)
1646Fast boot time documentationDarren HartACCEPTEDenhancementLowFutureDocs remaining
1654Layer tooling: Tool to combine layersPaul EggletonACCEPTEDenhancementLowFuture(Test Case Ready) Implemented feature, still one more issue to address
1657debuginfo exportMark HatleNEWenhancementLowFuture
1658depexp like features without XUnassignedNEWenhancementLowFuture
1683Enable sound for qemux86Saul WoldIN PROGRESS DESIGNenhancementLowFuture
1795Simplify core-image-minimal-initramfs and reduce dependenciesDarren HartACCEPTEDenhancementLowFuture
1893Incremental deb image generationHongxu JiaACCEPTEDenhancementLowFuture(pending)
1952License Compliance: Add GPL-2.0 written offer.Beth FlanaganACCEPTEDenhancementLowFuture(Development)
1953License Compliance: Create License Responsibility FileBeth FlanaganACCEPTEDenhancementLowFuture(Development)
1974BitBake Contributor documentationJoshua LockACCEPTEDenhancementLowFuture
2025runqemu scripts should attempt sane defaults for unkown machinesUnassignedNEWminorLowFuture
2086Rewrite bbvars.py to use bitbake to find variablesUnassignedNEWminorLowFuture
2087Address LTP and POSIX compliance testsUnassignedNEWminorLowFuture
2273Evaluate current image space settingsUnassignedNEWenhancementLowFutureMoved from Laurentiu to Unassigned
2348Cleanup package.bbclass - runstrip and split_and_strip_files checksUnassignedNEWminorLowFuture
2375[yocto-kernel,yocto-bsp] Use python logging module for errors, debug, info, etcDarren HartACCEPTEDminorLowFuture
2413fri2: enable user input buttonUnassignedNEWminorLowFutureMoved from Kevin to Unassigned
2421[Performance] Further improvements for turning off doc generation for -native (and similar) packagesUnassignedNEWenhancementLowFuture
2442feature request: manifest files per licenseFrans MeulenbroeksNEEDINFOenhancementLowFuture
2508Fotowall icons appear abnormal on qemumips sato-sdk images with nightly build (20120523-2)Andrei GherzanACCEPTEDnormalLowFuture
2549[USE CASE] Support live images on emulated targets (hddimg for kvm)Darren HartNEWenhancementLowFuture
2552x32: identify workload & collect benchmark data to show value of x32Alejandro HernandezNEWnormalLowFuture
2588qt builds with symbol visibility support disabledPaul EggletonNEWminorLowFuture
2643no notification is displayed when plugging in a USB stickJussi KukkonenNEWnormalLowFuture
2648gconf.bbclass: should install schemas correctly for native packagesRoss BurtonNEWenhancementLowFuture
2658Create Kernel Device Driver SDK (host-side)Khem RajNEWenhancementLowFuture
2782screen hangs with ttyS0UnassignedNEWnormalLowFuture
2872Implement gitpkgv functionality in fetcherRichard PurdieNEWenhancementLowFuture
2951Review and remove unnecessary uses of _prepend/_appendUnassignedNEWminorLowFuture
3086The do_package process may generate warnings about a missing pythoneggs.py fileMark HatleNEWminorLowFuture
3130Go menu in File Manager gives "operation not supported"Jussi KukkonenNEWnormalLowFuture
3236Eclipse cannot determine eclipse-plugin's sizeJose LamegoNEWnormalLowFuture
3252Binary level package selection and configuration tool.venkata ramana gIN PROGRESS DESIGNenhancementLowFuture
3253adding home automation layer to yoctoAlejandro HernandezNEWenhancementLowFuture
3256Debugging tools and binaries need to be attached to target run timeUnassignedNEWminorLowFuture
3306SRC_URI's for git repos should use 'protocol=http' whenever possibleRichard PurdieNEWenhancementLowFuture
3314Simplify getVar() syntaxRichard PurdieIN PROGRESS IMPLEMENTATIONenhancementLowFuture
3342perf script: improve 'live mode'Tom ZanussiIN PROGRESS IMPLEMENTATIONenhancementLowFuture
3437x32: Verify world build and fix issuesAníbal LimónACCEPTEDenhancementLowFuture
3498RDEPENDS of packages created by PACKAGES_DYNAMIC not built before image rootfsRichard PurdieACCEPTEDenhancementLowFuture
3656rpm2cpio: Segmentation faultMark HatleIN PROGRESS REVIEWnormalLowFuture
3707Who's Who wiki pageJeff Osier-MixonACCEPTEDenhancementLowFuture
3732yocto-bsp is based around having only one kernelMarkus LehtonenNEWenhancementLowFuture
3738fix website page styling on Firefox and IEJeff Osier-MixonACCEPTEDminorLowFuture
3763generate error if file in FILES is not foundUnassignedNEWenhancementLowFuture
3766Need better taxonomy for project categoriesJeff Osier-MixonACCEPTEDnormalLowFuture
3786RPM packaging fails for pkgconfig files with '-' in version fieldMark HatleACCEPTEDminorLowFuture
3987define what a yp.org account doesJeff Osier-MixonACCEPTEDnormalLowFuture
4053Contribute the contrib/vim files to vimTim OrlingACCEPTEDenhancementLowFuture
4085Not all WARNINGS are stored in qa.logRoss BurtonACCEPTEDenhancementLowFuture
4322two mouse pointers in wayland on qemuJussi KukkonenACCEPTEDnormalLowFuture
4349An easy way to find out why a recipe is built and installed (RDEPENDS)Robert YangIN PROGRESS IMPLEMENTATIONenhancementLowFuture
4403stap fails on core-image-sato x86-64Tom ZanussiACCEPTEDnormalLowFuture
4443build-appliance: generate ova packageJuro BystrickyNEWenhancementLowFuture
4508Systemtap plugin should support profilesJose LamegoNEWenhancementLowFuture
4728Binary package selection and image generation from RPM package repovenkata ramana gNEWenhancementLowFuture
4870Allow indirect specification of checksumsRichard PurdieNEWenhancementLowFuture
4909Improve the error message for tray bblayers.conf filesRichard PurdieNEWenhancementLowFuture
4914Not talkative enough error message for /dev/shm issuesPaul EggletonNEWminorLowFuture
4915poky/scripts/rpm2cpio.sh breaks when file utility missingMark HatleNEWnormalLowFuture
4929Add support for pacman as package_pacman/xy.bbclassUnassignedNEWenhancementLowFuture
4965Not possible to pass the preferred version to bitbake on the command lineRobert YangIN PROGRESS DESIGNenhancementLowFuture
4976Add flag for package to signal reboot is required after installationChen QiACCEPTEDenhancementLowFuture
4995SKIP_FILEDEPS should be controllable per-packageSeebsNEWenhancementLowFuture
5005Ability to use rpmbuild to build packages (via the SDK)UnassignedNEWenhancementLowFutureMoved from Laurentiu to Unassigned
5033Way to audit all optional dependenciesHongxu JiaACCEPTEDenhancementLowFuture
5043Extend the layer creation documentation with own bblayers sample creationRichard PurdieNEWenhancementLowFuture
5049Create a WDD like charts for the Performance Test script that we are running regularlyAlexandru GeorgescuIN PROGRESS DESIGNenhancementLowFuture
5140list-packageconfig-flags.py: could not list skipped recipesHongxu JiaACCEPTEDnormalLowFuture
5143systemd: many /lib/libfoo requires a shared library under exec_prefix (/usr) warningsMark HatleNEWnormalLowFuture
5232install prompt missing on serial consoleMariano LopezNEWnormalLowFuture
5424Rationalise core-image.bbclass and image.bbclassPaul EggletonNEWenhancementLowFuture
5426Detect and fail if inherit is used in conf filePaul EggletonNEWenhancementLowFuture
5430Notification systemUnassignedNEWenhancementLowFuture
5437On-target buildable SRPMsMark HatleNEWenhancementLowFuture
5547Allow formfactor data to be read at build timePaul EggletonNEWenhancementLowFuture
5605Add ptest for libavUnassignedNEWenhancementLowFuture
5678Simplest use example for Yocto build environmentJessicaNEWenhancementLowFuture
5695python: ptest cases failedUnassignedNEWnormalLowFutureMoved from Laurentiu to Unassigned
5729Show a warning when nativesdk/native classes are not inherited lastRichard PurdieNEWenhancementLowFuture
5742uclibc detection works only with certain ABIs in perl recipe.David NyströmNEWnormalLowFuture
5774[KEPLER] console output should be cleaned when creating a new recipeJose LamegoNEWminorLowFuture
5782Do not configure sftp for the ssh daemon by defaultUnassignedIN PROGRESS DESIGNminorLowFutureRoxanna is no longer at Intel
5785Make it possible to sync up configurations with defconfigUnassignedNEWenhancementLowFuture
5787[KEPLER] errors in .log when opening a BB commander projectJose LamegoNEWnormalLowFuture
5799add standardized MAINTAINERS infrastructureRichard PurdieNEWenhancementLowFuture
5822No link from /builders to in-progress buildsBeth FlanaganNEWnormalLowFuture
5840MinnowBoard: ioremap error and call traceDarren HartWaitForUpstreamnormalLowFuture
5841Minnow: hda-intel: Invalid position bufferDarren HartNEWnormalLowFuture
5874DNS and proxy configurations should be available in sato images in connman GUI applicationRoss BurtonNEWenhancementLowFuture
5883Add ability to specify locale base directoryPaul EggletonIN PROGRESS IMPLEMENTATIONenhancementLowFuture
6046add Google Calendar mediawiki widgetMichael HalsteadACCEPTEDenhancementLowFuture
6059Add mechanism to define how class should be usedPaul EggletonNEWenhancementLowFuture
6149Setting PREFERRED_PROVIDER to select between multiple runtime providers does not workPaul EggletonNEWnormalLowFuture
6150SVN fetching trusts certificates by defaultZoltan KuscsikNEWnormalLowFuture
6163Implement directfb testing using directfb-examples package.Leonardo Sandoval GonzalezNEWenhancementLowFuture
6212package_rpm breaks when building inside a docker containerLetoThe2ndNEWminorLowFuture
6303Perforce does not take variables from executing shellUnassignedNEWenhancementLowFuture
6386Allow users to disable social media blockMelissa AndersonNEWminorLowFuture
6387Remove the 0 option from YP Compatible fieldMelissa AndersonNEWminorLowFuture
6425Add ability to build a task in isolationPaul EggletonNEWenhancementLowFuture
6433ntpdate installs cron job in /var/spool/cron/rootLiRongQingNEWenhancementLowFuture
6439package gzip tries to use hard links between /bin and /usr/binChen QiNEWnormalLowFuture
6451save which recipe fetches which sourceRobert YangNEWenhancementLowFuture
6478Tweaks to remove cruft from non-rootfs imagesPaul EggletonNEWenhancementLowFuture
6498Latencytop -d does not work for qemuppc and qemuarmUnassignedWaitForUpstreamnormalLowFutureRoxanna is no longer at Intel
6541Enhancements to searchBelen Barros PenaNEWenhancementLowFutureGUI design pending
6573meta-toolchain-qte: Cannot be used to produce "Debug" and "Release" builds of Qt application outside Yocto buildsystemUnassignedNEWnormalLowFuture
6604Clone a Toaster projectBelen Barros PenaNEWenhancementLowFutureGUI design pending
6825I2C dmesg errorDarren HartNEWminorLowFuture
6950bitbake errors must have unique ids to make them easily greppable in the sourceUnassignedNEWenhancementLowFuture
7040Support for /usr merge (à la systemd and Fedora)Peter KjellerstedtNEWenhancementLowFuture
7044Integrate the layer index with the recipe reporting system somehowAníbal LimónNEWenhancementLowFutureGUI design pending
7219Show the file size of the license manifest when available for download in the build dashboardUnassignedNEWenhancementLowFuturebuild dashboard page
7294For QA Issues errors and warnings, toaster should recognize the error and provide suggestions to the user on how the error can be repairedUnassignedNEWenhancementLowFutureGUI design pending
7698Update to next version of buildbotBeth FlanaganNEWenhancementLowFuture
7827Handle if bitbake server code changes when memory residentRichard PurdieNEWenhancementLowFuture
7847Improvement for "Architecture" fieldMichael HalsteadNEWnormalLowFuture
8036Request to allow people to set pagination to allBelen Barros PenaNEWenhancementLowFuture
8095Table results should be sorted in alphabetical order and other secondary criterias.Michael WoodNEWenhancementLowFutureGUI design available
8097Build Appliance: Missing splash screenJuro BystrickyNEWnormalLowFuture
8100Clear taint when recipe rebuildsPaul EggletonNEWenhancementLowFuture
8105oe-selftest: allow breaking out without interrupting the current testLeonardo Sandoval GonzalezNEWenhancementLowFuture
8108Qt unable to be statically build caused by incorrect plugin pathtOtavio SalvadorNEWminorLowFuture
8109fail to build glibc for aarch64 on fedora 22 i686UnassignedNEWnormalLowFuture
8123the aarch64 toolchain can not build iptables on i686 hostUnassignedNEWnormalLowFuture
8425Toaster: A warning should be displayed when you delete a layer dependencyMichael WoodNEWenhancementLowFutureGUI design pending
8434Toaster: package classes (rpm, ipk or deb) should be display in the build configuration pageMichael WoodNEWenhancementLowFutureGUI design pending
8577Add a global UI widget to show progress of buildsBelen Barros PenaNEWenhancementLowFutureGUI design pending
8583strace shows accesses in non-existent location.Juro BystrickyIN PROGRESS DESIGNminorLowFuture
8621EXPORT_FUNCTIONS on fakeroot task function doesn't actually end up as a fakeroot taskRichard PurdieNEWminorLowFuture
8664Investigate if -mtls-dialect=gnu2 support within the prelinker behaviorMark HatleNEWminorLowFuture
8666Add bash completion to argparse-using scriptsLeonardo Sandoval GonzalezNEWenhancementLowFuture
8677Layer index: allow searching the metadataPaul EggletonNEWenhancementLowFuture
8685Enter button doesn't apply your modification to bitbake variablesToaster default assigneeNEWnormalLowFuture
8769Integrating wic into ToasterToaster default assigneeNEWenhancementLowFuture
8807local cached layers don't get the branch checked outEd BartoshNEWnormalLowFuture
9117Allow "project builds" and "all builds" to be sorted by time and recipe nameToaster default assigneeNEWnormalLowFuture
9118Dead paths for meta-toaster-custom layer left behind in bblayers.confToaster default assigneeNEWnormalLowFuture
9141toaster when xmlrpc/cooker dies the web didn't tell the user about itElliot SmithNEWnormalLowFutureGUI design pending
9203Automatically paginate bitbake -e outputJoshua LockNEWenhancementLowFuture
9227Dependency chain analysis isn't optimalRichard PurdieNEWnormalLowFuture
9618Warnings when ICECC is enabledRichard PurdieNEWnormalLowFuture
139Set default gcc instruction generation to TARGET_ARCH on targetUnassignedNEWenhancementMediumFuture
256Sync up RPM version policy with rest of system (including support '~' in version strings)UnassignedNEWenhancementMediumFutureMoved from Laurentiu to Unassigned
405Add a mechanism to do pre-build sanity based on specific configurationsMariano LopezACCEPTEDenhancementMediumFuture
1139Search all layers when directory/wildcard specified instead of stopping at first matchPaul EggletonNEWenhancementMediumFuture
1331Prelink: doesn't work on ppc64Mark HatleNEWnormalMediumFuture
1600Enhance the deploy in remote debugTim OrlingWaitForUpstreamenhancementMediumFuture
1803Add helper shell commandsRichard PurdieNEWenhancementMediumFuture
1924[LTP] 'vma01' case failed on non-x86 platforms with Yocto 1.2 M2 rc1Yang ShiWaitForUpstreamnormalMediumFuture
2045Begin to regularly retire variablesAlexandru GeorgescuIN PROGRESS DESIGNnormalMediumFuture
2082Additional test case: shared sstate-cache between usersLeonardo Sandoval GonzalezNEWenhancementMediumFuture
2267Integrate DISTRO_FEATURES with KERNEL_FEATURESBruce AshfieldIN PROGRESS DESIGN COMPLETEenhancementMediumFutureDEFINE AND RESOLVE
2394Yocto BSP Tools: add 'publish' support for the kernelMarkus LehtonenACCEPTEDenhancementMediumFuture
2484When the baselib does not match the expected library path, prelinking is not done.Mark HatleNEWenhancementMediumFuture
3059psplash doesn't blend if image contains alpha channelRoss BurtonNEWenhancementMediumFuture
3065Add support to check versions of host tools and only build of olderRichard PurdieNEWenhancementMediumFuture
3129Playing games like Inertia while using on screen keyboard has graphical issuesJussi KukkonenNEWnormalMediumFuture
3276PulseAudio isn't testedLeonardo Sandoval GonzalezNEWenhancementMedium2.3
3355changing font size to '2' lead to some of icons lostJussi KukkonenNEWnormalMediumFuture
3358perf: enable new 'perf trace' toolAlejandro HernandezNEWenhancementMediumFuture
3359perf: add perf-dwarf featureAlejandro HernandezNEWenhancementMediumFuture
3362Improve dependency analysis toolsPaul EggletonNEWenhancementMediumFuture
3429Updater: create infrastructure to support direct image upgradingMariano LopezACCEPTEDenhancementMediumFuture
3443git fetcher: support a more appendable syntax for supporting multiple branches in the SRC_URIRichard PurdieNEWenhancementMediumFuture
3463Define PREEMPT_RT validation suiteUnassignedACCEPTEDenhancementMediumFuture
3527Drop down arrow drawn outside of drop down box on Firefox 17 (Fedora 17)Jeff Osier-MixonIN PROGRESS DESIGNminorMediumFuture
3724Smart: Performance enhancement for Incremental InstallMark HatleNEWenhancementMediumFuture
3733Add content to the FAQ systemJeff Osier-MixonIN PROGRESS DESIGN COMPLETEminorMediumFuture
3737add more content to the websiteJeff Osier-MixonACCEPTEDnormalMediumFuture
3740Future enhancements/fixes for websiteJeff Osier-MixonACCEPTEDenhancementMediumFuture
3877redesign documentation page presentationJeff Osier-MixonIN PROGRESS DESIGNenhancementMediumFuture
3887Merge buildstats into build history and have one data collection mechanismUnassignedIN PROGRESS DESIGNenhancementMediumFuture
3950Please add a reference to SMC Licensing Compliance presentation on YP's capabilitiesJeff Osier-MixonACCEPTEDnormalMediumFuture
3952adjust formatting of compliance program emailsJeff Osier-MixonACCEPTEDnormalMediumFuture
3953update compliance program formsMichael HalsteadIN PROGRESS IMPLEMENTATIONnormalMediumFuture
3976Support ~ in package versionsUnassignedNEWenhancementMediumFutureMoved from Laurentiu to Unassigned
3990qemuarm and qemuppc poky-tiny images can not boot up via "runqemu qemuarch ramfs" commandJackie HuangNEWenhancementMediumFuture
3999provide description and compatibility data with kern-features.rcBruce AshfieldIN PROGRESS DESIGNenhancementMediumFuture
4011Merge machine specific config recipes into one recipe to rule them allRichard PurdieIN PROGRESS DESIGNenhancementMediumFuture
4021no recipe changed, script "bitbake-whatchanged" could also list some tasks need to be updatedRobert YangIN PROGRESS REVIEWnormalMediumFuture
4059init-install.sh assumes boot device is the same as the one selected when it is runUnassignedNEWnormalMediumFuture
4063pseudo's logging and diagnostics are not very clearSeebsNEWenhancementMediumFuture
4091Add support to bitbake fetcher to fetch files from bare repos for PREMIRRORSMark HatleNEWenhancementMediumFuture
4120rootfs_deb doesn't support BAD_RECOMMENDATIONSHongxu JiaNEWenhancementMediumFutureIMAGEGEN
4121latencytop support for mipsMarkNEWenhancementMediumFuture
4148Add a mechanism to build a package that is the same bitsize as the machineMark HatleNEWenhancementMediumFuture
4155i.MX6: VPU plugins for GStreamer do not work with appsinkOtavio SalvadorIN PROGRESS REVIEWmajorMediumFuture
4156HTML5 video in GStreamer-enabled WebKit doesn't work with VPU accelerationOtavio SalvadorNEWminorMediumFuture
4285tasks: Visualising relationships between tasksBelen Barros PenaACCEPTEDenhancementMediumFuture
4301recipes: Visualising brought in by relationships between recipesBelen Barros PenaACCEPTEDenhancementMediumFuture
4304Do automated upgrade path testingLeonardo Sandoval GonzalezNEWenhancementMediumFuture
4329Visualising dependency and recommends relationships between packagesBelen Barros PenaACCEPTEDenhancementMediumFuture
4330Visualising overall package sizeBelen Barros PenaACCEPTEDenhancementMediumFuture
4331Visualising single package sizeBelen Barros PenaACCEPTEDenhancementMediumFuture
4339psplash doesn't work with systemdChen QiNEWnormalMediumFutureRelease Note 1.4
4376Visualising directory structure of built imagesBelen Barros PenaACCEPTEDenhancementMediumFuture
4384Visualising build time informationBelen Barros PenaACCEPTEDenhancementMediumFuture
4399recipes: Visualising dependency relationships between recipesBelen Barros PenaACCEPTEDenhancementMediumFuture
4400Visualising brought in by relationships between packagesBelen Barros PenaACCEPTEDenhancementMediumFuture
4402Customise the summary of all the information available for one build + image recipe combinationUnassignedNEWenhancementMediumFuture
4411set up a "planet"-style blog aggregator on the websiteMichael HalsteadIN PROGRESS DESIGNenhancementMediumFuture
4436Add ptest for glibcUnassignedNEWenhancementMediumFutureMoved from Laurentiu to Unassigned
4437Add ptest for gccUnassignedNEWenhancementMediumFutureMoved from Laurentiu to Unassigned
4442systemtap: make it usable on-targetTom ZanussiACCEPTEDnormalMediumFuture
4479Easy way to see all individual builds for a buildBeth FlanaganNEWenhancementMediumFuture
4516SPDX License Manifests for ImagesBeth FlanaganACCEPTEDenhancementMediumFuture
4517SPDX swabber.Beth FlanaganACCEPTEDenhancementMediumFuture
4525Use buildhistory to log key values and track regressionUnassignedNEWenhancementMediumFuture
4526Record image size from buildhistory to track regressionUnassignedNEWenhancementMediumFuture
4530gconv data needs virtual providersRoss BurtonNEWenhancementMediumFuture
4538[Minnow] Audio mixer controls are inconsistentDarren HartACCEPTEDnormalMediumFuture
4564Eclipse plugin must detect if eclipse was started in a poky sourced environmentTim OrlingNEWenhancementMediumFuture
4577Write a blog post about x32Jeff Osier-MixonNEWenhancementMediumFuture
4578x32 ABI performance comparisonUnassignedNEWenhancementMediumFuture
4579Create "How to Get Help" pageJeff Osier-MixonACCEPTEDnormalMediumFuture
4610Display “Title - Presenter, Organization” on Presentations without creating duplicate entriesMelissa AndersonNEWnormalMediumFuture
4613Add advisory board members as usersJeff Osier-MixonNEWnormalMediumFuture
4614Convert image on /downloads to use spritesJeff Osier-MixonNEWminorMediumFuture
4794Update the ConcatStats report from the mediawiki reporting extensionMihail StanciuNEWnormalMediumFuture
4836Make update-alternatives mechanism in OE/Yocto more robustChen QiACCEPTEDenhancementMediumFuture
5011[Minnow] "poweroff" command causes a hangDarren HartACCEPTEDnormalMediumFuture
5069Eclipse TCF can support arm cpu debug now,but tcf-agent_git.bb can't do it this time.David ReynaNEWenhancementMediumFuture
5083ssh timeout too longJose LamegoWaitForUpstreamnormalMediumFuture
5087Sometimes building under BA can fail due to make utility reporting timestamps anomaliesJuro BystrickyNEWnormalMediumFuture
5098gpu-viv-bin-mx6q-3.5.7-1.0.0-alpha.2-sfp.bin and gpu-viv-bin-mx6q-3.5.7-1.0.0-alpha.2-hfp.bin are missing OpenGL headersDaianeNEWnormalMediumFuture
5142WARNING: QA Issue on kmod/udev/nfs-utils/gzip/iputils (unsafe references [/ references to /usr/lib])Robert YangNEWnormalMediumFuture
5157LSB perl tests: op/stat.t 167 unreported No resultHongxu JiaWaitForUpstreamnormalMediumFuture
5158LSB printing tests: 11 failures for 'Printing Tests'Hongxu JiaWaitForUpstreamnormalMediumFuture
5163no external tools displayed when first trying to run QEMU - test case 48 failed on Ubuntu 12.04 x86-64 host(build 1.5 M4 rc2)Jose LamegoNEWnormalMediumFutureMoved from Cristiana to Unassigned
5234ConcatStats reports ignore RUNNING case runs in % statisticsMihail StanciuNEWnormalMediumFuture
5243ERROR: QA Issue: linux-mainline: Files/directories were installed but not shippedKoen KooiNEWnormalMediumFuture
5255Provide access to tasks executable output in ToasterElliot SmithACCEPTEDenhancementMediumFutureGUI design pending
5264Way to install all PACKAGES of a recipeHongxu JiaACCEPTEDenhancementMediumFuture
5285powertop: Eclipse plugin output is useless for new versions of powertopJose LamegoNEWenhancementMediumFuture
5305Make sanitized kernel headers availableBruce AshfieldIN PROGRESS IMPLEMENTATIONenhancementMediumFuture
5331error play video via gstreamer with "mfw_isink"Otavio SalvadorNEWcriticalMediumFuture
5346Investigate build performance variance between different host OS-es on same HWAlexandru GeorgescuNEWnormalMediumFuture
5349Add compiling tests to Image Tests for different memory sizes set for QEMULeonardo Sandoval GonzalezNEWenhancementMediumFuture
5389bitbake/lib/bb/fetch2: filename too longRobert YangIN PROGRESS IMPLEMENTATIONnormalMediumFuture
5399Sharing PR server between builders with different metadataLeonardo Sandoval GonzalezNEWenhancementMedium2.3
5421Support multiple MACHINE installs per SDKRichard PurdieNEWenhancementMediumFuture
5429Add ability for SDK-from-image to pick up additional host/target tools automaticallyOtavio SalvadorNEWenhancementMediumFuture
5431Investigate and document uClibc limitationRoss BurtonNEWenhancementMediumFuture
5455Add buck-security and other meta-security tests to automated testingLeonardo Sandoval GonzalezNEWenhancementMediumFuture
5483Extend Image creation to include workflow for security checkingBelen Barros PenaACCEPTEDenhancementMediumFuture
5533bitbake -g can't figure out non-existed packagesRobert YangIN PROGRESS DESIGNnormalMediumFuture
5538Implement Backend API controller for buildbotUnassignedNEWenhancementMediumFuture
5600Sync the Glossary section with documentation.confScott RifenbarkIN PROGRESS REVIEWenhancementMediumFuture09 February 2015: IN PROGRESS REVIEW
5601Merging the Glossary and the Variable Context sectionsScott RifenbarkIN PROGRESS REVIEWenhancementMediumFuture20 January 2015: IN PROGRESS REVIEW
5648Add a field license_files to package informationElliot SmithACCEPTEDenhancementMediumFuture
5660Weston doesn't work properly on qemuAlejandro HernandezACCEPTEDenhancementMediumFuture
5675Add a ROOT_PASSWD feature for imagesChen QiNEWenhancementMediumFuture
5677Verify postinstall behaviourRoss BurtonNEWenhancementMediumFuture
5697busybox: ptest cases failedChen QiNEWnormalMediumFuture
5698bash: ptest cases failedHongxu JiaNEWnormalMediumFuture
5709Add possibility to control event handlers orderRichard PurdieNEWenhancementMediumFuture
5713systemtap displays blank pop-up error windowDavid ReynaNEWnormalMediumFutureMoved from Cristiana to Unassigned
5725Add QA check for installing Python EggsRoss BurtonNEWenhancementMediumFuture
5839Add automated tests for hard dependencies and setscene tasks.Leonardo Sandoval GonzalezNEWenhancementMediumFuture
5854Investigate sstate package compression improvementsPaul EggletonNEWenhancementMediumFuture
5876Add a test for the kernel -c menuconfig optionLeonardo Sandoval GonzalezNEWenhancementMediumFuture
5889Add Delta rpm/deb/ipkg support to reduce the size of package updates.Randy WittNEWenhancementMediumFuture
5955Enhance PATCHTOOL = "git" to be able to pop off patch seriesUnassignedNEWenhancementMediumFuture
6043Deploy images collide across kernel recipesDarren HartACCEPTEDenhancementMediumFuture
6044EFI_PROVIDER recipes deploy collisionsDarren HartACCEPTEDnormalMediumFuture
6095Retrieve full build information independently of task executionDavid ReynaNEWenhancementMediumFuture
6119verify that perf test command worksAlejandro HernandezNEWnormalMediumFuture
6153Archiver causes manifest warnings for the toolchainRobert YangNEWnormalMediumFuture
6158Encourage best-practice configuration usageScott RifenbarkIN PROGRESS DESIGNenhancementMediumFuture20 January 2015: IN PROGRESS DESIGN
6170Toaster needs to expose errors/warnings in its own logsMichael WoodNEWnormalMediumFutureGUI design available
6233Design model for project owner / userBelen Barros PenaACCEPTEDenhancementMedium2.3GUI design pending
6234Implement model for project owner / userUnassignedNEWenhancementMedium2.3
6259Investigate OSTree integrationMark HatleNEWenhancementMediumFuture
6282Use glob patterns/better builder namesBeth FlanaganNEWenhancementMediumFuture
6307Package grub-efi modules and scripts similar to grub-biosBill MillsNEWenhancementMediumFuture
6308grub-efi deployed image should be netboot capable and have some debug helpBill MillsNEWenhancementMediumFuture
6317Incorrect dependencies for -native recipesRichard PurdieNEWnormalMediumFuture
6356run QEMU nfs with multiple NICsAdrianIN PROGRESS REVIEWenhancementMediumFuture
6365Implement web-based voting system for advisory board membersJeff Osier-MixonIN PROGRESS REVIEWenhancementMediumFuture
6383detect invalid sstate mirrorsRichard PurdieNEWenhancementMediumFuture
6405Default to asking for a single path to the SDK in the pluginDavid ReynaNEWenhancementMediumFuture
6434Add option to package .py/.pyc/both in Python packagesRoss BurtonNEWenhancementMediumFuture
6547Gstreamer on the BeagleBone black gets a Segmentation faultDenys DmytriyenkoNEWnormalMediumFuture
6580[PATCH] Breaks builds when running as confined SELinux userSeebsNEWnormalMediumFuture
6603Export / Import Toaster projectsBelen Barros PenaNEWenhancementMediumFutureGUI design pending
6649Ability to report locked sigs deltaUnassignedNEWenhancementMediumFuture
6670all compatible recipes page should link to layer source recipe with the layer nameUnassignedNEWenhancementMediumFuture
6701Provide an option to select layers from different branches within a Toaster projectBelen Barros PenaNEWenhancementMedium2.3GUI design pending
6706Include maintainers list for layersUnassignedNEWenhancementMediumFuture
6712Modify the default Bootstrap behaviour of tooltips and popovers triggered on hoverMichael WoodNEWenhancementMediumFuture
6737Extend automated ptest testing to work with opkgLeonardo Sandoval GonzalezNEWenhancementMediumFuture
6760i.MX6: not possible to run X11 without tearing / with proper vsyncOtavio SalvadorNEWnormalMediumFuture
6764License whitelistingBeth FlanaganNEWenhancementMediumFuture
6778Add "import layer" to layer suggestions drop downUnassignedNEWenhancementMediumFutureproject configuration page
6794Add last commit information to ToasterDavid ReynaNEWenhancementMediumFutureGUI design available, layer details page
6806Smart failure when running bitbake over and overRobert YangACCEPTEDmajorMediumFuture
6838toaster must be able to submit error reports for failed builds from the interfaceElliot SmithACCEPTEDenhancementMediumFutureGUI design pending
6840Seeing builds delta in ToasterUnassignedNEWenhancementMediumFutureGUI design pending
6855Add comprehensive regression tests for shared state functionalityRandy WittNEWenhancementMediumFuture
6891Port depexp to python GIRoss BurtonNEWenhancementMediumFuture
6897Customise the Django admin interfaceUnassignedNEWenhancementMediumFutureGUI design pending
6898Design Toaster configuration interfaceBelen Barros PenaNEWenhancementMediumFutureGUI design pending
6900Toaster should tell you when one of your local.conf variables has been overridenBelen Barros PenaNEWenhancementMediumFutureGUI design pending
6910Use sticky headers for long tablesMichael WoodNEWenhancementMediumFuture
6915Toaster should handle ASSUME_PROVIDEDBelen Barros PenaNEWenhancementMediumFutureGUI design pending
6916Toaster should turn QA check names in warnings / errors into linksBelen Barros PenaNEWenhancementMediumFutureGUI design pending
6937install package "postinst-intercept pointercal-xinput oprofileui avahi" to image failedHongxu JiaACCEPTEDnormalMediumFuture
6953Branding SupportBelen Barros PenaNEWenhancementMediumFuture
6954Toaster Kernel Configuration ToolBelen Barros PenaNEWenhancementMediumFuture
6957[toolchain/uclibc]very long pathsRobert YangACCEPTEDnormalMediumFuture
6978For the local release in Toaster, show local path to layer directory instead of Git URLUnassignedNEWenhancementMediumFutureproject configuration page
6980Add support for generate Package Stagger ChartBelen Barros PenaNEWenhancementMediumFutureGUI design pending
6986linux-yocto do_patch fails with a long working directory pathBruce AshfieldIN PROGRESS DESIGNnormalMediumFuture
7037Support for perl in "recipetool create"Paul EggletonNEWenhancementMediumFuture
7038For cached tasks, indicate in which URL the sstate object was foundUnassignedNEWenhancementMediumFuture
7080Allow bugs to target multiple milestonesMichael HalsteadIN PROGRESS IMPLEMENTATIONenhancementMediumFuture
7087Add another chart to the WikiMichael HalsteadNEWenhancementMediumFuture
7110Builds of "world" are pretty ugly in toaster UIBelen Barros PenaNEWenhancementMediumFutureGUI design pending
7234warn the user if the project configuration settings aren't reflected in the buildBelen Barros PenaACCEPTEDenhancementMediumFutureGUI design pending
7235warn the user about unexpected configuration changes in variable historyBelen Barros PenaNEWenhancementMediumFutureGUI design pending
7327Add git hook to update bug statusMichael HalsteadNEWenhancementMediumFuture
7328Package feed publishing toolRandy WittIN PROGRESS IMPLEMENTATIONenhancementMediumFuture
7344bind hits new parallel make issueKai KangNEWnormalMediumFuture
7355Strange outcome in Toaster 'covered' tasks queriesUnassignedNEWnormalMediumFuture
7421gummiboot fails to compile with x32 ABIMariano LopezNEWminorMediumFuture
7433qt4-x11-free fails to compile with x32 ABIAníbal LimónWaitForUpstreamnormalMediumFuture
7434qt4-embedded fails to compile with x32 ABIMariano LopezNEWminorMediumFuture
7435webkit-gtk fails to compile with x32 ABIAníbal LimónWaitForUpstreamnormalMediumFuture
7457Split "Previous Build" tasksUnassignedNEWenhancementMediumFuture
7492AUH: Add support for persist statisticsAníbal LimónNEWenhancementMediumFuture
7503Add support for MultiPath TCP for YP Linux images/specific imageUnassignedNEWenhancementMediumFuture
7521Redesign our filters mechanismBelen Barros PenaNEWenhancementMediumFutureGUI design pending
7527Integrate Toaster with JenkinsUnassignedNEWenhancementMediumFuture
7533eclipse-plugin build scripts don't fail correctly.Tim OrlingNEWnormalMediumFuture
7556Create cross-compilation project with existing codeTim OrlingNEWenhancementMediumFuture
7596variable type support in project configuration pagesElliot SmithNEWenhancementMediumFuture
7649Tool to test for corrupt files that were installed from packagesRandy WittNEWenhancementMediumFuture
7650Replace corrupted files detected by the "Corrupt file checker"Randy WittNEWenhancementMediumFuture
7656patchwork: auto-delegate patchesJose LamegoNEWenhancementMediumFuture
7684patchwork: provide email notificationsJose LamegoNEWenhancementMediumFuture
7696Recipe GitPollerBeth FlanaganNEWenhancementMediumFuture
7727toaster: show bbappend information for recipesUnassignedNEWenhancementMediumFutureGUI design pending
7742Remove constraints when setting the layers checkout directoryUnassignedNEWenhancementMediumFuture
7747Improve messaging when Toaster is launched with no releases setMichael WoodACCEPTEDenhancementMediumFutureGUI design pending
7748Provide a way to do a Toaster cleanup and start again if you get the initial set up wrongUnassignedNEWenhancementMediumFuture
7751Toaster allows me to build when no machine is set in the default configurationMichael WoodNEWnormalMediumFutureGUI design available
7792Layer compatible branches expansionPaul EggletonNEWenhancementMediumFuture
7794Design Toaster First UseTiago RamosNEWenhancementMediumFutureGUI design pending
7802Insufficient info provided when a recipe fails.Richard PurdieNEWenhancementMediumFuture
7811Buffer corruption after resizing wayland clientOtavio SalvadorACCEPTEDnormalMediumFuture
7821Add OpenOCD JTAG supportTim OrlingNEWenhancementMediumFuture
7825Vivante: Spurious frame sent to compositor after hiding Wayland windowOtavio SalvadorNEWnormalMediumFuture
7869RRS: Modularize update script in order to merge into Layer indexAníbal LimónIN PROGRESS REVIEWenhancementMediumFuture
7887Add support for user networking to runqemuSaul WoldACCEPTEDenhancementMediumFuture
7945Toaster startup script assumes it's in a git repositoryToaster default assigneeNEWmajorMediumFuture
7954pigz has resource race issuesUnassignedNEWnormalMediumFuture
8003Updater: Make a filesystem suitable for the Stefano UpdaterMariano LopezIN PROGRESS IMPLEMENTATIONenhancementMediumFuture
8008Expose branch mapping through the layer index UIUnassignedNEWenhancementMediumFuture
8218Provide a way to update layer information from the Toaster GUIElliot SmithNEWenhancementMediumFutureGUI design pending
8220We need to enable an exclusion list in toasterconf.json to drop layers from layers.openembedded.orgbrian averyNEWenhancementMediumFuture
8230toaster upload failures on autobuilderMichael HalsteadNEWnormalMediumFuture
8323fetch2/hg mirror tarballs are kinda brokenRichard TollertonNEWnormalMediumFuture
8330support prserver instancebrian averyNEWenhancementMediumFuture
8331Dropdown menus should populate from cfg file so they can be more easily extended,brian averyACCEPTEDenhancementMediumFuture
8366Build the specific recipe versionMichael WoodNEWenhancementMediumFuture
8391vncserver setup/tear down not concurrency safebrian averyACCEPTEDmajorMediumFuture
8392Explicit matrix build axes for machine, imagebrian averyNEWenhancementMediumFuture
8394patchwork: ensure that patches received during a PW server outage are processedJose LamegoNEWenhancementMediumFuture
8413package_qa: check files under /etc/ are marked by CONFFILESRobert YangNEWnormalMediumFuture
8424Toaster: Compatible recipes tab should display the machine compatible recipesElliot SmithNEWenhancementMediumFutureGUI design pending
8426Improve how we display layer dependenciesBelen Barros PenaNEWenhancementMediumFutureGUI design pending
8429Re-work import layer behaviourMichael WoodNEWenhancementMediumFutureGUI design pending
8442patchwork: Publish patch update log informationJose LamegoNEWenhancementMediumFuture
8455Add tests to empty imageLeonardo Sandoval GonzalezNEWminorMedium2.3
8488Collect variable information for the image scopeEd BartoshNEWenhancementMediumFutureGUI design pending
8500Evaluate and possibly integrate Data-Driven Tests framework for TCsLeonardo Sandoval GonzalezNEWenhancementMediumFuture
8591bitbake world needs a lot of time for "Preparing RunQueue"dengkeNEWenhancementMediumFuture
8705Store valid values for variables in the Toaster databaseToaster default assigneeNEWenhancementMediumFuture
8729grub: create a script to boot between rootfs and a maintenance partitionMariano LopezIN PROGRESS DESIGNenhancementMediumFuture
8744Need to standardize on a formate for security bugsArmin KusterNEWnormalMediumFuture
8745DEPENDS/RDEPENDS add support for version constraintRichard PurdieNEWenhancementMediumFuture
8755Remote signing of RPM packagesMarkus LehtonenIN PROGRESS REVIEWenhancementMediumFuture
8790Boostrapping package information for image customisation purposesToaster default assigneeNEWnormalMediumFuture
8794RRS: Add support for user interaction (umbrella bug)Aníbal LimónNEWenhancementMediumFutureGUI design pending
8797updater: create a new layer for image base updateMariano LopezIN PROGRESS DESIGNenhancementMediumFuture
8798updater: modify grub-efi recipe to support image base updatesMariano LopezIN PROGRESS DESIGNnormalMediumFuture
8799updater: create a script to package images into cpio filesMariano LopezIN PROGRESS DESIGNnormalMediumFuture
8819https://www.yoctoproject.org/tools-resources/community/mailing-lists should mention new MLsJeff Osier-MixonACCEPTEDenhancementMediumFuture
8866Home-brew JSON encoding is ad hoc and incompleteToaster default assigneeNEWenhancementMediumFuture
8875Create Eclipse Yocto Plugin wizard UI for Yocto recipes creation/edition using devtoolJose LamegoNEWnormalMediumFuture
8896Enable sorting by number of dependenciesToaster default assigneeNEWenhancementMediumFutureGUI design pending
8942Release Scripts for Automation of Major/Point/Milestone ReleasesTracy GraydonIN PROGRESS IMPLEMENTATIONenhancementMediumFuture
8955Recipe explorerToaster default assigneeNEWenhancementMediumFuture
8959Allow Toaster to run images on simulator, even a custom oneToaster default assigneeNEWenhancementMediumFuture
9005Provide build cancellation functionality for command line buildsSujith HNEWenhancementMediumFuture
9007Write BitBake contribution guidelinesJoshua LockNEWnormalMediumFuture
9070Add test that locales are workingLeonardo Sandoval GonzalezNEWenhancementMedium2.3
9080Autobuilder/oe-selftest: Have a way to specify a which oe-self tests get run on a forced AB jobLeonardo Sandoval GonzalezNEWnormalMedium2.3
9085Build QA Warnings: add a test for unlisted dependenciesLeonardo Sandoval GonzalezNEWnormalMedium2.3
9109Apply sleep 0.5 to other database operationsToaster default assigneeNEWnormalMediumFuture
9129Enhance Test Suite scanning and executionLeonardo Sandoval GonzalezNEWenhancementMedium2.3
9140Eclipse plugin testing enable work on other distrosLeonardo Sandoval GonzalezNEWenhancementMedium2.3
9153Enhance build performance dataBelen Barros PenaACCEPTEDenhancementMediumFutureGUI design pending
9166Need to document the do_devpyshell task that is in the devshell.bbclassRichard PurdieACCEPTEDenhancementMediumFuture
9222Create a notification styleMichael HalsteadNEWenhancementMediumFuture
9331searching on google almost always returns some outdated linkMichael HalsteadNEWenhancementMediumFuture
9418Support using existing OE setupsToaster default assigneeNEWenhancementMedium2.3
9441Enable back web analyticsElliot SmithNEWnormalMediumFuture
9467Add 2 new components to the layers productMichael HalsteadIN PROGRESS REVIEWnormalMediumFuture
9583Refactor Toaster database schemaToaster default assigneeNEWenhancementMediumFuture
9643Add a means of showing which variables triggered confighash changePaul EggletonNEWenhancementMediumFuture
9669No category for OE-core/recipes-extendedMichael HalsteadNEWnormalMediumFuture
4284Presenting information provided by the diffsigs toolUnassignedNEWenhancementMedium+Future
6640Customise BitBake and layer versions in a projectBelen Barros PenaNEWenhancementMedium+2.3GUI design pending
8435some layers have duplicate entries for recipesPaul EggletonNEWnormalMedium+Future
8493Automate manual BSP test casesLeonardo Sandoval GonzalezNEWenhancementMedium+2.3
8505Add Bluetooth testing suiteLeonardo Sandoval GonzalezNEWenhancementMedium+2.3
8506Add WiFi testing suiteLeonardo Sandoval GonzalezNEWenhancementMedium+2.3
8507Add NFC testing suiteLeonardo Sandoval GonzalezNEWenhancementMedium+2.3
 434      

Quarterly Milestones

IDSummary (3 tasks) AssigneeStatusSeverityPMilestoneWhiteboard
94701.8.1. documentation missing from the websiteMichael HalsteadNEWnormalMedium+Q2
9522Documentation isn't cachableMichael HalsteadACCEPTEDnormalMedium+Q2
9558Documentation for 1.7.3 is missingMichael HalsteadNEWnormalMedium+Q2
 3      
Personal tools