Bug Triage Archive

From Yocto Project
Jump to: navigation, search

Contents

Medium+ Bugs

IDSummary (277 tasks) SeverityPMilestoneAssigneeStatusWhiteboardE
13788zeus-nut] selftest failure PackageTests.test_gdb_hardlinknormalMedium+3.0.5Randy MacLeodNEW
13668cgit dark theme doesn't show tags clearlynormalMedium+3.1 M2Michael HalsteadNEW
13035Extend autobuilder worker bringup testing to include limit changesminorMedium+3.1 M4Michael HalsteadNEW0.2
13672Pushing recent OE-Core changes gave patchwork tracebacknormalMedium+3.1 M4Michael HalsteadNEW
13833Request to create a repository for a new meta layer: meta-intel-edge-consolidationnormalMedium+3.1 M4Michael HalsteadNEW
13888Toaster is not starting for Django-3majorMedium+3.1.7David ReynaIN PROGRESS REVIEW2
14031Exception: KeyError: 'getpwuid(): uid not found: 1000' after 3.1.1 to 3.1.2 updatenormalMedium+3.1.7Steve SakomanNEW
14189Intermittent oe-selftest-debian fails with do_rootfs: No manifest generated from: mdadmnormalMedium+3.1.7UnassignedNEWAB-INT
11766"nobody" group added by systemd sysusers.dnormalMedium+3.3 M1Yi ZhaoACCEPTED5
14157git fetcher: consider using different git commands for repo packing, eliminating "git pack-redundant"normalMedium+3.3 M3akusterNEWbackports perhaps
14136If u-boot defconfig is incomplete, 'bitbake u-boot -c configure' hangs and eats all memorynormalMedium+3.3 M3akusterACCEPTED
14185Git 2.30.0 defaults to mainnormalMedium+3.3 M3akusterACCEPTED
14188Missing packages on brand new Fedora 33normalMedium+3.3 M3akusterNEWwith backport
13731Cross canadian GCC fails to find header files when using tclibc-newlibnormalMedium+3.3 M3AlejandroACCEPTED
13417Development manual coverage of devtoolnormalMedium+3.3 M3Paul EggletonACCEPTED1
14047eSDK: python3.5.real: No such file or directorynormalMedium+3.3 M3Paul EggletonNEWBackport to 3.1.x
13625test_devtool_add_library fails in multilib setupsnormalMedium+3.3 M3Paul EggletonNEW
13079devtool documentation needs to mention oe-local-filesnormalMedium+3.3 M3Paul EggletonIN PROGRESS REVIEW24 June 2018: IN PROGRESS DESIGN3
13954Invalid layerindex data causing backtrace in `bitbake-layers layerindex-fetch`normalMedium+3.3 M3Paul EggletonNEW
14060devtool modify fails when applied on recipes using patchesmajorMedium+3.3 M3Paul EggletonNEW
14146Post-patch hook fails with submodules and PATCHTOOL=git and PATCH_COMMIT_FUNCTIONS=1normalMedium+3.3 M3Paul EggletonNEW
13190RRS cannot handle multiple recipes with same PNnormalMedium+3.3 M3Paul EggletonIN PROGRESS REVIEW
13527Add SPDX license headers to all source files for layerindex-webnormalMedium+3.3 M3Ida DelphineIN PROGRESS DESIGNNEWCOMER
13919Multi License GPLv3 -lic cannot be installed into the image because it has incompatible licensenormalMedium+3.3 M3Ida DelphineNEW
13533Devtool finish on _git package with SRCPV in PV points to wrong WORKDIRnormalMedium+3.3 M3Jaewon LeeIN PROGRESS REVIEW
13903npmsw fetcher fails if multiple recipes have common npm packagesnormalMedium+3.3 M3Jean-Marie LemetayerNEW
13901npm build error when the shrinkwrap file has no dependenciesminorMedium+3.3 M3Jean-Marie LemetayerNEW
13722Debugging With the GNU Project Debugger enhancementsnormalMedium+3.3 M3John KaldasNEWNEWCOMER
13550username/password specified to gitsm:// does not get propagated to submodulesnormalMedium+3.3 M3Mark HatleNEW
13808do_task[noexec] = "" marks task noexec, which is inconsistent with docsnormalMedium+3.3 M3Chris LaplanteNEW
13566Write tests for multiconfig files in layers and documentnormalMedium+3.3 M3Chris LaplanteACCEPTED
14040recipetool: creating binary recipe from upstream git repo without explicit PV causes circular reference in SRC_URInormalMedium+3.3 M3Chris LaplanteNEW
14168#new-recipe-makefile-based-package does not exist anymorenormalMedium+3.3 M3Nicolas DechesneNEW
14120pkg_postinst_ontarget_${PN}normalMedium+3.3 M3Robert BergerNEW
14116Go cannot compile on targetnormalMedium+3.3 M3Khem RajNEW
14192gcc/kernel: crypto/aegis128-neon-inner.c can not be built anymorenormalMedium+3.3 M3Khem RajNEW
14254oe-selftest-centos: gotoolchain.oeGoToolchainSelfTest.test_go_dep_build failednormalMedium+3.3 M3Khem RajNEW
13891insane.bbclass: do_package_qa hangs when checking a FIFO (named pipe) filenormalMedium+3.3 M3Trevor WoernerIN PROGRESS REVIEW
14100SDKPATH should not reference SDK_VERSIONnormalMedium+3.3 M3Yann DirsonNEW
12723mysql requires unicode and char length filteringnormalMedium+3.3 M4David ReynaIN PROGRESS IMPLEMENTATION2
13103[Bug][QA 2.7 M1 rc1][Toaster] "Recipes" table  and  "machines" table are not getting populated after clicking on imported layer as well as after clicking Machines Tab on project pagenormalMedium+3.3 M4David ReynaIN PROGRESS IMPLEMENTATION3
13934Apparent duplication of libtirpc package causes failure in "bitbake linux-yocto -c menuconfig"normalMedium+3.3 M4Hongxu JiaNEW
14020environment-setup script in multilib eSDK doesn't work for multilib variantmajorMedium+3.3 M4Robert YangIN PROGRESS IMPLEMENTATION
14283gitsm fetcher failure when LFS content is present in the main reponormalMedium+3.3 M4Maciej PijanowskiNEW
13767Creating PDF docs doesn't include image filesnormalMedium+3.3 M4Mark MortonNEWBackport to 3.0.3
14026documentation how to use systemd is inconsistentnormalMedium+3.3 M4Mark MortonNEW
14307Some documentation hyperlinks are not workingnormalMedium+3.3 M4Michael OpdenackerIN PROGRESS REVIEW
13768base-files do_package fatal error in subprocessnormalMedium+3.3 M4Mingli YuNEW
13819No clue when CONNECTIVITY_CHECK_URIS is unaccessibleminorMedium+3.3 M4Mingli YuNEW
13311xargs: fdleak.c:396: complain_about_leaky_fds: Assertion `no_leaks' failed.normalMedium+3.3 M4Mingli YuACCEPTED
13425Add bblock and bbunlock helper toolsnormalMedium+3.3 M4New Comer BugsNEW
14126resolvconf incompatible with busybox flocknormalMedium+3.3 M4New Comer BugsNEWbackport to 3.2, 3.1 NEWCOMER
14121Implement sphinx switchers.js for bitbakenormalMedium+3.3 M4Nicolas DechesneNEW
14115Improve the support for multiple versions on the docs websitenormalMedium+3.3 M4Nicolas DechesneNEW
14333submodule helper is not handled properly for devtool enabled workspacecriticalMedium+3.3 M4Prabin CANEW
14295ptest test image core-image-sato-sdk-ptest failurenormalMedium+3.3 M4Randy MacLeodNEW
14125busybox wget ssl is exposed to MitM attack due to CVE-2018-1000500normalMedium+3.3 M4Shachar MenasheIN PROGRESS DESIGN COMPLETEbackport to 3.2, 3.1
14077devtool doesn't handle server failing to startup gracefullynormalMedium+3.3 M4StacyNEWbackport to 3.2
14099PACKAGE_EXCLUDE not removing packages when PACKAGE_CLASSES = "package_deb"normalMedium+3.3 M4StacyNEW
13784Sysvinit log file creation in /var/log sometimes fails at first bootnormalMedium+3.3 M4Trevor GamblinIN PROGRESS DESIGN
13298python3 ptest results are inconsistent per imagenormalMedium+3.3 M4Trevor GamblinIN PROGRESS DESIGNNEWCOMER
13889python3 Windows distutils stubs regressed in upgrade to 3.8.2normalMedium+3.3 M4Trevor GamblinNEWbackport?
13921SERIAL_CONSOLES SERIAL_CONSOLES_CHECKnormalMedium+3.3 M4Trevor GamblinIN PROGRESS IMPLEMENTATION
13176yocto-check-layer can only check layers which aren't already in BBLAYERSnormalMedium+3.4akusterIN PROGRESS REVIEWBackport 3.1 & 3.0 & 2.7
14018efibootpartition.GenericEFITest.test_boot_efi selftest failednormalMedium+3.4Chee YangNEWAB-INT
14065Automated ptest regression testingmajorMedium+3.4Sangeeta JainNEW
14010qemumips-alt systemd boot unit failure on fedora32-ty-1normalMedium+3.4 M1akusterACCEPTEDAB-INT
14348Layer dependencies not updatednormalMedium+3.4 M1Paul EggletonNEW
14285qemuarmv5 kernel config warningsnormalMedium+3.4 M1Bruce AshfieldIN PROGRESS REVIEW
14313genericx86-64 kernel config warningnormalMedium+3.4 M1Bruce AshfieldIN PROGRESS REVIEW
14321meta-arm kernel config warningsnormalMedium+3.4 M1Bruce AshfieldIN PROGRESS IMPLEMENTATION
13251Symlinks overridden when building multitple kernelsnormalMedium+3.4 M1Bruce AshfieldIN PROGRESS DESIGN2
13909Intermittent kernel reproducibility failurenormalMedium+3.4 M1Bruce AshfieldACCEPTED5
14184udev ram3 timeout and RCU preempt stallnormalMedium+3.4 M1Bruce AshfieldIN PROGRESS DESIGNAB-INT10
14317kernel.bbclass cleans files written by make-mod-scripts recipenormalMedium+3.4 M1Bruce AshfieldIN PROGRESS DESIGN3
14310xz / liblzma memory allocation failure during reproducible build testingnormalMedium+3.4 M1Changqing LiNEWAB-INT
14127cve-check falsely indicates a vulnerabily to be patchedmajorMedium+3.4 M1Chee YangNEW
14207pseudo abort with wic imagesmajorMedium+3.4 M1Chee YangNEW
14214rpm-native: do_configure failednormalMedium+3.4 M1Hongxu JiaNEWAB-INT
14200autobuilder failure for edk2-firmware 201911normalMedium+3.4 M1Jon MasonNEWAB-INT
13218classic SDK installer missing stuff?normalMedium+3.4 M1Joshua WattNEW
14034Repeat of a failed bitbake -g eventually would cause bitbake hangnormalMedium+3.4 M1Joshua WattNEW
13378native programs from RSS that alias hosttools can cause non-reproducible buildsnormalMedium+3.4 M1Joshua WattNEW
13567Add QA check for recipes that use AUTOREV by defaultnormalMedium+3.4 M1Joshua WattNEW
13679Buildtools tarball python performance degraded by reproducibile buildsnormalMedium+3.4 M1Joshua WattNEW
13917yocto-check-layer can fail if a layer adds new licensesnormalMedium+3.4 M1Joshua WattNEW
13935Intermittent taskhash mismatch errors on autobuildernormalMedium+3.4 M1Joshua WattNEWAB-INT
12342lib32-core-image-sato -ctestimage failed due to wrong package namesnormalMedium+3.4 M1Kai KangIN PROGRESS REVIEW2
14041qemuarm-alt failed to load rpcbindnormalMedium+3.4 M1Kai KangNEWAB-INT
14250core-image-sato.bb:do_testimage failure at systemd.SystemdBasicTests.test_systemd_failednormalMedium+3.4 M1Kai KangNEWAB-INT
13674master dnf failures on qemumipsnormalMedium+3.4 M1Mingli YuNEW
14177tcl ptest intermittent failurenormalMedium+3.4 M1Mingli YuNEWAB-INT
14290golang TLS hanshake timeoutnormalMedium+3.4 M1Khem RajNEWAB-INT
13123package.PackageTests.test_gdb_hardlink_debug failednormalMedium+3.4 M1Randy MacLeodNEWAB-INT
14197strace ptest intermittent failure in delay.testnormalMedium+3.4 M1Randy MacLeodNEWAB-INT
14284strace ptest intermittent failure in strace--relative-timestamps-us.gen.testnormalMedium+3.4 M1Randy MacLeodNEWAB-INT
12090bitbake resident server reconnect needed ?normalMedium+3.4 M1Richard PurdieNEW1
12368persistent bitbake server does not re-parse if previous build was ctrl+C'dnormalMedium+3.4 M1Richard PurdieNEW
12986Failed to expand SRCPV on updateding SRC_URI using pn overrides and BBCLASSEXTENDnormalMedium+3.4 M1Richard PurdieNEW
13183bitbake-layers crashes with incorrect layer configuration data is given (expected proper error printing and exit with error)normalMedium+3.4 M1Richard PurdieNEW
13278?If git protocol doesn't work, you get a tar.gz clone from PREMIRROR which has git protocol originmajorMedium+3.4 M1Richard PurdieNEW
13448bitbake master appears to expand variables it should not need tonormalMedium+3.4 M1Richard PurdieNEW
13699Prolonged recipe parsing times after removing tmp when the resident bitbake server is usednormalMedium+3.4 M1Richard PurdieNEW
13711Parsing fails on externalsrc recipe containing both git and file in SRC_URInormalMedium+3.4 M1Richard PurdieNEWwith backport
13823fetch2: PREMIRROR and SRC_URI with users on both url yields invalid usernamenormalMedium+3.4 M1Richard PurdieNEW
13886bitbake resident server does not honour --runonly or --runall optionsnormalMedium+3.4 M1Richard PurdieNEW
13973change siginfo data format to json for reproducibility? (siginfo files currently not reproducible)normalMedium+3.4 M1Richard PurdieNEW
14088Attempting to override RDEPENDS_${PN} from global config doesn't worknormalMedium+3.4 M1Richard PurdieNEW
14156gitsm: submodules are fetched as mirrored and not working as expectednormalMedium+3.4 M1Richard PurdieNEW
14339bitbake generates zombie Parser processes (hard to reproduce)normalMedium+3.4 M1Richard PurdieNEW
14342Setscene tasks in both covered and notcovered errors at the end of buildminorMedium+3.4 M1Richard PurdieNEW
13424devupstream doesn't work with mutilibnormalMedium+3.4 M1Richard PurdieNEW
13729Changing siteinfo files doesn't change task checksumnormalMedium+3.4 M1Richard PurdieNEW
14123Intermittent FileNotFound error on autobuilder oe-selftest-debiannormalMedium+3.4 M1Richard PurdieNEWAB-INT
14227Intermittent oe-selftest fails with bash 5.1 do_compilenormalMedium+3.4 M1Richard PurdieNEWAB-INT
14328Mitigate AB ptest intermittent failurenormalMedium+3.4 M1Richard PurdieNEWAB-INT
14108Don't ignore certificates in wget fetchernormalMedium+3.4 M1Ross Burton (Arm)NEW
13999do_packagedata setscene file racenormalMedium+3.4 M1Ross Burton (Arm)NEWAB-INT
14094Switch RPM to use Sqlite instead of BDBnormalMedium+3.4 M1Ross Burton (Arm)NEW
14190qa-extra2 failing on AB with dnf checksum failuresnormalMedium+3.4 M1Ross Burton (Arm)NEWAB-INT
13766Using TCLIB=musl results in SDKs producing incompatible binariesmajorMedium+3.4 M1Sakib SajalNEW
13904do_prepare_recipe_sysroot: postinst-useradd-* does not run in order of dependency and sometimes failsnormalMedium+3.4 M1Sakib SajalNEW
13950Intermittent qemu connection failures during oe-selftest on autobuildernormalMedium+3.4 M1Sakib SajalNEWAB-INT
13288pseudo should not follow symlinks in /procnormalMedium+3.4 M1Sakib SajalNEW
13802ltp tests fail with ssh connection lost error intermittentlynormalMedium+3.4 M1Sakib SajalNEWAB-INT AB-INT-TMPFS
14002ssh connection failure during stap testing on qemuarmnormalMedium+3.4 M1Saul WoldACCEPTEDAB-INT
14095signing selftest failure in test_signing_sstate_archive debina9-ty-2normalMedium+3.4 M1Saul WoldNEWAB-INT
14230qemuarm testimage shows serial login warningnormalMedium+3.4 M1Saul WoldNEWAB-INT AB-INT-TMPFS
13520many valgrind tests fail for arm64normalMedium+3.4 M1StacyIN PROGRESS DESIGN
14090devtool.DevtoolExtractTests.test_devtool_deploy_target selftest failurenormalMedium+3.4 M1StacyNEWAB-INT backport 3.2
11385poky-container: clarify that meta-data should be checked out using native tools that run the host and not with tools in containernormalMedium+3.4 M1Tim OrlingNEW1
13690runqemu with slirp, forwarded host ports are not available on hostnormalMedium+3.4 M1Tim OrlingIN PROGRESS IMPLEMENTATION
13938devtool modify virtual/kernel fails when EXTRAVERSION field is empty in MakefilenormalMedium+3.4 M1Tim OrlingACCEPTED
13411ptest-perl.bbclass run-ptest is too greedy for SKIPnormalMedium+3.4 M1Tim OrlingIN PROGRESS IMPLEMENTATION
14258perl ptest intermittent failurenormalMedium+3.4 M1Tim OrlingNEWAB-INT
13054oe-selftest oelib.utils.TestMultiprocessLaunch.test_multiprocesslaunch failurenormalMedium+3.4 M1Trevor GamblinACCEPTEDAB-INT
14331Memory issues during oe-selftestnormalMedium+3.4 M1Trevor GamblinNEWAB-INT
13338SDK build fails if image contains bashnormalMedium+3.4 M1UnassignedNEWbackports
13463test linux-yocto-rt kernels toonormalMedium+3.4 M1UnassignedACCEPTED
5389bitbake/lib/bb/fetch2: filename too longnormalMedium+3.4 M1UnassignedIN PROGRESS IMPLEMENTATION4
10061Ctrl+C during BB_HASHCHECK_FUNCTION execution does not interrupt processing nicelyminorMedium+3.4 M1UnassignedNEW3
10731bitbake --observe-only doesn't work with memresnormalMedium+3.4 M1UnassignedNEW5
11781bitbake --observe-only may get KeyErrornormalMedium+3.4 M1UnassignedIN PROGRESS REVIEW3
11899broken 'bitbake --status-only' and 'bitbake -m'normalMedium+3.4 M1UnassignedNEW2
12023"bitbake-layers show-layers" doesn't show layer if it doesn't append itself to BBFILE_COLLECTIONSminorMedium+3.4 M1UnassignedNEW1
12367moving or removing tmp breaks persistent bitbake servernormalMedium+3.4 M1UnassignedNEW
13039fetch2: PREMIRROR and SRC_URI with type https and parameter downloadfilename yields invalid urlnormalMedium+3.4 M1UnassignedNEW
13181persist_data sqlite database mixed with forking is irreparably brokennormalMedium+3.4 M1UnassignedNEW
13353bitbake git fetcher does not honour BB_FETCH_PREMIRRORONLYnormalMedium+3.4 M1UnassignedNEW
13843bitbake worker stuck using 100% cpu on aborted buildnormalMedium+3.4 M1UnassignedNEW
14015URL Arguments in MIRROR/PREMIRROR get encodednormalMedium+3.4 M1UnassignedNEW
14262runcmd.RunCmdTests.test_stdin_timeout times outnormalMedium+3.4 M1UnassignedNEWAB-INT
14201Bitbake server intermittent timeoutnormalMedium+3.4 M1UnassignedNEWAB-INT
14246devtool test failures: github tls timeoutnormalMedium+3.4 M1UnassignedNEWAB-INT
14273qemu CPU starvation triggers rcu_preempt stall detectionnormalMedium+3.4 M1UnassignedNEWAB-INT
14289failure in the command 'bitbake glibc-testsuite -c check'normalMedium+3.4 M1UnassignedNEWAB-INT
14299failure in the command 'bitbake gcc-runtime -c check'normalMedium+3.4 M1UnassignedNEWAB-INT
14341BitbakePrTests.test_stopping_prservice_message failsnormalMedium+3.4 M1UnassignedNEWAB-INT
13236sstate for host native packagesnormalMedium+3.4 M1UnassignedNEW
12290cross recipe kernel module dependency generation stopped workingnormalMedium+3.4 M1UnassignedACCEPTEDBackport 2
12374do_rootfs failed when len(TMPDIR) == 410normalMedium+3.4 M1UnassignedNEW2
12760CMake Toolchain File Has Wrong Module PathnormalMedium+3.4 M1UnassignedIN PROGRESS REVIEW1
12963nativesdk-opkg prefixes all internal paths with $SDKPATH and won't worknormalMedium+3.4 M1UnassignedNEW3
13279Make sure users/groups exist for package_write_* tasksnormalMedium+3.4 M1UnassignedNEW
13285YoctoProject Compatibility script improvements needednormalMedium+3.4 M1UnassignedNEW
13419recipes that add users to groups cannot rely on other recipes creating those groups (when population from sstate happens)normalMedium+3.4 M1UnassignedNEW
13612meta-skeleton fails yocto-check-layernormalMedium+3.4 M1UnassignedNEW
13705master] bitbake and hashserve.sock left behind when ^C a buildnormalMedium+3.4 M1UnassignedNEW
13868Python cache files get lost in packagesnormalMedium+3.4 M1UnassignedNEW
13897POSTINST_INTERCEPTS_DIR broken by undocumented POSTINST_INTERCEPTS_PATHS since thudnormalMedium+3.4 M1UnassignedNEWBackport
13910Intermittent host UID contamination highlighted by devtool testsnormalMedium+3.4 M1UnassignedNEW
13920uninative tarball license compliance in ESDKnormalMedium+3.4 M1UnassignedNEW
13976gdb8.3 do compile with musl is errornormalMedium+3.4 M1UnassignedNEW
14023oe-selftest doesn't work with BB_SERVER_TIMEOUT=60normalMedium+3.4 M1UnassignedNEW
14028Autobuilder buildtools run fails with "Qemu ended unexpectedly"normalMedium+3.4 M1UnassignedNEWAB-INT
14066bitbake core-image-base -c populate_sdk fails when image contains bash, core-utils and package_deb is usednormalMedium+3.4 M1UnassignedNEW
14096perl install race (pod2text)normalMedium+3.4 M1UnassignedNEWAB-INT
14128qemuppc failed to shutdownnormalMedium+3.4 M1UnassignedNEWAB-INT
14150devtool: modify: fails for gstreamer1.0-plugins-goodnormalMedium+3.4 M1UnassignedNEW
14151devtool build fails for python3normalMedium+3.4 M1UnassignedNEW
14154yocto-check-layer fails incorrectly with kernel hash changesnormalMedium+3.4 M1UnassignedNEW
14155yocto-check-layer fails with hash changes if license addednormalMedium+3.4 M1UnassignedNEW
14206oe-selftest perl errors on rpm based distrosnormalMedium+3.4 M1UnassignedNEW
14218Recipe rebuilds can contaminate buildsnormalMedium+3.4 M1UnassignedNEW
14251core-image-sato-1.0-r0:do_testimage FAILED when starting qemunormalMedium+3.4 M1UnassignedNEWAB-INT AB-INT-TMPFS
14259NFS mounting issue on qemux64 oe-selftest glibc.GlibcSelfTestSystemEmulated.test_glibcnormalMedium+3.4 M1UnassignedNEWAB-INT
14268ruby-ri-docs is not reproduciblenormalMedium+3.4 M1UnassignedNEW
14270go packages are not reproduciblenormalMedium+3.4 M1UnassignedNEW
14300libtool-cross parallelism build failurenormalMedium+3.4 M1UnassignedNEWAB-INT
14244util-linux script:_size ptest failurenormalMedium+3.4 M1UnassignedNEWAB-INT
14257gstreamer1.0 ptest intermittent failurenormalMedium+3.4 M1UnassignedNEWAB-INT
14263lttng-tools ptest intermittent failurenormalMedium+3.4 M1UnassignedNEWAB-INT
13631core-image-full-cmdline qemumips systemd boot failurenormalMedium+3.4 M1UnassignedNEW
14272qemumips64 testimage systemd didnt reach login promptnormalMedium+3.4 M1UnassignedNEWAB-INT
14274dnf parselogs failed on qemux86-64 due to networking errornormalMedium+3.4 M1UnassignedNEW
14275qemuarm64 parselogs fail due to udev taking to much timenormalMedium+3.4 M1UnassignedNEWAB-INT
13992qemumips testimage keeps failingnormalMedium+3.4 M1Victor KamenskyNEWAB-INT
14208send-error-report fails with 500: INTERNAL SERVER ERRORnormalMedium+3.4 M1Yi Fan YuIN PROGRESS DESIGN
14158tinfoil.TinfoilTests.test_wait_event times outnormalMedium+3.4 M1Yi Fan YuACCEPTEDAB-INT
14051[QA 3.2 M3 RC1] failure in ptest : valgrind.drd and valgrind.helgrindnormalMedium+3.4 M1Yi Fan YuNEWbackport to 3.2
14163libevent arm ptest intermittent failurenormalMedium+3.4 M1Yi Fan YuNEWAB-INT
14170glib-2.0 codegen ptest failurenormalMedium+3.4 M1Yi Fan YuACCEPTEDAB-INT
14213gawk ptest intermittent failurenormalMedium+3.4 M1Yi Fan YuNEWAB-INT
14294valgrind memcheck/tests/linux/timerfd-syscall ptest intermittent failurenormalMedium+3.4 M1Yi Fan YuNEWAB-INT AB-INT-TMPFS
14296python3 ptest intermittent failurenormalMedium+3.4 M1Yi Fan YuNEWAB-INT
14311valgrind drd/tests ptest intermittent failurenormalMedium+3.4 M1Yi Fan YuIN PROGRESS DESIGNAB-INT
14324valgrind 3.17.0 ptest: swapcontext.vgtest failsnormalMedium+3.4 M1Yi Fan YuNEW
13835KCONF_BSP_AUDIT_LEVEL is not properly documentednormalMedium+3.4 M2Bruce AshfieldIN PROGRESS DESIGN COMPLETE1
12060It is possible to specify a PACKAGE and a PKG_ rename that conflictminorMedium+3.4 M2Kai KangNEW2
12917Warnings from nightly-multilib builds (build-deps)normalMedium+3.4 M2Kai KangNEW3
13182Inconsistency detected by ld.so: dl-open.c: 274: dl_open_worker: Assertion xxx failednormalMedium+3.4 M2Chen QiNEW
13878xserver-nodm-init: broken XDG_RUNTIME_DIR setupnormalMedium+3.4 M2Ross Burton (Arm)NEWbackport 3.1
13896gtk-icon-cache.bbclass passes wrong parameter to update_gtk_icon_cache postinst interceptnormalMedium+3.4 M2Ross Burton (Arm)NEWbackport
13930Port the CROPS toaster-container selenium tests to the AutobuildernormalMedium+3.4 M2Tim OrlingIN PROGRESS DESIGN
14098absolute path in TEMPLATECONF should be rejected or warned, makes ext-sdk uninstallablenormalMedium+3.4 M2Tim OrlingNEWbackport 3.2
13603[master-next] qemuarm-alt systemd login failednormalMedium+3.4 M3akusterACCEPTED
13613KERNEL_IMAGEDEST variable not taken into accountnormalMedium+3.4 M3Bruce AshfieldIN PROGRESS DESIGN3
14044STAGING_KERNEL_DIR symlink has been broken if externalsrccriticalMedium+3.4 M3Bruce AshfieldIN PROGRESS DESIGNBackport to 3.1.x
13008toaster testingnormalMedium+3.4 M3David ReynaACCEPTED5
14118systemd services not enabled when using package feednormalMedium+3.4 M3Kai KangNEW
13964bitbake stuck doing nothing after hitting disk-full conditionnormalMedium+3.4 M4akusterNEW
13716Master] SSTATE_MIRROR hangs if mirror site is down.normalMedium+3.4 M4akusterNEW
13735Performing Automated Runtime Testing with a custom hardware target / BeagleBone Hardware targetminorMedium+3.4 M4akusterNEW
13508Meson detects googletest installed on systemnormalMedium+3.4 M4Hongxu JiaNEWbackport 3.1
14139systemd user/groups different on opkg vs rpm imagesnormalMedium+3.4 M4Hongxu JiaNEW
14117When ifupdown ist configured for DHCP with IPv6 the system boot hangsnormalMedium+3.4 M4Yi ZhaoNEW
11737include selftest tests for devtool import/export pluginsnormalMedium+3.99Aaron ChanACCEPTED 4
12927Cannot strip and sign kernel modulesnormalMedium+3.99Anuj MittalNEW
11839buildhistory + multiconfignormalMedium+3.99Paul EggletonNEW1
12395kernel set up with devtool modify builds with wrong config after cleaningnormalMedium+3.99Paul EggletonNEW
12674devtool modify does not preserve patch header after scissors linenormalMedium+3.99Paul EggletonNEW
13464Argument list too long when do rootfs when install too many packagesnormalMedium+3.99Changqing LiNEW
13854xserver-nodm.service failed with xf86OpenConsole: Switching VT failedminorMedium+3.99Changqing LiNEW
13005Patchtest did not detect missing bb files changesnormalMedium+3.99Changqing LiIN PROGRESS REVIEW1
13532Add SPDX license headers to all source files for patchest-oenormalMedium+3.99Changqing LiIN PROGRESS REVIEW
13684Patchwork instance is python2; needs to be updated to newer Django version (patchwork-fdo is now Django 2.2 LTS)normalMedium+3.99Changqing LiNEW
12262[Toaster] Layer details page: optional layers cant be blank when importing a layernormalMedium+3.99David ReynaNEW 3
12411Add automation for eSDK artifacts downloaded from the autobuildernormalMedium+3.99yeoh ee pengNEW
12465test case test_check_rpm_install_removal_log_file_size failednormalMedium+3.99yeoh ee pengNEW
8158INCOMPATIBLE_LICENSES has unexpected results with GNU librariesnormalMedium+3.99Joe SlaterNEW3
12585Windows SDK ".XZ" archives do not correctly unpacknormalMedium+3.99Joshua WattNEW
13306bitbake starts up to n^2 processes with n cpusnormalMedium+3.99Robert YangNEW
13016How to run our test suites for boards like beaglebone remotely on a LAVA board farm?normalMedium+3.99Aníbal LimónIN PROGRESS DESIGN
11802system spontaneously logs out while building core-imagenormalMedium+3.99Mingli YuNEW3.14
12755Separate boot config recipes are at odds with setting APPEND at the image levelnormalMedium+3.99Naveen SainiNEW
12868archiver ARCHIVER_MODE[src] = "patched" and ="configured" fails to build. Morty works. Pyro, sumo, master etc failnormalMedium+3.99Paul BarkerACCEPTED
12522License checksum change test doesnt worknormalMedium+3.99Paul BarkerIN PROGRESS REVIEW
11593bb.fetch2.get_srcrev ExpansionError with ;subdir=${S} SRC_URIsnormalMedium+3.99Richard PurdieNEW 1
12066Locked signature change triggers taskhash mismatch errornormalMedium+3.99Richard PurdieNEW 2
12180Installing conflicting files in RSS results in an exceptionnormalMedium+3.99Richard PurdieNEW2
12707HOSTTOOLS: include version checksnormalMedium+3.99Richard PurdieNEW
12273Shlibs should only be public if they're in $libdir etcnormalMedium+3.99Ross Burton (Arm)NEW2
12752Check that patches don't have a github /archive/ URLnormalMedium+3.99Tim OrlingNEW
12715cross compiler for 'mips64 + libn32' cannot work correctly inside SDKnormalMedium+3.99Trevor GamblinNEW
10165Check for and explain if UTF-8 is missingnormalMedium+3.99UnassignedNEW1
11904Bad line continuation in bblayers.conf causes ugly server messagenormalMedium+3.99UnassignedNEW0.5
13659PRServ should have a read-only port or endpointnormalMedium+3.99UnassignedNEW
12239enable automated testing of non core layers with common usagenormalMedium+3.99UnassignedNEW2
11138Extensible SDK: recipe-specific sysroots broke user additions to the SDK's shared sysrootnormalMedium+3.99UnassignedNEW2
11963QA: Create automated testing to cover ESDK artifacts downloaded from the autobuildernormalMedium+3.99UnassignedNEW3
9104ffmpeg libraries are missing -dbg packagingnormalMedium+3.99UnassignedNEW5
10597license_create_manifest fails when linux-dummy is used to create own kernelnormalMedium+3.99UnassignedNEW2
10629package brought in by runtime dependency of a complementary package does not have its own complementary package installednormalMedium+3.99UnassignedNEW5
11933oe-selftest: unset SANITY_TESTED_DISTROS automatically when oe-selftest is launchednormalMedium+3.99UnassignedNEW3
12323automake does not support buildtest-TESTS in parallel modenormalMedium+3.99UnassignedNEW3
12412WIC: rootfs wrong file ownership on rocko branchnormalMedium+3.99UnassignedIN PROGRESS DESIGN
12688yocto-check-layer should allow PV changesnormalMedium+3.99UnassignedACCEPTED
13097mips ifunc support appears brokennormalMedium+3.99UnassignedNEW
13407Enable PGO for python when reproducible builds are enablednormalMedium+3.99UnassignedNEW
10716Patchwork: track older release branchesnormalMedium+3.99UnassignedACCEPTED2
13480gcc-cross plugins feature cannot be usednormalMedium+3.99He ZheNEW
13801offline build fails when character '&' is present in SRC_URI for svnnormalMedium+FutureGeorgiNEW
13746Unable to create RPM package from repo that contains filenames with "[" and "]" charactersnormalMedium+FutureRobert YangIN PROGRESS DESIGN
12408Update wic documentation to remove outdated "help" referencesnormalMedium+FutureRobert P. J. DayIN PROGRESS IMPLEMENTATION
14330Downloads and front pages not advertising the latest releases.majorMedium+Q2akusterACCEPTED
12571add IN PROGRESS DOCUMENTATIONnormalMedium+Q2Michael HalsteadACCEPTED
13015Upgrade bugzilla to a new version and drop testopianormalMedium+Q4Michael HalsteadIN PROGRESS DESIGN
 277       

Medium+ Enhancements

IDSummary (81 tasks) SeverityPMilestoneAssigneeStatusWhiteboardE
13320Update license files to match current SPDX names and license contentsenhancementMedium+3.3 M3Ida DelphineNEWNEWCOMER
14085Toaster UI should know when bitbake crashedenhancementMedium+3.3 M4David ReynaNEW3
6437Document how to set up the Yocto Project for production workenhancementMedium+3.3 M4Mark MortonACCEPTED2
13589Document sstate cache mirror best practicesenhancementMedium+3.3 M4Mark MortonNEW
8191apply kernel config fragments to arbitrary kernelsenhancementMedium+3.4 M1Bruce AshfieldIN PROGRESS REVIEW3
13053oe-core OCI container compatibility / deployment and conversionenhancementMedium+3.4 M1Bruce AshfieldIN PROGRESS DESIGN COMPLETE5
13226Support out of tree modules for alternate kernelsenhancementMedium+3.4 M1Bruce AshfieldACCEPTED
13975cve-checker: save to alternate file format like JSONenhancementMedium+3.4 M1Chee YangIN PROGRESS DESIGN
13742HashEquiv server should have a read-only port or endpointenhancementMedium+3.4 M1Jan-Simon MoellerNEW
11906rpmbuild: Can not build packages on qemu targetenhancementMedium+3.4 M1Hongxu JiaNEW2
13230Switch qemuarm (another others) to virtio graphicsenhancementMedium+3.4 M1Jon MasonNEW
14021Remove debug_domain logicenhancementMedium+3.4 M1Joshua WattNEW
12279enhance manifest not found warningenhancementMedium+3.4 M1Kai KangIN PROGRESS REVIEW1
13025WIC image install supportenhancementMedium+3.4 M1Kevin HaoNEW2
12937Consistent naming scheme for deployed artifactsenhancementMedium+3.4 M1Martin JansaIN PROGRESS REVIEW
10693Add a testcase for multilib eSDK on the autobuilderenhancementMedium+3.4 M1Chen QiNEW5
10748Means of querying history for a single variableenhancementMedium+3.4 M1Richard PurdieIN PROGRESS REVIEW2
11449Allow overriding classes to override overridden classesenhancementMedium+3.4 M1Richard PurdieNEW5
11746oe-selftest: capture self.logger messages in XML outputenhancementMedium+3.4 M1Richard PurdieNEW2
12970uninative file should be versionnedenhancementMedium+3.4 M1Richard PurdieNEW
13599Enhancement: Detect variables that shouldn't be defined in image scope, but in global (distro) scopeenhancementMedium+3.4 M1Richard PurdieNEW
14340improve detection and error reporting when oe-core is missingenhancementMedium+3.4 M1Richard PurdieNEW
7600syslinux: port extX support patches to syslinux communityenhancementMedium+3.4 M1Sakib SajalIN PROGRESS IMPLEMENTATION5
14006Create facilty to collect build system statisticsenhancementMedium+3.4 M1Sakib SajalNEW
14007When qemu hangs, try to create a snapshot or core file.enhancementMedium+3.4 M1Sakib SajalNEW
13980Investigate replacements for PhantomJS for buildperf outputenhancementMedium+3.4 M1Trevor GamblinNEW
5876Add a test for the kernel -c menuconfig optionenhancementMedium+3.4 M1UnassignedACCEPTED3
13004Automate yocto-check-layer -m optionenhancementMedium+3.4 M1UnassignedNEW
13023Switch to memory resident bitbake by default in 3.3enhancementMedium+3.4 M1UnassignedNEW
13233fetch2: try_premirror(): improve on updating repo from mirrorenhancementMedium+3.4 M1UnassignedNEW3
14045git fetcher deadlock with self-referencing sub-modulesenhancementMedium+3.4 M1UnassignedNEW
14081Not possible to get src package in image when using PACKAGE_DEBUG_SPLIT_STYLE='debug-file-directory'enhancementMedium+3.4 M1UnassignedNEWBackport
141043.1.2 (not an option above) devtool finish does not copy recipe in layerenhancementMedium+3.4 M1UnassignedNEW
14196Add integration to send data to KCIDBenhancementMedium+3.4 M1UnassignedNEW
14303Result of build is not stored in testresult.json with resulttoolenhancementMedium+3.4 M1UnassignedNEW
13051allow Open Container compliant "images" to be generated from oe images (container or not)enhancementMedium+3.4 M2Bruce AshfieldIN PROGRESS IMPLEMENTATION4
13360kernel-dev: package full kernel source and headers for reference purposesenhancementMedium+3.4 M2Bruce AshfieldIN PROGRESS IMPLEMENTATION3
5322Global DNS fallback mechanism not present in poky distroenhancementMedium+3.4 M2Kai KangACCEPTED3
14137Add selftest to verify images with different package managers are identicalenhancementMedium+3.4 M2Ross Burton (Arm)NEW
14141devtool modify fails with submodulesenhancementMedium+3.4 M2Ross Burton (Arm)NEW
14236npmsw does not support github URLs in the npm-shrinkwrap.json fileenhancementMedium+3.4 M2UnassignedNEW
13052Allow oe-core generated OCI containers to be executed/tested on the build hostenhancementMedium+3.4 M3Bruce AshfieldIN PROGRESS IMPLEMENTATION4
13109Implement CPE to package to Release mappingenhancementMedium+3.4 M3David ReynaIN PROGRESS DESIGN5
13669Move Toaster testsuite-2 away from TestopiaenhancementMedium+3.4 M3David ReynaNEW4
14316Write a script to populate swatbot from buildbotenhancementMedium+3.4 M4Alexandre BelloniNEW
6428Improve the ability to isolate changes that have caused a rebuildenhancementMedium+3.99Paul EggletonIN PROGRESS DESIGN5
8325devtool modify could handle patch failure more usefullyenhancementMedium+3.99Paul EggletonACCEPTED3
12560Add tests for layer index APIenhancementMedium+3.99Paul EggletonNEW
12599Show layer dependencies recursivelyenhancementMedium+3.99Paul EggletonNEW
13080devtool: handle user modifying local files next to recipeenhancementMedium+3.99Paul EggletonNEW
13252Error report Web: enhance to support get all configuration in the local.confenhancementMedium+3.99Changqing LiNEW
13428pathtest-oe: test-pylint need enhancement for new filesenhancementMedium+3.99Changqing LiIN PROGRESS REVIEW
12189wic cp should support recursive copiesenhancementMedium+3.99Chee YangNEW4
7684patchwork: provide email notificationsenhancementMedium+3.99DorindaIN PROGRESS IMPLEMENTATION1
6862input subsystem testingenhancementMedium+3.99yeoh ee pengNEW5
11394Add tests to cover devtool handling of various git URL stylesenhancementMedium+3.99yeoh ee pengNEW5
11195Enable easily changing maintainer email addressenhancementMedium+3.99Diana ThayerNEW5
11630Convert dev-manual into pure task manual (how-to)enhancementMedium+3.99Mark MortonIN PROGRESS IMPLEMENTATION30
12272Create new test cases for Kernel Development featuresenhancementMedium+3.99MazlianaNEW
13002Create a set of tests to run after upgrading patchtestenhancementMedium+3.99Paul BarkerNEW
13634patchtest should run maintainers test on new recipesenhancementMedium+3.99Paul BarkerNEW
11131Add more tests to Yocto Project Compatible Layers scriptenhancementMedium+3.99Richard PurdieNEW5
11361oe-build-perf-test: monitor system resource utilizationenhancementMedium+3.99Richard PurdieNEW4
11791Reduce the amount and storage space required of image artefacts published from buildsenhancementMedium+3.99Richard PurdieNEW2
12282CheckYoctoCompat buildstep should support additional optionsenhancementMedium+3.99Richard PurdieNEW3
12614Add include_all directiveenhancementMedium+3.99Richard PurdieNEW
9442Please add virtio console to qemux86-64.confenhancementMedium+3.99Sakib SajalIN PROGRESS DESIGN2
11816secure boot implementation using systemd-boot bootloaderenhancementMedium+3.99Tim OrlingNEW4
4304Do automated upgrade path testingenhancementMedium+3.99UnassignedNEW 4
7683Provide means of turning a recipe change into a bbappendenhancementMedium+3.99UnassignedNEW4
9858Make xattrs in images work [meta]enhancementMedium+3.99UnassignedNEW5
10684Distributed build supportenhancementMedium+3.99UnassignedNEW15
10715Patchwork should change status when patches are pushed into mut (master under test) and again when they goto masterenhancementMedium+3.99UnassignedIN PROGRESS IMPLEMENTATION2
10974Tests for Build Appliance need to be automatedenhancementMedium+3.99UnassignedNEW3
11360oe-build-perf-report: show multiple data sets per chartenhancementMedium+3.99UnassignedNEW 5
11528Enable simple toolchain switchingenhancementMedium+3.99UnassignedNEW5
11783Should be able to define Target Proxy settings and have them appear in imagesenhancementMedium+3.99UnassignedNEW5
12141Pseudo: Annotate error messagesenhancementMedium+3.99UnassignedNEW
13330add resulttool report option for graphical outputenhancementMedium+3.99UnassignedNEW
13846run piglit testsenhancementMedium+3.99UnassignedNEW
12635add performance test using phoronix test suiteenhancementMedium+3.99Yang WangNEW
 81       

Medium+ Enhancements (Future)

IDSummary (2 tasks) SeverityPMilestoneAssigneeStatusWhiteboardE
9070Add test that locales are workingenhancementMedium+FutureApoorvACCEPTED3
13933Devtool does not work with multiconfigenhancementMedium+FuturePaul EggletonNEW
 2       


Medium+ Bugs and Enhancements by Owner !(Future, 3.99)

IDSummary (274 tasks) SeverityPMilestoneAssigneeStatusWhiteboardE
 0       
akuster
14157git fetcher: consider using different git commands for repo packing, eliminating "git pack-redundant"normalMedium+3.3 M3akusterNEWbackports perhaps
14136If u-boot defconfig is incomplete, 'bitbake u-boot -c configure' hangs and eats all memorynormalMedium+3.3 M3akusterACCEPTED
14185Git 2.30.0 defaults to mainnormalMedium+3.3 M3akusterACCEPTED
14188Missing packages on brand new Fedora 33normalMedium+3.3 M3akusterNEWwith backport
13176yocto-check-layer can only check layers which aren't already in BBLAYERSnormalMedium+3.4akusterIN PROGRESS REVIEWBackport 3.1 & 3.0 & 2.7
14010qemumips-alt systemd boot unit failure on fedora32-ty-1normalMedium+3.4 M1akusterACCEPTEDAB-INT
13603[master-next] qemuarm-alt systemd login failednormalMedium+3.4 M3akusterACCEPTED
13964bitbake stuck doing nothing after hitting disk-full conditionnormalMedium+3.4 M4akusterNEW
13716Master] SSTATE_MIRROR hangs if mirror site is down.normalMedium+3.4 M4akusterNEW
13735Performing Automated Runtime Testing with a custom hardware target / BeagleBone Hardware targetminorMedium+3.4 M4akusterNEW
14330Downloads and front pages not advertising the latest releases.majorMedium+Q2akusterACCEPTED
 11       
Alejandro
13731Cross canadian GCC fails to find header files when using tclibc-newlibnormalMedium+3.3 M3AlejandroACCEPTED
 1       
Alexandre Belloni
14316Write a script to populate swatbot from buildbotenhancementMedium+3.4 M4Alexandre BelloniNEW
 1       
Paul Eggleton
13417Development manual coverage of devtoolnormalMedium+3.3 M3Paul EggletonACCEPTED1
14047eSDK: python3.5.real: No such file or directorynormalMedium+3.3 M3Paul EggletonNEWBackport to 3.1.x
13625test_devtool_add_library fails in multilib setupsnormalMedium+3.3 M3Paul EggletonNEW
13079devtool documentation needs to mention oe-local-filesnormalMedium+3.3 M3Paul EggletonIN PROGRESS REVIEW24 June 2018: IN PROGRESS DESIGN3
13954Invalid layerindex data causing backtrace in `bitbake-layers layerindex-fetch`normalMedium+3.3 M3Paul EggletonNEW
14060devtool modify fails when applied on recipes using patchesmajorMedium+3.3 M3Paul EggletonNEW
14146Post-patch hook fails with submodules and PATCHTOOL=git and PATCH_COMMIT_FUNCTIONS=1normalMedium+3.3 M3Paul EggletonNEW
13190RRS cannot handle multiple recipes with same PNnormalMedium+3.3 M3Paul EggletonIN PROGRESS REVIEW
14348Layer dependencies not updatednormalMedium+3.4 M1Paul EggletonNEW
 9       
Bruce Ashfield
14285qemuarmv5 kernel config warningsnormalMedium+3.4 M1Bruce AshfieldIN PROGRESS REVIEW
14313genericx86-64 kernel config warningnormalMedium+3.4 M1Bruce AshfieldIN PROGRESS REVIEW
14321meta-arm kernel config warningsnormalMedium+3.4 M1Bruce AshfieldIN PROGRESS IMPLEMENTATION
8191apply kernel config fragments to arbitrary kernelsenhancementMedium+3.4 M1Bruce AshfieldIN PROGRESS REVIEW3
13053oe-core OCI container compatibility / deployment and conversionenhancementMedium+3.4 M1Bruce AshfieldIN PROGRESS DESIGN COMPLETE5
13226Support out of tree modules for alternate kernelsenhancementMedium+3.4 M1Bruce AshfieldACCEPTED
13251Symlinks overridden when building multitple kernelsnormalMedium+3.4 M1Bruce AshfieldIN PROGRESS DESIGN2
13909Intermittent kernel reproducibility failurenormalMedium+3.4 M1Bruce AshfieldACCEPTED5
14184udev ram3 timeout and RCU preempt stallnormalMedium+3.4 M1Bruce AshfieldIN PROGRESS DESIGNAB-INT10
14317kernel.bbclass cleans files written by make-mod-scripts recipenormalMedium+3.4 M1Bruce AshfieldIN PROGRESS DESIGN3
13835KCONF_BSP_AUDIT_LEVEL is not properly documentednormalMedium+3.4 M2Bruce AshfieldIN PROGRESS DESIGN COMPLETE1
13051allow Open Container compliant "images" to be generated from oe images (container or not)enhancementMedium+3.4 M2Bruce AshfieldIN PROGRESS IMPLEMENTATION4
13360kernel-dev: package full kernel source and headers for reference purposesenhancementMedium+3.4 M2Bruce AshfieldIN PROGRESS IMPLEMENTATION3
13052Allow oe-core generated OCI containers to be executed/tested on the build hostenhancementMedium+3.4 M3Bruce AshfieldIN PROGRESS IMPLEMENTATION4
13613KERNEL_IMAGEDEST variable not taken into accountnormalMedium+3.4 M3Bruce AshfieldIN PROGRESS DESIGN3
14044STAGING_KERNEL_DIR symlink has been broken if externalsrccriticalMedium+3.4 M3Bruce AshfieldIN PROGRESS DESIGNBackport to 3.1.x
 16       
Changqing Li
14310xz / liblzma memory allocation failure during reproducible build testingnormalMedium+3.4 M1Changqing LiNEWAB-INT
 1       
Chee Yang
14018efibootpartition.GenericEFITest.test_boot_efi selftest failednormalMedium+3.4Chee YangNEWAB-INT
13975cve-checker: save to alternate file format like JSONenhancementMedium+3.4 M1Chee YangIN PROGRESS DESIGN
14127cve-check falsely indicates a vulnerabily to be patchedmajorMedium+3.4 M1Chee YangNEW
14207pseudo abort with wic imagesmajorMedium+3.4 M1Chee YangNEW
 4       
David Reyna
13888Toaster is not starting for Django-3majorMedium+3.1.7David ReynaIN PROGRESS REVIEW2
12723mysql requires unicode and char length filteringnormalMedium+3.3 M4David ReynaIN PROGRESS IMPLEMENTATION2
13103[Bug][QA 2.7 M1 rc1][Toaster] "Recipes" table  and  "machines" table are not getting populated after clicking on imported layer as well as after clicking Machines Tab on project pagenormalMedium+3.3 M4David ReynaIN PROGRESS IMPLEMENTATION3
14085Toaster UI should know when bitbake crashedenhancementMedium+3.3 M4David ReynaNEW3
13008toaster testingnormalMedium+3.4 M3David ReynaACCEPTED5
13109Implement CPE to package to Release mappingenhancementMedium+3.4 M3David ReynaIN PROGRESS DESIGN5
13669Move Toaster testsuite-2 away from TestopiaenhancementMedium+3.4 M3David ReynaNEW4
 7       
Jan-Simon Moeller
13742HashEquiv server should have a read-only port or endpointenhancementMedium+3.4 M1Jan-Simon MoellerNEW
 1       
Hongxu Jia
13934Apparent duplication of libtirpc package causes failure in "bitbake linux-yocto -c menuconfig"normalMedium+3.3 M4Hongxu JiaNEW
11906rpmbuild: Can not build packages on qemu targetenhancementMedium+3.4 M1Hongxu JiaNEW2
14214rpm-native: do_configure failednormalMedium+3.4 M1Hongxu JiaNEWAB-INT
13508Meson detects googletest installed on systemnormalMedium+3.4 M4Hongxu JiaNEWbackport 3.1
14139systemd user/groups different on opkg vs rpm imagesnormalMedium+3.4 M4Hongxu JiaNEW
 5       
Ida Delphine
13320Update license files to match current SPDX names and license contentsenhancementMedium+3.3 M3Ida DelphineNEWNEWCOMER
13527Add SPDX license headers to all source files for layerindex-webnormalMedium+3.3 M3Ida DelphineIN PROGRESS DESIGNNEWCOMER
13919Multi License GPLv3 -lic cannot be installed into the image because it has incompatible licensenormalMedium+3.3 M3Ida DelphineNEW
 3       
Jaewon Lee
13533Devtool finish on _git package with SRCPV in PV points to wrong WORKDIRnormalMedium+3.3 M3Jaewon LeeIN PROGRESS REVIEW
 1       
Jean-Marie Lemetayer
13903npmsw fetcher fails if multiple recipes have common npm packagesnormalMedium+3.3 M3Jean-Marie LemetayerNEW
13901npm build error when the shrinkwrap file has no dependenciesminorMedium+3.3 M3Jean-Marie LemetayerNEW
 2       
John Kaldas
13722Debugging With the GNU Project Debugger enhancementsnormalMedium+3.3 M3John KaldasNEWNEWCOMER
 1       
Jon Mason
14200autobuilder failure for edk2-firmware 201911normalMedium+3.4 M1Jon MasonNEWAB-INT
13230Switch qemuarm (another others) to virtio graphicsenhancementMedium+3.4 M1Jon MasonNEW
 2       
Joshua Watt
13218classic SDK installer missing stuff?normalMedium+3.4 M1Joshua WattNEW
14021Remove debug_domain logicenhancementMedium+3.4 M1Joshua WattNEW
14034Repeat of a failed bitbake -g eventually would cause bitbake hangnormalMedium+3.4 M1Joshua WattNEW
13378native programs from RSS that alias hosttools can cause non-reproducible buildsnormalMedium+3.4 M1Joshua WattNEW
13567Add QA check for recipes that use AUTOREV by defaultnormalMedium+3.4 M1Joshua WattNEW
13679Buildtools tarball python performance degraded by reproducibile buildsnormalMedium+3.4 M1Joshua WattNEW
13917yocto-check-layer can fail if a layer adds new licensesnormalMedium+3.4 M1Joshua WattNEW
13935Intermittent taskhash mismatch errors on autobuildernormalMedium+3.4 M1Joshua WattNEWAB-INT
 8       
Kai Kang
12279enhance manifest not found warningenhancementMedium+3.4 M1Kai KangIN PROGRESS REVIEW1
12342lib32-core-image-sato -ctestimage failed due to wrong package namesnormalMedium+3.4 M1Kai KangIN PROGRESS REVIEW2
14041qemuarm-alt failed to load rpcbindnormalMedium+3.4 M1Kai KangNEWAB-INT
14250core-image-sato.bb:do_testimage failure at systemd.SystemdBasicTests.test_systemd_failednormalMedium+3.4 M1Kai KangNEWAB-INT
5322Global DNS fallback mechanism not present in poky distroenhancementMedium+3.4 M2Kai KangACCEPTED3
12060It is possible to specify a PACKAGE and a PKG_ rename that conflictminorMedium+3.4 M2Kai KangNEW2
12917Warnings from nightly-multilib builds (build-deps)normalMedium+3.4 M2Kai KangNEW3
14118systemd services not enabled when using package feednormalMedium+3.4 M3Kai KangNEW
 8       
Kevin Hao
13025WIC image install supportenhancementMedium+3.4 M1Kevin HaoNEW2
 1       
Robert Yang
14020environment-setup script in multilib eSDK doesn't work for multilib variantmajorMedium+3.3 M4Robert YangIN PROGRESS IMPLEMENTATION
 1       
Maciej Pijanowski
14283gitsm fetcher failure when LFS content is present in the main reponormalMedium+3.3 M4Maciej PijanowskiNEW
 1       
Mark Hatle
13550username/password specified to gitsm:// does not get propagated to submodulesnormalMedium+3.3 M3Mark HatleNEW
 1       
Mark Morton
6437Document how to set up the Yocto Project for production workenhancementMedium+3.3 M4Mark MortonACCEPTED2
13767Creating PDF docs doesn't include image filesnormalMedium+3.3 M4Mark MortonNEWBackport to 3.0.3
14026documentation how to use systemd is inconsistentnormalMedium+3.3 M4Mark MortonNEW
13589Document sstate cache mirror best practicesenhancementMedium+3.3 M4Mark MortonNEW
 4       
Martin Jansa
12937Consistent naming scheme for deployed artifactsenhancementMedium+3.4 M1Martin JansaIN PROGRESS REVIEW
 1       
Michael Halstead
13668cgit dark theme doesn't show tags clearlynormalMedium+3.1 M2Michael HalsteadNEW
13035Extend autobuilder worker bringup testing to include limit changesminorMedium+3.1 M4Michael HalsteadNEW0.2
13672Pushing recent OE-Core changes gave patchwork tracebacknormalMedium+3.1 M4Michael HalsteadNEW
13833Request to create a repository for a new meta layer: meta-intel-edge-consolidationnormalMedium+3.1 M4Michael HalsteadNEW
12571add IN PROGRESS DOCUMENTATIONnormalMedium+Q2Michael HalsteadACCEPTED
13015Upgrade bugzilla to a new version and drop testopianormalMedium+Q4Michael HalsteadIN PROGRESS DESIGN
 6       
Michael Opdenacker
14307Some documentation hyperlinks are not workingnormalMedium+3.3 M4Michael OpdenackerIN PROGRESS REVIEW
 1       
Mingli Yu
13768base-files do_package fatal error in subprocessnormalMedium+3.3 M4Mingli YuNEW
13819No clue when CONNECTIVITY_CHECK_URIS is unaccessibleminorMedium+3.3 M4Mingli YuNEW
13311xargs: fdleak.c:396: complain_about_leaky_fds: Assertion `no_leaks' failed.normalMedium+3.3 M4Mingli YuACCEPTED
13674master dnf failures on qemumipsnormalMedium+3.4 M1Mingli YuNEW
14177tcl ptest intermittent failurenormalMedium+3.4 M1Mingli YuNEWAB-INT
 5       
Chris Laplante
13808do_task[noexec] = "" marks task noexec, which is inconsistent with docsnormalMedium+3.3 M3Chris LaplanteNEW
13566Write tests for multiconfig files in layers and documentnormalMedium+3.3 M3Chris LaplanteACCEPTED
14040recipetool: creating binary recipe from upstream git repo without explicit PV causes circular reference in SRC_URInormalMedium+3.3 M3Chris LaplanteNEW
 3       
New Comer Bugs
13425Add bblock and bbunlock helper toolsnormalMedium+3.3 M4New Comer BugsNEW
14126resolvconf incompatible with busybox flocknormalMedium+3.3 M4New Comer BugsNEWbackport to 3.2, 3.1 NEWCOMER
 2       
Nicolas Dechesne
14168#new-recipe-makefile-based-package does not exist anymorenormalMedium+3.3 M3Nicolas DechesneNEW
14121Implement sphinx switchers.js for bitbakenormalMedium+3.3 M4Nicolas DechesneNEW
14115Improve the support for multiple versions on the docs websitenormalMedium+3.3 M4Nicolas DechesneNEW
 3       
Robert Berger
14120pkg_postinst_ontarget_${PN}normalMedium+3.3 M3Robert BergerNEW
 1       
Prabin CA
14333submodule helper is not handled properly for devtool enabled workspacecriticalMedium+3.3 M4Prabin CANEW
 1       
Chen Qi
10693Add a testcase for multilib eSDK on the autobuilderenhancementMedium+3.4 M1Chen QiNEW5
13182Inconsistency detected by ld.so: dl-open.c: 274: dl_open_worker: Assertion xxx failednormalMedium+3.4 M2Chen QiNEW
 2       
Khem Raj
14116Go cannot compile on targetnormalMedium+3.3 M3Khem RajNEW
14192gcc/kernel: crypto/aegis128-neon-inner.c can not be built anymorenormalMedium+3.3 M3Khem RajNEW
14254oe-selftest-centos: gotoolchain.oeGoToolchainSelfTest.test_go_dep_build failednormalMedium+3.3 M3Khem RajNEW
14290golang TLS hanshake timeoutnormalMedium+3.4 M1Khem RajNEWAB-INT
 4       
Randy MacLeod
13788zeus-nut] selftest failure PackageTests.test_gdb_hardlinknormalMedium+3.0.5Randy MacLeodNEW
14295ptest test image core-image-sato-sdk-ptest failurenormalMedium+3.3 M4Randy MacLeodNEW
13123package.PackageTests.test_gdb_hardlink_debug failednormalMedium+3.4 M1Randy MacLeodNEWAB-INT
14197strace ptest intermittent failure in delay.testnormalMedium+3.4 M1Randy MacLeodNEWAB-INT
14284strace ptest intermittent failure in strace--relative-timestamps-us.gen.testnormalMedium+3.4 M1Randy MacLeodNEWAB-INT
 5       
Richard Purdie
10748Means of querying history for a single variableenhancementMedium+3.4 M1Richard PurdieIN PROGRESS REVIEW2
12090bitbake resident server reconnect needed ?normalMedium+3.4 M1Richard PurdieNEW1
12368persistent bitbake server does not re-parse if previous build was ctrl+C'dnormalMedium+3.4 M1Richard PurdieNEW
12986Failed to expand SRCPV on updateding SRC_URI using pn overrides and BBCLASSEXTENDnormalMedium+3.4 M1Richard PurdieNEW
13183bitbake-layers crashes with incorrect layer configuration data is given (expected proper error printing and exit with error)normalMedium+3.4 M1Richard PurdieNEW
13278?If git protocol doesn't work, you get a tar.gz clone from PREMIRROR which has git protocol originmajorMedium+3.4 M1Richard PurdieNEW
13448bitbake master appears to expand variables it should not need tonormalMedium+3.4 M1Richard PurdieNEW
13699Prolonged recipe parsing times after removing tmp when the resident bitbake server is usednormalMedium+3.4 M1Richard PurdieNEW
13711Parsing fails on externalsrc recipe containing both git and file in SRC_URInormalMedium+3.4 M1Richard PurdieNEWwith backport
13823fetch2: PREMIRROR and SRC_URI with users on both url yields invalid usernamenormalMedium+3.4 M1Richard PurdieNEW
13886bitbake resident server does not honour --runonly or --runall optionsnormalMedium+3.4 M1Richard PurdieNEW
13973change siginfo data format to json for reproducibility? (siginfo files currently not reproducible)normalMedium+3.4 M1Richard PurdieNEW
14088Attempting to override RDEPENDS_${PN} from global config doesn't worknormalMedium+3.4 M1Richard PurdieNEW
14156gitsm: submodules are fetched as mirrored and not working as expectednormalMedium+3.4 M1Richard PurdieNEW
14339bitbake generates zombie Parser processes (hard to reproduce)normalMedium+3.4 M1Richard PurdieNEW
14340improve detection and error reporting when oe-core is missingenhancementMedium+3.4 M1Richard PurdieNEW
14342Setscene tasks in both covered and notcovered errors at the end of buildminorMedium+3.4 M1Richard PurdieNEW
13599Enhancement: Detect variables that shouldn't be defined in image scope, but in global (distro) scopeenhancementMedium+3.4 M1Richard PurdieNEW
11449Allow overriding classes to override overridden classesenhancementMedium+3.4 M1Richard PurdieNEW5
12970uninative file should be versionnedenhancementMedium+3.4 M1Richard PurdieNEW
13424devupstream doesn't work with mutilibnormalMedium+3.4 M1Richard PurdieNEW
13729Changing siteinfo files doesn't change task checksumnormalMedium+3.4 M1Richard PurdieNEW
14123Intermittent FileNotFound error on autobuilder oe-selftest-debiannormalMedium+3.4 M1Richard PurdieNEWAB-INT
14227Intermittent oe-selftest fails with bash 5.1 do_compilenormalMedium+3.4 M1Richard PurdieNEWAB-INT
14328Mitigate AB ptest intermittent failurenormalMedium+3.4 M1Richard PurdieNEWAB-INT
11746oe-selftest: capture self.logger messages in XML outputenhancementMedium+3.4 M1Richard PurdieNEW2
 26       
Ross Burton (Arm)
14108Don't ignore certificates in wget fetchernormalMedium+3.4 M1Ross Burton (Arm)NEW
13999do_packagedata setscene file racenormalMedium+3.4 M1Ross Burton (Arm)NEWAB-INT
14094Switch RPM to use Sqlite instead of BDBnormalMedium+3.4 M1Ross Burton (Arm)NEW
14190qa-extra2 failing on AB with dnf checksum failuresnormalMedium+3.4 M1Ross Burton (Arm)NEWAB-INT
14137Add selftest to verify images with different package managers are identicalenhancementMedium+3.4 M2Ross Burton (Arm)NEW
13878xserver-nodm-init: broken XDG_RUNTIME_DIR setupnormalMedium+3.4 M2Ross Burton (Arm)NEWbackport 3.1
13896gtk-icon-cache.bbclass passes wrong parameter to update_gtk_icon_cache postinst interceptnormalMedium+3.4 M2Ross Burton (Arm)NEWbackport
14141devtool modify fails with submodulesenhancementMedium+3.4 M2Ross Burton (Arm)NEW
 8       
Sakib Sajal
7600syslinux: port extX support patches to syslinux communityenhancementMedium+3.4 M1Sakib SajalIN PROGRESS IMPLEMENTATION5
13766Using TCLIB=musl results in SDKs producing incompatible binariesmajorMedium+3.4 M1Sakib SajalNEW
13904do_prepare_recipe_sysroot: postinst-useradd-* does not run in order of dependency and sometimes failsnormalMedium+3.4 M1Sakib SajalNEW
13950Intermittent qemu connection failures during oe-selftest on autobuildernormalMedium+3.4 M1Sakib SajalNEWAB-INT
14006Create facilty to collect build system statisticsenhancementMedium+3.4 M1Sakib SajalNEW
14007When qemu hangs, try to create a snapshot or core file.enhancementMedium+3.4 M1Sakib SajalNEW
13288pseudo should not follow symlinks in /procnormalMedium+3.4 M1Sakib SajalNEW
13802ltp tests fail with ssh connection lost error intermittentlynormalMedium+3.4 M1Sakib SajalNEWAB-INT AB-INT-TMPFS
 8       
Sangeeta Jain
14065Automated ptest regression testingmajorMedium+3.4Sangeeta JainNEW
 1       
Saul Wold
14002ssh connection failure during stap testing on qemuarmnormalMedium+3.4 M1Saul WoldACCEPTEDAB-INT
14095signing selftest failure in test_signing_sstate_archive debina9-ty-2normalMedium+3.4 M1Saul WoldNEWAB-INT
14230qemuarm testimage shows serial login warningnormalMedium+3.4 M1Saul WoldNEWAB-INT AB-INT-TMPFS
 3       
Shachar Menashe
14125busybox wget ssl is exposed to MitM attack due to CVE-2018-1000500normalMedium+3.3 M4Shachar MenasheIN PROGRESS DESIGN COMPLETEbackport to 3.2, 3.1
 1       
Stacy
14077devtool doesn't handle server failing to startup gracefullynormalMedium+3.3 M4StacyNEWbackport to 3.2
14099PACKAGE_EXCLUDE not removing packages when PACKAGE_CLASSES = "package_deb"normalMedium+3.3 M4StacyNEW
13520many valgrind tests fail for arm64normalMedium+3.4 M1StacyIN PROGRESS DESIGN
14090devtool.DevtoolExtractTests.test_devtool_deploy_target selftest failurenormalMedium+3.4 M1StacyNEWAB-INT backport 3.2
 4       
Steve Sakoman
14031Exception: KeyError: 'getpwuid(): uid not found: 1000' after 3.1.1 to 3.1.2 updatenormalMedium+3.1.7Steve SakomanNEW
 1       
Tim Orling
11385poky-container: clarify that meta-data should be checked out using native tools that run the host and not with tools in containernormalMedium+3.4 M1Tim OrlingNEW1
13690runqemu with slirp, forwarded host ports are not available on hostnormalMedium+3.4 M1Tim OrlingIN PROGRESS IMPLEMENTATION
13938devtool modify virtual/kernel fails when EXTRAVERSION field is empty in MakefilenormalMedium+3.4 M1Tim OrlingACCEPTED
13411ptest-perl.bbclass run-ptest is too greedy for SKIPnormalMedium+3.4 M1Tim OrlingIN PROGRESS IMPLEMENTATION
14258perl ptest intermittent failurenormalMedium+3.4 M1Tim OrlingNEWAB-INT
13930Port the CROPS toaster-container selenium tests to the AutobuildernormalMedium+3.4 M2Tim OrlingIN PROGRESS DESIGN
14098absolute path in TEMPLATECONF should be rejected or warned, makes ext-sdk uninstallablenormalMedium+3.4 M2Tim OrlingNEWbackport 3.2
 7       
Trevor Gamblin
13784Sysvinit log file creation in /var/log sometimes fails at first bootnormalMedium+3.3 M4Trevor GamblinIN PROGRESS DESIGN
13298python3 ptest results are inconsistent per imagenormalMedium+3.3 M4Trevor GamblinIN PROGRESS DESIGNNEWCOMER
13889python3 Windows distutils stubs regressed in upgrade to 3.8.2normalMedium+3.3 M4Trevor GamblinNEWbackport?
13921SERIAL_CONSOLES SERIAL_CONSOLES_CHECKnormalMedium+3.3 M4Trevor GamblinIN PROGRESS IMPLEMENTATION
13980Investigate replacements for PhantomJS for buildperf outputenhancementMedium+3.4 M1Trevor GamblinNEW
13054oe-selftest oelib.utils.TestMultiprocessLaunch.test_multiprocesslaunch failurenormalMedium+3.4 M1Trevor GamblinACCEPTEDAB-INT
14331Memory issues during oe-selftestnormalMedium+3.4 M1Trevor GamblinNEWAB-INT
 7       
Trevor Woerner
13891insane.bbclass: do_package_qa hangs when checking a FIFO (named pipe) filenormalMedium+3.3 M3Trevor WoernerIN PROGRESS REVIEW
 1       
Unassigned
14189Intermittent oe-selftest-debian fails with do_rootfs: No manifest generated from: mdadmnormalMedium+3.1.7UnassignedNEWAB-INT
13338SDK build fails if image contains bashnormalMedium+3.4 M1UnassignedNEWbackports
13463test linux-yocto-rt kernels toonormalMedium+3.4 M1UnassignedACCEPTED
5389bitbake/lib/bb/fetch2: filename too longnormalMedium+3.4 M1UnassignedIN PROGRESS IMPLEMENTATION4
10061Ctrl+C during BB_HASHCHECK_FUNCTION execution does not interrupt processing nicelyminorMedium+3.4 M1UnassignedNEW3
10731bitbake --observe-only doesn't work with memresnormalMedium+3.4 M1UnassignedNEW5
11781bitbake --observe-only may get KeyErrornormalMedium+3.4 M1UnassignedIN PROGRESS REVIEW3
11899broken 'bitbake --status-only' and 'bitbake -m'normalMedium+3.4 M1UnassignedNEW2
12023"bitbake-layers show-layers" doesn't show layer if it doesn't append itself to BBFILE_COLLECTIONSminorMedium+3.4 M1UnassignedNEW1
12367moving or removing tmp breaks persistent bitbake servernormalMedium+3.4 M1UnassignedNEW
13023Switch to memory resident bitbake by default in 3.3enhancementMedium+3.4 M1UnassignedNEW
13039fetch2: PREMIRROR and SRC_URI with type https and parameter downloadfilename yields invalid urlnormalMedium+3.4 M1UnassignedNEW
13181persist_data sqlite database mixed with forking is irreparably brokennormalMedium+3.4 M1UnassignedNEW
13233fetch2: try_premirror(): improve on updating repo from mirrorenhancementMedium+3.4 M1UnassignedNEW3
13353bitbake git fetcher does not honour BB_FETCH_PREMIRRORONLYnormalMedium+3.4 M1UnassignedNEW
13843bitbake worker stuck using 100% cpu on aborted buildnormalMedium+3.4 M1UnassignedNEW
14015URL Arguments in MIRROR/PREMIRROR get encodednormalMedium+3.4 M1UnassignedNEW
14045git fetcher deadlock with self-referencing sub-modulesenhancementMedium+3.4 M1UnassignedNEW
14262runcmd.RunCmdTests.test_stdin_timeout times outnormalMedium+3.4 M1UnassignedNEWAB-INT
5876Add a test for the kernel -c menuconfig optionenhancementMedium+3.4 M1UnassignedACCEPTED3
14196Add integration to send data to KCIDBenhancementMedium+3.4 M1UnassignedNEW
14303Result of build is not stored in testresult.json with resulttoolenhancementMedium+3.4 M1UnassignedNEW
141043.1.2 (not an option above) devtool finish does not copy recipe in layerenhancementMedium+3.4 M1UnassignedNEW
14201Bitbake server intermittent timeoutnormalMedium+3.4 M1UnassignedNEWAB-INT
14246devtool test failures: github tls timeoutnormalMedium+3.4 M1UnassignedNEWAB-INT
14273qemu CPU starvation triggers rcu_preempt stall detectionnormalMedium+3.4 M1UnassignedNEWAB-INT
14289failure in the command 'bitbake glibc-testsuite -c check'normalMedium+3.4 M1UnassignedNEWAB-INT
14299failure in the command 'bitbake gcc-runtime -c check'normalMedium+3.4 M1UnassignedNEWAB-INT
14341BitbakePrTests.test_stopping_prservice_message failsnormalMedium+3.4 M1UnassignedNEWAB-INT
13236sstate for host native packagesnormalMedium+3.4 M1UnassignedNEW
12290cross recipe kernel module dependency generation stopped workingnormalMedium+3.4 M1UnassignedACCEPTEDBackport 2
12374do_rootfs failed when len(TMPDIR) == 410normalMedium+3.4 M1UnassignedNEW2
12760CMake Toolchain File Has Wrong Module PathnormalMedium+3.4 M1UnassignedIN PROGRESS REVIEW1
12963nativesdk-opkg prefixes all internal paths with $SDKPATH and won't worknormalMedium+3.4 M1UnassignedNEW3
13004Automate yocto-check-layer -m optionenhancementMedium+3.4 M1UnassignedNEW
13279Make sure users/groups exist for package_write_* tasksnormalMedium+3.4 M1UnassignedNEW
13285YoctoProject Compatibility script improvements needednormalMedium+3.4 M1UnassignedNEW
13419recipes that add users to groups cannot rely on other recipes creating those groups (when population from sstate happens)normalMedium+3.4 M1UnassignedNEW
13612meta-skeleton fails yocto-check-layernormalMedium+3.4 M1UnassignedNEW
13705master] bitbake and hashserve.sock left behind when ^C a buildnormalMedium+3.4 M1UnassignedNEW
13868Python cache files get lost in packagesnormalMedium+3.4 M1UnassignedNEW
13897POSTINST_INTERCEPTS_DIR broken by undocumented POSTINST_INTERCEPTS_PATHS since thudnormalMedium+3.4 M1UnassignedNEWBackport
13910Intermittent host UID contamination highlighted by devtool testsnormalMedium+3.4 M1UnassignedNEW
13920uninative tarball license compliance in ESDKnormalMedium+3.4 M1UnassignedNEW
13976gdb8.3 do compile with musl is errornormalMedium+3.4 M1UnassignedNEW
14023oe-selftest doesn't work with BB_SERVER_TIMEOUT=60normalMedium+3.4 M1UnassignedNEW
14028Autobuilder buildtools run fails with "Qemu ended unexpectedly"normalMedium+3.4 M1UnassignedNEWAB-INT
14066bitbake core-image-base -c populate_sdk fails when image contains bash, core-utils and package_deb is usednormalMedium+3.4 M1UnassignedNEW
14081Not possible to get src package in image when using PACKAGE_DEBUG_SPLIT_STYLE='debug-file-directory'enhancementMedium+3.4 M1UnassignedNEWBackport
14096perl install race (pod2text)normalMedium+3.4 M1UnassignedNEWAB-INT
14128qemuppc failed to shutdownnormalMedium+3.4 M1UnassignedNEWAB-INT
14150devtool: modify: fails for gstreamer1.0-plugins-goodnormalMedium+3.4 M1UnassignedNEW
14151devtool build fails for python3normalMedium+3.4 M1UnassignedNEW
14154yocto-check-layer fails incorrectly with kernel hash changesnormalMedium+3.4 M1UnassignedNEW
14155yocto-check-layer fails with hash changes if license addednormalMedium+3.4 M1UnassignedNEW
14206oe-selftest perl errors on rpm based distrosnormalMedium+3.4 M1UnassignedNEW
14218Recipe rebuilds can contaminate buildsnormalMedium+3.4 M1UnassignedNEW
14251core-image-sato-1.0-r0:do_testimage FAILED when starting qemunormalMedium+3.4 M1UnassignedNEWAB-INT AB-INT-TMPFS
14259NFS mounting issue on qemux64 oe-selftest glibc.GlibcSelfTestSystemEmulated.test_glibcnormalMedium+3.4 M1UnassignedNEWAB-INT
14268ruby-ri-docs is not reproduciblenormalMedium+3.4 M1UnassignedNEW
14270go packages are not reproduciblenormalMedium+3.4 M1UnassignedNEW
14300libtool-cross parallelism build failurenormalMedium+3.4 M1UnassignedNEWAB-INT
14244util-linux script:_size ptest failurenormalMedium+3.4 M1UnassignedNEWAB-INT
14257gstreamer1.0 ptest intermittent failurenormalMedium+3.4 M1UnassignedNEWAB-INT
14263lttng-tools ptest intermittent failurenormalMedium+3.4 M1UnassignedNEWAB-INT
13631core-image-full-cmdline qemumips systemd boot failurenormalMedium+3.4 M1UnassignedNEW
14272qemumips64 testimage systemd didnt reach login promptnormalMedium+3.4 M1UnassignedNEWAB-INT
14274dnf parselogs failed on qemux86-64 due to networking errornormalMedium+3.4 M1UnassignedNEW
14275qemuarm64 parselogs fail due to udev taking to much timenormalMedium+3.4 M1UnassignedNEWAB-INT
14236npmsw does not support github URLs in the npm-shrinkwrap.json fileenhancementMedium+3.4 M2UnassignedNEW
 70       
Victor Kamensky
13992qemumips testimage keeps failingnormalMedium+3.4 M1Victor KamenskyNEWAB-INT
 1       
Yann Dirson
14100SDKPATH should not reference SDK_VERSIONnormalMedium+3.3 M3Yann DirsonNEW
 1       
Yi Zhao
11766"nobody" group added by systemd sysusers.dnormalMedium+3.3 M1Yi ZhaoACCEPTED5
14117When ifupdown ist configured for DHCP with IPv6 the system boot hangsnormalMedium+3.4 M4Yi ZhaoNEW
 2       
Yi Fan Yu
14208send-error-report fails with 500: INTERNAL SERVER ERRORnormalMedium+3.4 M1Yi Fan YuIN PROGRESS DESIGN
14158tinfoil.TinfoilTests.test_wait_event times outnormalMedium+3.4 M1Yi Fan YuACCEPTEDAB-INT
14051[QA 3.2 M3 RC1] failure in ptest : valgrind.drd and valgrind.helgrindnormalMedium+3.4 M1Yi Fan YuNEWbackport to 3.2
14163libevent arm ptest intermittent failurenormalMedium+3.4 M1Yi Fan YuNEWAB-INT
14170glib-2.0 codegen ptest failurenormalMedium+3.4 M1Yi Fan YuACCEPTEDAB-INT
14213gawk ptest intermittent failurenormalMedium+3.4 M1Yi Fan YuNEWAB-INT
14294valgrind memcheck/tests/linux/timerfd-syscall ptest intermittent failurenormalMedium+3.4 M1Yi Fan YuNEWAB-INT AB-INT-TMPFS
14296python3 ptest intermittent failurenormalMedium+3.4 M1Yi Fan YuNEWAB-INT
14311valgrind drd/tests ptest intermittent failurenormalMedium+3.4 M1Yi Fan YuIN PROGRESS DESIGNAB-INT
14324valgrind 3.17.0 ptest: swapcontext.vgtest failsnormalMedium+3.4 M1Yi Fan YuNEW
 10       

Medium Bugs and Enhancements by Owner !(Future, 3.99)

IDSummary (133 tasks) SeverityPMilestoneAssigneeStatusWhiteboardE
 0       
Alejandro Enedino Hernandez Samaniego
14008libtool-cross doesn't compile when using newlibnormalMedium3.3Alejandro Enedino Hernandez SamaniegoNEW
 1       
akuster
13677We never run "oe-test core" anywhere in the test infrastructurenormalMedium3.3 M4akusterACCEPTEDNEEDINFO
12925add test for devtool fails because of missing ca-certificates.crtnormalMedium3.4 M2akusterNEW
 2       
Alejandro
12170Add mkfs.ext support to busybox on poky-tinyenhancementMedium3.3AlejandroIN PROGRESS REVIEW3
 1       
Paul Eggleton
13019Easy way to switch branch for a recipeenhancementMedium3.3Paul EggletonIN PROGRESS IMPLEMENTATION
13757run-ptest not listed in sourcesenhancementMedium3.3Paul EggletonNEW
13780layer index: Branch Comparison layer filtering does not worknormalMedium3.3Paul EggletonNEW
12807devtool: ERROR: Source tree is not cleannormalMedium3.3Paul EggletonACCEPTED
13029devtool doesn't preserve package classes (e.g. "nativesdk-") in recipe file name during upgradenormalMedium3.3Paul EggletonNEW
13147ImportError: No module named site OpenEmbedded requires 'python' to be python v2 (>= 2.7.3), not python v3.normalMedium3.3Paul EggletonACCEPTED
 6       
Bruce Ashfield
13928KERNEL_FEATURES_append vs. "classic" kernel meta datanormalMedium3.4 M1Bruce AshfieldACCEPTED
5305Make sanitized kernel headers availableenhancementMedium3.4 M2Bruce AshfieldIN PROGRESS REVIEW 3
13172Kernels with non-standard names don't provide virtual/kernelnormalMedium3.4 M2Bruce AshfieldIN PROGRESS IMPLEMENTATION
9233As a developer, I want initramfs bundled kernel could be installed into rootfsnormalMedium3.4 M3Bruce AshfieldIN PROGRESS REVIEW2
 4       
Chee Yang
13548meta-intel do_testimage tasks failednormalMedium3.3Chee YangIN PROGRESS IMPLEMENTATION
13492Exploration to generate LVM partitions in (wic?) imagesenhancementMedium3.3Chee YangNEW
 2       
David Reyna
14286Nothing RPROVIDES 'nativesdk-glibc-utils' for windows sdknormalMedium3.3 M4David ReynaNEW3
12995Button to force refresh of data sourcesnormalMedium3.3 M4David ReynaACCEPTED2
13111Connect SRTool to YP BugzillaenhancementMedium3.3 M4David ReynaNEW4
13622Typo on the manage users pagenormalMedium3.3 M4David ReynaNEW0.5
13623On triage page, sorting by published date or lastModifiedDate does not worknormalMedium3.3 M4David ReynaNEW2
13624Enhancement: Add SRT Update column to triage pagenormalMedium3.3 M4David ReynaNEW1
13626CVE history does not capture some changesnormalMedium3.3 M4David ReynaNEW2
12591[2.4.2 rc2] Run again button from all builds page must run the specified tasknormalMedium3.3 M4David ReynaIN PROGRESS IMPLEMENTATION2
13173postgresql complain about long field name, the max is 200majorMedium3.3 M4David ReynaACCEPTED4
13191[Test Case 1439] Build Failure after adding or removing packages with and without dependenciesnormalMedium3.3 M4David ReynaACCEPTED2
13341Fields in orm_layer too small for URLsnormalMedium3.3 M4David ReynaNEW2
13764toaster: import build directory includes default layers in addition to the imported onesnormalMedium3.3 M4David ReynaNEW2
13000Bad flowing when window isn't very widenormalMedium3.4David ReynaACCEPTED3
13620Add 'date' buttons to CVE editingnormalMedium3.4David ReynaNEW2
13621Add ability to specify CPEnormalMedium3.4David ReynaNEW3
4284Presenting information provided by the diffsigs toolenhancementMedium3.4David ReynaNEW 5
 16       
Devendra Tewari
14301Incremental build in Docker fails with Invalid cross-device link errornormalMedium3.3Devendra TewariNEW
 1       
Diego Sueiro
14347Add bitbake-layers layerindex-fetch parameter to choose fetchdirenhancementMedium3.4Diego SueiroIN PROGRESS REVIEW
 1       
Dorinda
14193pseudo applies PSEUDO_IGNORE_PATHS variable too greedynormalMedium3.3DorindaNEW
 1       
Hongxu Jia
7149rpm: print which pkgname for warningenhancementMedium3.3Hongxu JiaNEWBackport to 2.6.15
10308rpm installs bad signature package with option --nodigest --nosignature failednormalMedium3.3 M4Hongxu JiaNEW5
 2       
Jaewon Lee
12884Extensible SDK: devtool sdk-update fails while Preparing build systemnormalMedium3.3Jaewon LeeACCEPTED
 1       
Joshua Watt
13259Switch SDK to be a self extracting python script instead of a self extracting shell scriptenhancementMedium3.4Joshua WattNEW
13515reproducible QA: Verify final images are binary identicalenhancementMedium3.4 M1Joshua WattNEW
 2       
Christopher Larson
13034Migrate python namespace packages from pkgutil to nativeenhancementMedium3.3Christopher LarsonNEW
 1       
Mark Morton
13235Document parallel fetch task limitation configuration optionminorMedium3.3Mark MortonACCEPTED2
10098npm fetcher is not documented in bitbake manualnormalMedium3.3Mark MortonIN PROGRESS REVIEW07 June 2019: IN PROGRESS REVIEW3
7136Packaging non-versioned libraries is non-trivialnormalMedium3.3Mark MortonNEW1
6142we need general documentation on Systemd vs SysV related issuesenhancementMedium3.3Mark MortonIN PROGRESS IMPLEMENTATIONJune 05, 2019: Proposed doc solution.5
6158Encourage best-practice configuration usageenhancementMedium3.3Mark MortonIN PROGRESS DESIGN20 January 2015: IN PROGRESS DESIGN 3
5600Sync the Glossary section with documentation.confenhancementMedium3.3Mark MortonIN PROGRESS DESIGN22 DECEMBER 2017: NEEDINFO5
13225Need better explanation of how recipes create packagesnormalMedium3.3Mark MortonACCEPTEDOctober 17 2019: ACCEPTED5
 7       
Matt Ranostay
13894python3 do_install fails when using PACKAGECONFIG to disable readlinenormalMedium3.3Matt RanostayNEWwith backport
 1       
Mingde (Matthew) Zeng
13730devtool tests break with strange files in treeminorMedium3.3Mingde (Matthew) ZengNEW
14019Default the target time to the time of the build hostenhancementMedium3.3Mingde (Matthew) ZengNEW
 2       
Michael Halstead
13372YP mailing list archivesenhancementMedium3.3 M3Michael HalsteadACCEPTED
 1       
Michael Opdenacker
14309Broken image in bibake manual CSS for versions 1.6.xminorMedium3.4Michael OpdenackerNEW
 1       
 
14169building binutil 2.32 in lead to include error in gold/errors.hnormalMedium3.3 NEW
9612functions used in recipes and recipe examples (like bb.utils.contains) not documented.enhancementMedium3.3 IN PROGRESS REVIEWNEWCOMER5
 2       
Naveen Saini
14248Can't enable qemu-usermode for intel-skylake-64 targetenhancementMedium3.4Naveen SainiNEW
 1       
New Comer Bugs
14140variable flags starting with underscore are silently ignorednormalMedium3.3New Comer BugsNEW
14232recipe checksum bypass bugnormalMedium3.3New Comer BugsNEWNEWCOMER
8744Need to standardize on a format for security bugsnormalMediumQ4New Comer BugsNEW
 3       
Oleksandr Kravchuk
14235bbclass file name convention is not consistent wrt dash and underscore ( - _ )enhancementMedium3.3Oleksandr KravchukIN PROGRESS DESIGNNEWCOMER
 1       
Peter Budny
14338Tmux -c (CWD) requires Tmux 1.9normalMedium0.0.0Peter BudnyIN PROGRESS REVIEW
 1       
Robert Berger
14119ipk package and package feed signingenhancementMedium3.4 M1Robert BergerNEW
 1       
Chen Qi
13474go install/build fails on target for programs importing log/syslognormalMedium3.3Chen QiNEW
7800systemd.bbclass doesn't check for services in systemd/user/ directoryenhancementMedium3.3Chen QiACCEPTED3
13141Systemd ROOT_HOME patch brokennormalMedium3.3Chen QiNEW
7710devtool: deploy-target: interact with target packaging where availableenhancementMedium3.4Chen QiIN PROGRESS DESIGN5
 4       
Khem Raj
13122Multilib check error: duplicate files pyconfig.h is not the samenormalMedium3.3Khem RajIN PROGRESS REVIEW
14016glibc build race in do_compilenormalMedium3.4 M1Khem RajNEWAB-INT
 2       
Randy MacLeod
14058Fatal errors occurred in subprocessesnormalMedium3.3Randy MacLeodNEW
13785strace ptests produce odd warningsnormalMedium3.3Randy MacLeodNEWbackport 3.1
 2       
Richard Purdie
13644'Picky' builds should be assigned to workers firstenhancementMedium3.4Richard PurdieNEW
13140data_smart.py fails when parsing ”${@<call>}”normalMedium3.4Richard PurdieNEW
13167build failure when SRC_URI has usehead param in multiple git reponormalMedium3.4Richard PurdieNEW
13449Functionality of Unpack parameter 'basepath' brokennormalMedium3.4Richard PurdieNEW
13968variables in BB_HASHBASE_WHITELIST built from non-whitelisted variables should trigger a warningnormalMedium3.4Richard PurdieNEW
13089Document best practices from the Core Infrastructure projectenhancementMedium3.4Richard PurdieNEW5
11777systemd ldconfig.service: always re-generates ld.so.cache (?) and fails on read-only rootfsnormalMedium3.4Richard PurdieNEW2
14111TMPDIR cannot contain ..normalMedium3.4Richard PurdieNEW
14124MODULE_CLASSES like KERNEL_CLASSES but for handling kernel modulesenhancementMedium3.4Richard PurdieNEW
 9       
Ross Burton (Arm)
13996Add selftest for gdbserverenhancementMedium3.4Ross Burton (Arm)NEW
8606Evaluate using connman-gtk instead of connman-gnomeenhancementMedium3.4Ross Burton (Arm)NEW3
9242Relocate segments in native binaries when restoring from sstateenhancementMedium3.4Ross Burton (Arm)NEW 4
9880Support locale archivesenhancementMedium3.4Ross Burton (Arm)NEW 5
9883curl-native: invalid builtin ca-bundle path when restoring from sstatenormalMedium3.4Ross Burton (Arm)NEW1
10737binconfig-disabled should install non-broken files to packagesnormalMedium3.4Ross Burton (Arm)NEW2
10749Add a class to update package index automaticallyenhancementMedium3.4Ross Burton (Arm)NEW3
10954dynamically detect dependency on libgccenhancementMedium3.4Ross Burton (Arm)NEW2
12960bitbake core-image-full-cmdline fails due to dependency on sysklogdnormalMedium3.4Ross Burton (Arm)NEW
13222Host dependencies needed to rebuild psplash pngsnormalMedium3.4Ross Burton (Arm)NEW
13271xmlcatalog.bbclass needs to support target postinstenhancementMedium3.4Ross Burton (Arm)NEW
13342Create ptest helper for python unittestsenhancementMedium3.4Ross Burton (Arm)NEW
13949"libdir" QA test bombs out when adding a symlink into another packagenormalMedium3.4Ross Burton (Arm)NEW
14070Devtool modify failed if recipe doesn't do git properlynormalMedium3.4Ross Burton (Arm)NEW
14110cve-check fails with 'attempt to write a readonly database'normalMedium3.4Ross Burton (Arm)NEW
14148yocto-check-layer argument parser is badnormalMedium3.4Ross Burton (Arm)NEW
14049[QA 3.2 M3 RC1] failure in ptest : pango.pango/test-layout.testnormalMedium3.4Ross Burton (Arm)NEW
 17       
Sakib Sajal
12482perf: Add PACKAGECONFIGs for auto-detected features such as libauditenhancementMedium3.3Sakib SajalNEWNEWCOMER3
12388runqemu: support setting the -cpu <NAME> from the command lineenhancementMedium3.4 M1Sakib SajalNEW
 2       
Tim Orling
13643Find a way to support containers on the existing autobuilder workersenhancementMedium3.4Tim OrlingIN PROGRESS IMPLEMENTATION8
13831Add information about buildtools-extended-tarball to yocto-autobuilder-helper READMEenhancementMedium3.4Tim OrlingNEW
11097Create persistent dummy git userenhancementMedium3.4Tim OrlingNEW0.5
13376Need better perl module dependency toolingenhancementMedium3.4Tim OrlingIN PROGRESS IMPLEMENTATION8
6170Toaster needs to expose errors/warnings in its own logsnormalMedium3.4Tim OrlingNEWGUI design available4
 5       
Trevor Gamblin
12292Example for oe-selftest extensionsenhancementMedium3.3Trevor GamblinNEW2
13871testimage assumes tools are installed on target for testimage_dump_target() functionnormalMedium3.3Trevor GamblinIN PROGRESS DESIGN
13872testimage assumes tools are installed on host for testimage_dump_host() functionnormalMedium3.3Trevor GamblinNEW
 3       
Unassigned
14209Intermittent core-image-sato-1.0-r0 do_testimage fails with: systemd-journald.service: Failed with result 'watchdog'normalMedium3.1.7UnassignedNEWAB-INT
14346test_rpm_query_nonroot fails to delete usernormalMedium3.1.7UnassignedNEWAB-INT
8161Can't use "\" characters in SRC_URI entries - not even escapednormalMedium3.3UnassignedNEW2
8612Add a locked sigs mode allowing locked task to rerunenhancementMedium3.3UnassignedNEW3
9061git fetcher inconsistency for working with PREMIRRORS.normalMedium3.3UnassignedNEW5
11704Add other resource monitoring options to conf/local.conf STOPTASKS/ABORTenhancementMedium3.3UnassignedNEW3
13665gitsm fetcher and PREMIRROR does not use git to clone repositoriesnormalMedium3.3UnassignedNEW
13995\ without a newline passes the parsernormalMedium3.3UnassignedNEW
14195ERROR: Task (virtual:native:/home/student/resy_sdk/layers/poky-training/meta/recipes-devtools/pseudo/pseudo_git.bb:do_fetch) failed with exit code 'setscene whitelist'normalMedium3.3UnassignedNEW
12107useradd-staticids: groupadd: GID already existsnormalMedium3.3UnassignedNEWBackport 2.4.21
13510reproducible QA: Fake host name for better reproducibiltyenhancementMedium3.3UnassignedNEW
13511reproducible QA: Fake user for better reproducibiltyenhancementMedium3.3UnassignedNEW
13518reproducible QA: Test sstate files for reproduciblityenhancementMedium3.3UnassignedNEW
13521reproducible QA: Test other architecturesenhancementMedium3.3UnassignedNEW
13706dnf parslogs failure (mips/systemd)normalMedium3.3UnassignedNEWautobuilder
13858piglit build racenormalMedium3.3UnassignedNEW
13863icecc no longer works with kernel recipesnormalMedium3.3UnassignedNEWbackport 3.1
13864archiver class incompatible with dos2unix classnormalMedium3.3UnassignedNEW
14145pylibmount PACKAGECONFIG in util-linux causes circular dependencynormalMedium3.3UnassignedNEW
14176Random do_ar_patched failure due to race condition with do_configure autoconfmajorMedium3.3UnassignedNEW
13509reproducible QA: Fake time in the future for better reproducibilitynormalMedium3.3 M4UnassignedNEW
12982Add booting an NFS root file system for testimageenhancementMedium3.4 M1UnassignedACCEPTED
14029qemuarm image failed ping testnormalMedium3.4 M1UnassignedNEWAB-INT
 23       
Yann Dirson
14017buildhistory-collect-srcrevs wrongly outputs glibc SRCREVnormalMedium3.3Yann DirsonNEW
 1       
Yi Zhao
7984RPM backend does not honor package overrides for PACKAGE_ARCHnormalMedium3.4Yi ZhaoACCEPTED5
11862Package QA fails if library is installed in a non-standard location (tries to read the .so link to check if it's an ELF)normalMedium3.4Yi ZhaoIN PROGRESS REVIEW3
 2       
 
14186/run/lock is missingnormalMedium3.3 NEWbackport to 3.2
 1       

Low Bugs and Enhancements by Owner !(Future, 3.99)

IDSummarySeverityPMilestoneAssigneeStatusWhiteboardE
 0       

Major or Critical

IDSummary (18 tasks) SeverityPMilestoneAssigneeStatusWhiteboardE
13888Toaster is not starting for Django-3majorMedium+3.1.7David ReynaIN PROGRESS REVIEW2
14176Random do_ar_patched failure due to race condition with do_configure autoconfmajorMedium3.3UnassignedNEW
14060devtool modify fails when applied on recipes using patchesmajorMedium+3.3 M3Paul EggletonNEW
14333submodule helper is not handled properly for devtool enabled workspacecriticalMedium+3.3 M4Prabin CANEW
13173postgresql complain about long field name, the max is 200majorMedium3.3 M4David ReynaACCEPTED4
14020environment-setup script in multilib eSDK doesn't work for multilib variantmajorMedium+3.3 M4Robert YangIN PROGRESS IMPLEMENTATION
14065Automated ptest regression testingmajorMedium+3.4Sangeeta JainNEW
13278?If git protocol doesn't work, you get a tar.gz clone from PREMIRROR which has git protocol originmajorMedium+3.4 M1Richard PurdieNEW
13766Using TCLIB=musl results in SDKs producing incompatible binariesmajorMedium+3.4 M1Sakib SajalNEW
14127cve-check falsely indicates a vulnerabily to be patchedmajorMedium+3.4 M1Chee YangNEW
14207pseudo abort with wic imagesmajorMedium+3.4 M1Chee YangNEW
14044STAGING_KERNEL_DIR symlink has been broken if externalsrccriticalMedium+3.4 M3Bruce AshfieldIN PROGRESS DESIGNBackport to 3.1.x
8879opkg-utils is built when build lib32-imagemajorMedium3.99Gregor ZatkoIN PROGRESS IMPLEMENTATION5
10304QEMU doesnot support e6500 emulation for gobject-introspectionmajorMediumFutureOtavio SalvadorNEW
13387binutils on target broken with gcc 9 on mipsmajorMediumFutureUnassignedNEW
14330Downloads and front pages not advertising the latest releases.majorMedium+Q2akusterACCEPTED
13517meta-ti (a345e0c2) Linux kernel fails to boot on Beagleboard-xM (rev C)criticalUndecided---Denys DmytriyenkoNEW
13519meta-ti (a345e0c2) U-Boot MLO execution fails on Beagleboard-xM (rev C)criticalUndecided---Denys DmytriyenkoNEW
 18       

3.99 Bugs by Owner

IDSummary (131 tasks) AssigneeStatusMilestoneSeverityP
 0     
Aaron Chan
11737include selftest tests for devtool import/export pluginsAaron ChanACCEPTED3.99normalMedium+
 1     
Armin Kuster
12989qemumips64 libn32 build of valgrind fails: long-double[-32 vs -n32.h]Armin KusterIN PROGRESS DESIGN3.99minorMedium
 1     
Anuj Mittal
418uvesafb is required to be a module on qemux86/qemux86-64 targetAnuj MittalNEW3.99normalLow
12927Cannot strip and sign kernel modulesAnuj MittalNEW3.99normalMedium+
 2     
Paul Eggleton
7852bitbake-layers layerindex-fetch doesn't respect branch (-b|--branch) optionPaul EggletonIN PROGRESS DESIGN3.99normalMedium
9360devtool: update-recipe ignores SRC_URI_appendPaul EggletonNEW3.99normalMedium
9627devtool seems to mangle incorrectly the .bb file, when modifying the set of patches for a componentPaul EggletonNEW3.99normalMedium
9638devtool changes the format of the SRC_URI unnecessarilyPaul EggletonNEW3.99normalMedium
10784devtool: Misleading error message when running "devtool runqemu" before building imagePaul EggletonNEW3.99normalMedium
10820devtool: -d/--debug doesn't show bitbake debug outputPaul EggletonNEW3.99minorMedium
10940Tinfoil: Increase the test coverage for tinfoil suite on selftestPaul EggletonACCEPTED3.99normalMedium
11407devtool should warn user of prior download after resetPaul EggletonNEW3.99normalMedium
12130Layer index update script outputs initial info to consolePaul EggletonNEW3.99normalMedium
12677devtool modify <recipe> errors out when the recipe uses ${WORKDIR} in do_installPaul EggletonNEW3.99normalMedium
12678devtool finish ignoring PREFERRED_PROVIDER_virtual/kernelPaul EggletonNEW3.99minorMedium
11839buildhistory + multiconfigPaul EggletonNEW3.99normalMedium+
12395kernel set up with devtool modify builds with wrong config after cleaningPaul EggletonNEW3.99normalMedium+
12674devtool modify does not preserve patch header after scissors linePaul EggletonNEW3.99normalMedium+
 14     
Bruce Ashfield
6986linux-yocto do_patch fails with a long working directory pathBruce AshfieldIN PROGRESS DESIGN3.99normalMedium
8743configme --allnoconfig breaks defconfig generated with kconfig / make savedefconfigBruce AshfieldIN PROGRESS IMPLEMENTATION3.99normalMedium
10962device tree compiler does not support @ to compile overlayBruce AshfieldACCEPTED3.99normalMedium
 3     
Changqing Li
13627Align setting of NDEBUG define in build system classesChangqing LiNEW3.99normalMedium
13005Patchtest did not detect missing bb files changesChangqing LiIN PROGRESS REVIEW3.99normalMedium+
13464Argument list too long when do rootfs when install too many packagesChangqing LiNEW3.99normalMedium+
13532Add SPDX license headers to all source files for patchest-oeChangqing LiIN PROGRESS REVIEW3.99normalMedium+
13684Patchwork instance is python2; needs to be updated to newer Django version (patchwork-fdo is now Django 2.2 LTS)Changqing LiNEW3.99normalMedium+
13854xserver-nodm.service failed with xf86OpenConsole: Switching VT failedChangqing LiNEW3.99minorMedium+
 6     
David Reyna
8190The 'set in file' filters in the BitBake variables table seem to return the wrong informationDavid ReynaACCEPTED3.99normalLow
9115Added packages filter seems to show the wrong package listDavid ReynaNEW3.99normalLow
9645The image recipe details does not show "Last build" informationDavid ReynaACCEPTED3.99normalLow
9657Saving an added variable seems to save all other added variablesDavid ReynaACCEPTED3.99normalLow
12142The color from the table from the project build changed when you use an special character.David ReynaACCEPTED3.99normalLow
12261[Toaster] Importing layers, confirmation label is misleadingDavid ReynaNEW3.99normalLow
7502Show image information if rootfs files are generatedDavid ReynaNEW3.99normalMedium
8051Importing layer fails silently if the layer name already existsDavid ReynaACCEPTED3.99normalMedium
9494Custom images created from the build history pages fail to buildDavid ReynaACCEPTED3.99normalMedium
9530Arrows in directory structure do not expand directoriesDavid ReynaNEW3.99normalMedium
9586document and verify production setup for jenkins ci interactionDavid ReynaNEW3.99normalMedium
9743builds: The search result of the content of the builds table is incorrectDavid ReynaNEW3.99normalMedium
10283Consume TaskArtifacts metadata event created in bitbakeDavid ReynaIN PROGRESS IMPLEMENTATION3.99normalMedium
10488Changing Git revision in Toaster has no effectDavid ReynaNEW3.99normalMedium
10943buildinfohelper does not consider IMAGE_EXTENSION while saving build artifactsDavid ReynaNEW3.99normalMedium
12003Incorrect performance tables if Edit Column drop down is usedDavid ReynaACCEPTED3.99normalMedium
12005Cant download other artifacts when modifying built recipeDavid ReynaACCEPTED3.99normalMedium
12133The search results for numbers are incorrect.David ReynaACCEPTED3.99normalMedium
12140The link and the x button from the search's result did not work as expectedDavid ReynaACCEPTED3.99normalMedium
12200The button from New custom image is not working as expectedDavid ReynaNEW3.99normalMedium
12201The button from New custom image is letting you press it and its supposed to be disabled.David ReynaNEW3.99normalMedium
12208on the import layer page, the "add layer" button for dependent layers is active, when emptyDavid ReynaACCEPTED3.99normalMedium
12259[toaster] when building 3 or more images left hand summary is not shown correctlyDavid ReynaNEW3.99normalMedium
12260[toaster]why arent the meta-qt3 and meta-qt4 present in the compatible layers for pokyDavid ReynaNEW3.99normalMedium
12263[Toaster] project layers can be duplicatedDavid ReynaNEW3.99normalMedium
12436[Test Case 1958] Project names cannot be blankDavid ReynaNEW3.99normalMedium
12437[Test Case 1958] Toaster exploratory testingDavid ReynaNEW3.99normalMedium
12262[Toaster] Layer details page: optional layers cant be blank when importing a layerDavid ReynaNEW3.99normalMedium+
 28     
yeoh ee peng
12411Add automation for eSDK artifacts downloaded from the autobuilderyeoh ee pengNEW3.99normalMedium+
12465test case test_check_rpm_install_removal_log_file_size failedyeoh ee pengNEW3.99normalMedium+
 2     
Gregor Zatko
8879opkg-utils is built when build lib32-imageGregor ZatkoIN PROGRESS IMPLEMENTATION3.99majorMedium
 1     
Joe Slater
8158INCOMPATIBLE_LICENSES has unexpected results with GNU librariesJoe SlaterNEW3.99normalMedium+
 1     
Joshua Watt
13686meta-mingw produces a symlink to host /etc/ld.so.cache in the x86-64_mingw32 folderJoshua WattNEW3.99minorLow
12585Windows SDK ".XZ" archives do not correctly unpackJoshua WattNEW3.99normalMedium+
 2     
Kai Kang
9789systemd rootfs-postprocess command should check staticidsKai KangACCEPTED3.99normalMedium
 1     
Robert Yang
13306bitbake starts up to n^2 processes with n cpusRobert YangNEW3.99normalMedium+
 1     
Aníbal Limón
13016How to run our test suites for boards like beaglebone remotely on a LAVA board farm?Aníbal LimónIN PROGRESS DESIGN3.99normalMedium+
 1     
Mark Hatle
9207Need to fix prelink to iterate mulitlibsMark HatleNEW3.99normalMedium
 1     
Michael Halstead
13470Autobuilder NFS loses open deleted filesMichael HalsteadNEW3.99normalMedium
 1     
Mingli Yu
11802system spontaneously logs out while building core-imageMingli YuNEW3.99normalMedium+
 1     
Naveen Saini
12584Generic EFI booting needs to support random UUIDsNaveen SainiNEW3.99normalMedium
12755Separate boot config recipes are at odds with setting APPEND at the image levelNaveen SainiNEW3.99normalMedium+
 2     
New Comer Bugs
12389oe-selftest devtool tests fails when repository comes from a tarballNew Comer BugsNEW3.99normalMedium
 1     
Paul Barker
12522License checksum change test doesnt workPaul BarkerIN PROGRESS REVIEW3.99normalMedium+
12868archiver ARCHIVER_MODE[src] = "patched" and ="configured" fails to build. Morty works. Pyro, sumo, master etc failPaul BarkerACCEPTED3.99normalMedium+
 2     
Randy MacLeod
9504knotty doesn't delete lines if the number of output lines is larger than then number of lines in the terminal (tmux specific?)Randy MacLeodACCEPTED3.99normalMedium
 1     
Richard Purdie
6258svn fetch uses last changed revision instead of revision on a svn branch.Richard PurdieNEW3.99normalLow
5395Nativesdk postinstalls directory issues.Richard PurdieNEW3.99normalMedium
7298packagegroups are not rebuilt when rdependency pkg name changesRichard PurdieNEW3.99normalMedium
7879Similar recipe names cause problems with PN auto setting (usability issue)Richard PurdieNEW3.99normalMedium
9272BBCLASSEXTEND="cross" overrides do_install()Richard PurdieNEW3.99normalMedium
10867bitbake with extra fetcher fails allow SRCPVRichard PurdieNEW3.99normalMedium
11683sanity.bbclass: bblayers.conf upgrade broken for versions 5 to 7Richard PurdieNEW3.99normalMedium
11686sanity.bbclass: bblayers.conf upgrade not happening on base config parse errorsRichard PurdieNEW3.99normalMedium
11772[PATCH] event: temporarily disable verbose logsRichard PurdieNEW3.99normalMedium
13979yocto-autobuilder-helper repository value appears to be ignored in a-full builds.Richard PurdieNEW3.99normalMedium
14345unpack shared repositories fails to copy poky repoRichard PurdieNEW3.99normalMedium
11593bb.fetch2.get_srcrev ExpansionError with ;subdir=${S} SRC_URIsRichard PurdieNEW3.99normalMedium+
12066Locked signature change triggers taskhash mismatch errorRichard PurdieNEW3.99normalMedium+
12180Installing conflicting files in RSS results in an exceptionRichard PurdieNEW3.99normalMedium+
12707HOSTTOOLS: include version checksRichard PurdieNEW3.99normalMedium+
 15     
Ross Burton (Arm)
11674core-image-sato-sdk-ptest build error for cpio imageRoss Burton (Arm)NEW3.99normalMedium
12273Shlibs should only be public if they're in $libdir etcRoss Burton (Arm)NEW3.99normalMedium+
 2     
Tim Orling
12752Check that patches don't have a github /archive/ URLTim OrlingNEW3.99normalMedium+
 1     
Trevor Gamblin
12715cross compiler for 'mips64 + libn32' cannot work correctly inside SDKTrevor GamblinNEW3.99normalMedium+
 1     
Unassigned
8015Debug source splitting breaks when externalsrc is enabledUnassignedACCEPTED3.99normalMedium
8582Error message not in log fileUnassignedNEW3.99normalMedium
8688busybox syslog not update-alternatives awareUnassignedNEW3.99normalMedium
9069perf: missing python modules for scripts in 'perf report'UnassignedIN PROGRESS REVIEW3.99normalMedium
9171Consider limiting the scope of depchains to runtime depsUnassignedNEW3.99normalMedium
9279Issue with PREFERRED_PROVIDER interaction with overridesUnassignedNEW3.99normalMedium
9424systemd tmpfiles.d warnings (volatile, resolv.conf)UnassignedNEW3.99minorMedium
9982Move patches directory to WORKDIR/patches from S/patchesUnassignedNEW3.99normalMedium
10194bitbake-whatchanged is brokenUnassignedNEW3.99normalMedium
11199Fetch.checkstatus() should work on git URIsUnassignedNEW3.99normalMedium
11623Can't generate eSDK when using a locked-sigs.incUnassignedNEW3.99normalMedium
11706oe-setup-rpmrepo no longer works with RSSUnassignedIN PROGRESS DESIGN3.99normalMedium
11801rpmbuild fails randomly when try to build a spec fileUnassignedNEW3.99normalMedium
12068[psplash] wrong support of 800 x 480 imagesUnassignedNEW3.99minorMedium
12153in an esdk, devtool fails to build ovmfUnassignedACCEPTED3.99normalMedium
12172devtool build linux-yocto fails to deploy bzImage into tmp/deploy/images/<arch>/bzImageUnassignedNEW3.99normalMedium
12284LIC_FILES_CHKSUM test-case throws false-positives on production machine onlyUnassignedNEW3.99normalMedium
12556devtool is passing -C to git and this is throwing errorsUnassignedNEW3.99normalMedium
12636patchtest is failing to understand the rename patchUnassignedIN PROGRESS REVIEW3.99normalMedium
13017PnP target QAUnassignedNEW3.99normalMedium
13875Include YP docs in SDKUnassignedNEW3.99normalMedium
9104ffmpeg libraries are missing -dbg packagingUnassignedNEW3.99normalMedium+
10165Check for and explain if UTF-8 is missingUnassignedNEW3.99normalMedium+
10597license_create_manifest fails when linux-dummy is used to create own kernelUnassignedNEW3.99normalMedium+
10629package brought in by runtime dependency of a complementary package does not have its own complementary package installedUnassignedNEW3.99normalMedium+
10716Patchwork: track older release branchesUnassignedACCEPTED3.99normalMedium+
11138Extensible SDK: recipe-specific sysroots broke user additions to the SDK's shared sysrootUnassignedNEW3.99normalMedium+
11904Bad line continuation in bblayers.conf causes ugly server messageUnassignedNEW3.99normalMedium+
11933oe-selftest: unset SANITY_TESTED_DISTROS automatically when oe-selftest is launchedUnassignedNEW3.99normalMedium+
11963QA: Create automated testing to cover ESDK artifacts downloaded from the autobuilderUnassignedNEW3.99normalMedium+
12239enable automated testing of non core layers with common usageUnassignedNEW3.99normalMedium+
12323automake does not support buildtest-TESTS in parallel modeUnassignedNEW3.99normalMedium+
12412WIC: rootfs wrong file ownership on rocko branchUnassignedIN PROGRESS DESIGN3.99normalMedium+
12688yocto-check-layer should allow PV changesUnassignedACCEPTED3.99normalMedium+
13097mips ifunc support appears brokenUnassignedNEW3.99normalMedium+
13407Enable PGO for python when reproducible builds are enabledUnassignedNEW3.99normalMedium+
13659PRServ should have a read-only port or endpointUnassignedNEW3.99normalMedium+
 37     
He Zhe
12137kernel_devsrc: occasional incorrect permissionsHe ZheIN PROGRESS DESIGN3.99normalMedium
13480gcc-cross plugins feature cannot be usedHe ZheNEW3.99normalMedium+
 2     

3.99 Enhancements by Owner

IDSummary (127 tasks) AssigneeStatusMilestoneSeverityP
 0     
akuster
10266Add ptest for gnutlsakusterNEW3.99enhancementMedium
 1     
Alejandro
10793Modify runqemu to run ELF imagesAlejandroNEW3.99enhancementMedium
 1     
Paul Eggleton
7792Layer compatible branches expansionPaul EggletonNEW3.99enhancementMedium
8133RRS should handle upstream repositories without version tagsPaul EggletonNEW3.99enhancementMedium
8400rrs: add the cause of an unknown recipe versionPaul EggletonNEW3.99enhancementMedium
8666Add bash completion to argparse-using scriptsPaul EggletonNEW3.99enhancementMedium
8943RRS: Add a function hook that would process upstream and recipe versionsPaul EggletonNEW3.99enhancementMedium
11406Add --dist-clean, --force, or some other flag to 'devtool reset' to clean all recipe cruftPaul EggletonNEW3.99enhancementMedium
11735RRS needs "Database updated on YYYY-MM-DD" infoPaul EggletonNEW3.99enhancementMedium
12252RRS should display downgrade information in Updates historyPaul EggletonIN PROGRESS REVIEW3.99enhancementMedium
13129Parallel Tinfoil API is desirablePaul EggletonNEW3.99enhancementMedium
6428Improve the ability to isolate changes that have caused a rebuildPaul EggletonIN PROGRESS DESIGN3.99enhancementMedium+
8325devtool modify could handle patch failure more usefullyPaul EggletonACCEPTED3.99enhancementMedium+
12560Add tests for layer index APIPaul EggletonNEW3.99enhancementMedium+
12599Show layer dependencies recursivelyPaul EggletonNEW3.99enhancementMedium+
13080devtool: handle user modifying local files next to recipePaul EggletonNEW3.99enhancementMedium+
 14     
Bruce Ashfield
4389kernel: Remove "make scripts" requirement for module building from SDK/on targetBruce AshfieldIN PROGRESS DESIGN COMPLETE3.99enhancementMedium
6308grub-efi deployed image should be netboot capable and have some debug helpBruce AshfieldACCEPTED3.99enhancementMedium
 2     
Changqing Li
13252Error report Web: enhance to support get all configuration in the local.confChangqing LiNEW3.99enhancementMedium+
13428pathtest-oe: test-pylint need enhancement for new filesChangqing LiIN PROGRESS REVIEW3.99enhancementMedium+
 2     
Chee Yang
11279wic: honor IMAGE_ROOTFS_EXTRA_SPACE et alChee YangNEW3.99enhancementMedium
12320Enable multiple kernels and multiple kernel command lines in systemd-boot, grub-efi menuChee YangNEW3.99enhancementMedium
12189wic cp should support recursive copiesChee YangNEW3.99enhancementMedium+
 3     
David Reyna
9630Show tasks currently running as part of progress bar updateDavid ReynaACCEPTED3.99enhancementMedium
9915Show all layer revisions supported by Toaster, not just the ones compatible with the projectDavid ReynaACCEPTED3.99enhancementMedium
11023Read IMAGE_FSTYPES from the image recipeDavid ReynaNEW3.99enhancementMedium
11364Provide a wizard-based project creation optionDavid ReynaNEW3.99enhancementMedium
12007support loading fixtures from other directoriesDavid ReynaNEW3.99enhancementMedium
12171After building an image, checking the packages there's nothing.David ReynaNEW3.99enhancementMedium
12207New Project needs a cancel button in case you change your mind.David ReynaACCEPTED3.99enhancementMedium
12432Make Bitbake Variables settings a textbox so you can inject larger sets of variablesDavid ReynaNEW3.99enhancementMedium
12433Allow toaster to store bitbake variables global to the toaster instance (not per build)David ReynaNEW3.99enhancementMedium
 9     
Dorinda
7684patchwork: provide email notificationsDorindaIN PROGRESS IMPLEMENTATION3.99enhancementMedium+
 1     
yeoh ee peng
11142Use artificial recipes for oe-selftest where possible to reduce workyeoh ee pengNEW3.99enhancementLow
6862input subsystem testingyeoh ee pengNEW3.99enhancementMedium+
11394Add tests to cover devtool handling of various git URL stylesyeoh ee pengNEW3.99enhancementMedium+
 3     
Diana Thayer
11195Enable easily changing maintainer email addressDiana ThayerNEW3.99enhancementMedium+
 1     
Gregor Zatko
13263Replace mkisofs with xorrisoGregor ZatkoIN PROGRESS IMPLEMENTATION3.99enhancementMedium
13270Rewrite docbook-xml recipeGregor ZatkoNEW3.99enhancementMedium
 2     
Hongxu Jia
9525Make install prompt available on all consolesHongxu JiaACCEPTED3.99enhancementMedium
 1     
Joshua Watt
12612insane.bbclass: check for bashisms in packaged scriptsJoshua WattUNCONFIRMED3.99enhancementMedium
12719Support reproducible build for kernel modules tarballJoshua WattNEW3.99enhancementMedium
 2     
Mark Morton
11630Convert dev-manual into pure task manual (how-to)Mark MortonIN PROGRESS IMPLEMENTATION3.99enhancementMedium+
 1     
Mazliana
12272Create new test cases for Kernel Development featuresMazlianaNEW3.99enhancementMedium+
 1     
Mingli Yu
10636Improved image testingMingli YuNEW3.99enhancementMedium
 1     
Chris Laplante
12018Help output should be groupedChris LaplanteIN PROGRESS IMPLEMENTATION3.99enhancementMedium
 1     
 
9700Add layer and bitbake information to error reports IN PROGRESS REVIEW3.99enhancementMedium
 1     
New Comer Bugs
11605bitbake documentation: "file-checksums" needs to be documentedNew Comer BugsNEW3.99enhancementMedium
 1     
Oleg Polyakov
5725Add QA check for installing Python EggsOleg PolyakovNEW3.99enhancementMedium
 1     
Paul Barker
13002Create a set of tests to run after upgrading patchtestPaul BarkerNEW3.99enhancementMedium+
13634patchtest should run maintainers test on new recipesPaul BarkerNEW3.99enhancementMedium+
 2     
Khem Raj
9417Bring clang/llvm compiler infrastructure to OE-CoreKhem RajACCEPTED3.99enhancementMedium
13940Cannot enable Go in GCCKhem RajNEW3.99enhancementMedium
 2     
Randy MacLeod
12675Integrate Rust?Randy MacLeodIN PROGRESS DESIGN3.99enhancementMedium
 1     
Richard Purdie
6420Detect and error when required packages are not producedRichard PurdieNEW3.99enhancementMedium
9738[PATCH] fetcher: allow git+<protocol>: syntaxRichard PurdieNEW3.99enhancementMedium
10429Add runtime dependencies for native "packages"Richard PurdieNEW3.99enhancementMedium
12328Move configuration to fragments in core layerRichard PurdieNEW3.99enhancementMedium
13354Change ptest output format to TAP?Richard PurdieNEW3.99enhancementMedium
11131Add more tests to Yocto Project Compatible Layers scriptRichard PurdieNEW3.99enhancementMedium+
11361oe-build-perf-test: monitor system resource utilizationRichard PurdieNEW3.99enhancementMedium+
11791Reduce the amount and storage space required of image artefacts published from buildsRichard PurdieNEW3.99enhancementMedium+
12282CheckYoctoCompat buildstep should support additional optionsRichard PurdieNEW3.99enhancementMedium+
12614Add include_all directiveRichard PurdieNEW3.99enhancementMedium+
 10     
Ross Burton (Arm)
8430Inaccurate 'du' usage in image.bbclass:get_rootfs_sizeRoss Burton (Arm)ACCEPTED3.99enhancementMedium
 1     
Sakib Sajal
9442Please add virtio console to qemux86-64.confSakib SajalIN PROGRESS DESIGN3.99enhancementMedium+
 1     
Tim Orling
10722devtool: be able to specify src_uri in upgradeTim OrlingIN PROGRESS IMPLEMENTATION3.99enhancementMedium
13648Create autobuilder-controller containerTim OrlingNEW3.99enhancementMedium
13649Create autobuilder-worker containerTim OrlingNEW3.99enhancementMedium
11816secure boot implementation using systemd-boot bootloaderTim OrlingNEW3.99enhancementMedium+
 4     
Trevor Woerner
11881add infrastructure to allow BSPs to switch between *set* of configurationsTrevor WoernerNEW3.99enhancementMedium
 1     
Unassigned
824Usability: Improve RRECOMMENDS warning messages for -dbg packagesUnassignedNEW3.99enhancementLow
7982Have an option to exclude some packages from the SDK generationUnassignedNEW3.99enhancementLow
2082Additional test case: shared sstate-cache between usersUnassignedNEW3.99enhancementMedium
6541Error Reporting Tool: Enhancements to searchUnassignedNEW3.99enhancementMedium
6803Sanity check for non-largefile useUnassignedNEW3.99enhancementMedium
8100Clear taint when recipe rebuildsUnassignedNEW3.99enhancementMedium
8650RRS: track ptest-enabled and potentially ptest-enabled statusUnassignedNEW3.99enhancementMedium
8732Branch Support for BuildhistoryUnassignedNEW3.99enhancementMedium
8745Add support for version constraint to DEPENDSUnassignedNEW3.99enhancementMedium
8909Mention standard fetcher options also in fetcher seaction (not only in SRC_URI in the glossary)UnassignedIN PROGRESS DESIGN3.99enhancementMedium
9753Document automatic layer priority calculationUnassignedACCEPTED3.99enhancementMedium
10133uninative tarball should contain layer manifestUnassignedACCEPTED3.99enhancementMedium
10193bitbake: improve --dump-signatures=SIGNATURE_HANDLERUnassignedNEW3.99enhancementMedium
10322better way to grab layers and get them automatically batched by generating a bash script on the fly to do the tedious partsUnassignedNEW3.99enhancementMedium
10414devtool: deploy-target: support deploying kernelUnassignedNEW3.99enhancementMedium
10417devtool: modify: look at optimising kernel rebuildsUnassignedNEW3.99enhancementMedium
10418devtool: look at devshell integrationUnassignedNEW3.99enhancementMedium
10454support the multiple containers working off 1 volume modelUnassignedNEW3.99enhancementMedium
10528Add VNC support for cli containers for QEMUUnassignedIN PROGRESS REVIEW3.99enhancementMedium
10544use CDT core build to enable building for CMake projectUnassignedNEW3.99enhancementMedium
10683perl packages should be allarch in many casesUnassignedNEW3.99enhancementMedium
10865bitbake-prserv needs a --status flagUnassignedNEW3.99enhancementMedium
10957wic: support generating raw flash imagesUnassignedIN PROGRESS DESIGN3.99enhancementMedium
11287devtool: upgrade: check for additional license filesUnassignedNEW3.99enhancementMedium
11308Consider replacing pkg-config with pkgconfUnassignedNEW3.99enhancementMedium
11629document in tips and tricks how to bring up a de10-nano altera HPS with Yocto PokyUnassignedNEW3.99enhancementMedium
11716Add recipe metadata to rpmsUnassignedNEW3.99enhancementMedium
11890Allow installation of pure Python modules without building python3-nativeUnassignedNEW3.99enhancementMedium
11892Missing workflow for identifying taskhash errorsUnassignedNEW3.99enhancementMedium
11908include more info when signatures do not match on the SstateTest unit testsUnassignedNEW3.99enhancementMedium
12086Create an autobuilder script to test for long path errorsUnassignedNEW3.99enhancementMedium
12168media player - must be warned that it is not possible to play MPEG-1 and MP3 formatsUnassignedNEW3.99enhancementMedium
12313recipetool needs a place to put dummy recipes / bbappendsUnassignedNEW3.99enhancementMedium
12484Allow triggering updates from the web interfaceUnassignedIN PROGRESS DESIGN3.99enhancementMedium
12697oe-build-perf-report: support annotations for chartsUnassignedNEW3.99enhancementMedium
12922Remove layerbranch automatically when conf/layer.conf is gone ?UnassignedNEW3.99enhancementMedium
13156linux-fimware recipe is an abominationUnassignedNEW3.99enhancementMedium
13205Bitbake should warn about whitespace misuse in variable assignmentsUnassignedNEW3.99enhancementMedium
13206Bitbake needs a lint-like toolUnassignedNEW3.99enhancementMedium
13321Integrate fossology copyright scanning into an OE buildUnassignedNEW3.99enhancementMedium
13322Integrate fossology or scancode license scanning into an OE buildUnassignedNEW3.99enhancementMedium
13343Make INHIBIT_PACKAGE_STRIP_FILES support wildcardUnassignedNEW3.99enhancementMedium
13552Cannot build manuals without internet connectivityUnassignedNEW3.99enhancementMedium
4304Do automated upgrade path testingUnassignedNEW3.99enhancementMedium+
7683Provide means of turning a recipe change into a bbappendUnassignedNEW3.99enhancementMedium+
9858Make xattrs in images work [meta]UnassignedNEW3.99enhancementMedium+
10684Distributed build supportUnassignedNEW3.99enhancementMedium+
10715Patchwork should change status when patches are pushed into mut (master under test) and again when they goto masterUnassignedIN PROGRESS IMPLEMENTATION3.99enhancementMedium+
10974Tests for Build Appliance need to be automatedUnassignedNEW3.99enhancementMedium+
11360oe-build-perf-report: show multiple data sets per chartUnassignedNEW3.99enhancementMedium+
11528Enable simple toolchain switchingUnassignedNEW3.99enhancementMedium+
11783Should be able to define Target Proxy settings and have them appear in imagesUnassignedNEW3.99enhancementMedium+
12141Pseudo: Annotate error messagesUnassignedNEW3.99enhancementMedium+
13330add resulttool report option for graphical outputUnassignedNEW3.99enhancementMedium+
13846run piglit testsUnassignedNEW3.99enhancementMedium+
 55     
Yang Wang
12635add performance test using phoronix test suiteYang WangNEW3.99enhancementMedium+
 1     

Future Milestones by Owner !Unassinged

IDSummary (90 tasks) AssigneeStatusMilestoneSeverityP
 0     
Aaron Chan
9917autobuilder: Add ability to get worker informationAaron ChanIN PROGRESS REVIEWFutureenhancementMedium
10034oe-selftest: Field to select a subset of tests in the autobuildersAaron ChanNEWFutureenhancementMedium
 2     
Akhila
10699Ensure consistency in repository URLsAkhilaNEWFutureenhancementMedium
 1     
akuster
6707Add ptest for curlakusterIN PROGRESS REVIEWFutureenhancementMedium
 1     
Alejandro
5421Support multiple MACHINE installs per SDKAlejandroACCEPTEDFutureenhancementMedium
 1     
Apoorv
9070Add test that locales are workingApoorvACCEPTEDFutureenhancementMedium+
 1     
Paul Eggleton
5574Add kernel configuration check mechanismPaul EggletonIN PROGRESS DESIGNFutureenhancementLow
5883Add ability to specify locale base directoryPaul EggletonIN PROGRESS IMPLEMENTATIONFutureenhancementLow
6478Tweaks to remove cruft from non-rootfs imagesPaul EggletonNEWFutureenhancementLow
6661devtool: add ability to submit changes for reviewPaul EggletonNEWFutureenhancementMedium
6839Handle dev package with no main package more gracefullyPaul EggletonNEWFutureenhancementLow
7588devtool: improve devtool build outputPaul EggletonIN PROGRESS DESIGNFutureenhancementMedium
7637devtool: add: interactive recipe creationPaul EggletonNEWFutureenhancementMedium
8222Elide dependency from -dev package on main package if there are no shared libraries in itPaul EggletonNEWFutureenhancementLow
9760Make it easier to set up your own derivative layer indexPaul EggletonIN PROGRESS IMPLEMENTATIONFutureenhancementMedium
11196Opt-in email notifications on parse errorsPaul EggletonNEWFutureenhancementMedium
11670Improve terminology around BBCLASSEXTENDPaul EggletonNEWFutureenhancementLow
12154esdk/devtool cannot build both native and target componentsPaul EggletonNEWFuturenormalLow
13489layer index: properly handle issues in first parsePaul EggletonNEWFuturenormalMedium
13490layer index: log failures during initial parsePaul EggletonNEWFuturenormalMedium
13933Devtool does not work with multiconfigPaul EggletonNEWFutureenhancementMedium+
 15     
Bruce Ashfield
1924[LTP] 'vma01' case failed on non-x86 platforms with Yocto 1.2 M2 rc1Bruce AshfieldACCEPTEDFuturenormalMedium
2267Integrate DISTRO_FEATURES with KERNEL_FEATURESBruce AshfieldIN PROGRESS DESIGN COMPLETEFutureenhancementMedium
2348Cleanup package.bbclass - runstrip and split_and_strip_files checksBruce AshfieldACCEPTEDFutureenhancementLow
3999provide description and compatibility data with kern-features.rcBruce AshfieldIN PROGRESS DESIGNFutureenhancementMedium
6022kernel-dev: How do I know which features are available for KERNEL_FEATURES ?Bruce AshfieldIN PROGRESS DESIGN COMPLETEFutureenhancementMedium
9480linux-yocto: make it work with arm big endianBruce AshfieldACCEPTEDFutureenhancementMedium
13931evaluate simplification of headers_install requirementsBruce AshfieldACCEPTEDFutureenhancementMedium
 7     
David Reyna
3362Improve dependency analysis toolsDavid ReynaNEWFutureenhancementMedium
7355Strange outcome in Toaster 'covered' tasks queriesDavid ReynaNEWFuturenormalLow
13095Use Django ORM instead of sqlite directlyDavid ReynaNEWFuturenormalLow
13096Port scripts to be management commands?David ReynaNEWFuturenormalLow
 4     
Dorinda
9451Document a cookbook procedure on how to change kernel versionDorindaIN PROGRESS REVIEWFuturenormalLow
11053insane.bbclass: Verify shebang line length validDorindaNEWFutureenhancementMedium
 2     
Georgi
13801offline build fails when character '&' is present in SRC_URI for svnGeorgiNEWFuturenormalMedium+
 1     
Gregor Zatko
5426Detect and fail if inherit is used in conf fileGregor ZatkoNEWFutureenhancementLow
 1     
Kai Kang
7610[Multilib] Can't install 64bit packages to 32bit rootfsKai KangNEWFutureenhancementMedium
8592DNF: make it can understand MLPREFIXKai KangNEWFutureenhancementMedium
 2     
Christopher Larson
6372Feature request: recipe hook for source tree preparationChristopher LarsonNEWFutureenhancementMedium
 1     
Kevin Hao
1795Simplify core-image-minimal-initramfs and reduce dependenciesKevin HaoACCEPTEDFutureenhancementLow
2549[USE CASE] Support live images on emulated targets (hddimg for kvm)Kevin HaoNEWFutureenhancementLow
6044EFI_PROVIDER recipes deploy collisionsKevin HaoACCEPTEDFuturenormalMedium
 3     
Robert Yang
13746Unable to create RPM package from repo that contains filenames with "[" and "]" charactersRobert YangIN PROGRESS DESIGNFuturenormalMedium+
 1     
Mark Hatle
1331Prelink: doesn't work on ppc64Mark HatleNEWFuturenormalMedium
1598Add remote layer supportMark HatleNEWFutureenhancementLow
8664Investigate if -mtls-dialect=gnu2 support within the prelinker behaviorMark HatleNEWFutureminorLow
10168On-target binutils produces non-running code when linking with "-Wl,-z,nocopyreloc" on ARM or PPCMark HatleNEWFuturenormalMedium
 4     
Mingde (Matthew) Zeng
10725Add test for BBPOSTCONF and BBPRECONF on bitbakeMingde (Matthew) ZengNEWFutureenhancementMedium
 1     
Michael Halstead
7080Allow bugs to target multiple milestonesMichael HalsteadIN PROGRESS IMPLEMENTATIONFutureenhancementMedium
7087Add another chart to the WikiMichael HalsteadACCEPTEDFutureenhancementLow
7327Add git hook to update bug statusMichael HalsteadNEWFutureenhancementMedium
9677Update bugzilla instance to 5.X or greaterMichael HalsteadIN PROGRESS DESIGNFutureenhancementMedium
 4     
Nicolas Dechesne
3950Please add a reference to SMC Licensing Compliance presentation on YP's capabilitiesNicolas DechesneACCEPTEDFuturenormalMedium
 1     
Ola Nilsson
12212Path for modprobe.d and modconf.d should be set through variables.Ola NilssonNEWFutureenhancementMedium
 1     
Oleksandr Kravchuk
6434Add option to package .py/.pyc/both in Python packagesOleksandr KravchukNEWFutureenhancementMedium
 1     
Otavio Salvador
10304QEMU doesnot support e6500 emulation for gobject-introspectionOtavio SalvadorNEWFuturemajorMedium
 1     
Randy MacLeod
4183Reference material for how a user creates a build that meets GPL obligations given a reference BSP, standard rootfs/kernel...etc.Randy MacLeodACCEPTEDFutureenhancementMedium
14062Should we support native builds and ptest for all/most packagesRandy MacLeodNEWFutureenhancementLow
 2     
Richard Tollerton
8323fetch2/hg mirror tarballs are kinda brokenRichard TollertonNEWFuturenormalMedium
 1     
Richard Purdie
2872Implement gitpkgv functionality in fetcherRichard PurdieNEWFutureenhancementLow
3433Create Interactive bitbake commandline modeRichard PurdieNEWFutureenhancementMedium
3443git fetcher: support a more appendable syntax for supporting multiple branches in the SRC_URIRichard PurdieNEWFutureenhancementLow
4143Support real-time logging when using bitbake interactivelyRichard PurdieNEWFutureenhancementMedium
4836Make update-alternatives mechanism in OE/Yocto more robustRichard PurdieNEWFutureenhancementMedium
5709Add possibility to control event handlers orderRichard PurdieNEWFutureenhancementMedium
5799add standardized MAINTAINERS infrastructureRichard PurdieNEWFutureenhancementLow
5839Add automated tests for hard dependencies and setscene tasks.Richard PurdieNEWFutureenhancementMedium
6059Add mechanism to define how class should be usedRichard PurdieNEWFutureenhancementLow
6149Setting PREFERRED_PROVIDER to select between multiple runtime providers does not workRichard PurdieNEWFuturenormalLow
6370QA/oe-selftest: add test suite for recipe testingRichard PurdieNEWFutureenhancementMedium
7802Insufficient info provided when a recipe fails.Richard PurdieNEWFutureenhancementMedium
7985Variable typing support within BitBakeRichard PurdieNEWFutureenhancementMedium
9643Add a means of showing which variables triggered confighash changeRichard PurdieNEWFutureenhancementMedium
9825allow alternates with full protocol specs for improving bitbake git functionalityRichard PurdieNEWFutureenhancementMedium
9993uninative loader: no error on checksum failure for file:// urlsRichard PurdieNEWFuturenormalMedium
10203prefer specialized image creation methods over chainingRichard PurdieNEWFutureenhancementLow
11973BB_SERVER_TIMEOUT causes testsdkext failuresRichard PurdieNEWFuturenormalMedium
12179per-recipe hosttoolsRichard PurdieNEWFutureenhancementMedium
12634Implement new bitbake shell functionalityRichard PurdieNEWFutureenhancementMedium
12971expose poky package metadataRichard PurdieNEWFutureenhancementLow
 21     
Ross Burton (Arm)
9213Add an autobuilder run using ARM/Thumb.Ross Burton (Arm)NEWFuturenormalMedium
13120mandb fails in qemumips64-userRoss Burton (Arm)NEWFuturenormalMedium
 2     
Robert P. J. Day
12408Update wic documentation to remove outdated "help" referencesRobert P. J. DayIN PROGRESS IMPLEMENTATIONFuturenormalMedium+
 1     
Seebs
4063pseudo's logging and diagnostics are not very clearSeebsIN PROGRESS DESIGNFutureenhancementMedium
 1     
Tim Orling
7037Support for perl in "recipetool create"Tim OrlingIN PROGRESS IMPLEMENTATIONFutureenhancementMedium
7636recipetool: basic spec file conversionTim OrlingNEWFutureenhancementMedium
10422devtool: reusing sources/patches from Fedora public repos requires changes to rpm & luaTim OrlingIN PROGRESS IMPLEMENTATIONFutureenhancementLow
 3     
Toaster default assignee
7240Add declaration of image output file globs for ToasterToaster default assigneeNEWFutureenhancementMedium
 1     
Trevor Gamblin
8621EXPORT_FUNCTIONS on fakeroot task function doesn't actually end up as a fakeroot taskTrevor GamblinNEWFutureminorLow
 1     
Zoltan Kuscsik
6150SVN fetching trusts certificates by defaultZoltan KuscsikNEWFuturenormalLow
 1     

Unassigned or Newcomer Bugs

IDSummary (356 tasks) SeverityPMilestoneAssigneeStatusWhiteboardE
14209Intermittent core-image-sato-1.0-r0 do_testimage fails with: systemd-journald.service: Failed with result 'watchdog'normalMedium3.1.7UnassignedNEWAB-INT
14346test_rpm_query_nonroot fails to delete usernormalMedium3.1.7UnassignedNEWAB-INT
14189Intermittent oe-selftest-debian fails with do_rootfs: No manifest generated from: mdadmnormalMedium+3.1.7UnassignedNEWAB-INT
8161Can't use "\" characters in SRC_URI entries - not even escapednormalMedium3.3UnassignedNEW2
8612Add a locked sigs mode allowing locked task to rerunenhancementMedium3.3UnassignedNEW3
9061git fetcher inconsistency for working with PREMIRRORS.normalMedium3.3UnassignedNEW5
11704Add other resource monitoring options to conf/local.conf STOPTASKS/ABORTenhancementMedium3.3UnassignedNEW3
12107useradd-staticids: groupadd: GID already existsnormalMedium3.3UnassignedNEWBackport 2.4.21
13510reproducible QA: Fake host name for better reproducibiltyenhancementMedium3.3UnassignedNEW
13511reproducible QA: Fake user for better reproducibiltyenhancementMedium3.3UnassignedNEW
13518reproducible QA: Test sstate files for reproduciblityenhancementMedium3.3UnassignedNEW
13521reproducible QA: Test other architecturesenhancementMedium3.3UnassignedNEW
13665gitsm fetcher and PREMIRROR does not use git to clone repositoriesnormalMedium3.3UnassignedNEW
13706dnf parslogs failure (mips/systemd)normalMedium3.3UnassignedNEWautobuilder
13858piglit build racenormalMedium3.3UnassignedNEW
13863icecc no longer works with kernel recipesnormalMedium3.3UnassignedNEWbackport 3.1
13864archiver class incompatible with dos2unix classnormalMedium3.3UnassignedNEW
13995\ without a newline passes the parsernormalMedium3.3UnassignedNEW
14140variable flags starting with underscore are silently ignorednormalMedium3.3New Comer BugsNEW
14145pylibmount PACKAGECONFIG in util-linux causes circular dependencynormalMedium3.3UnassignedNEW
14176Random do_ar_patched failure due to race condition with do_configure autoconfmajorMedium3.3UnassignedNEW
14195ERROR: Task (virtual:native:/home/student/resy_sdk/layers/poky-training/meta/recipes-devtools/pseudo/pseudo_git.bb:do_fetch) failed with exit code 'setscene whitelist'normalMedium3.3UnassignedNEW
14232recipe checksum bypass bugnormalMedium3.3New Comer BugsNEWNEWCOMER
13509reproducible QA: Fake time in the future for better reproducibilitynormalMedium3.3 M4UnassignedNEW
13425Add bblock and bbunlock helper toolsnormalMedium+3.3 M4New Comer BugsNEW
14126resolvconf incompatible with busybox flocknormalMedium+3.3 M4New Comer BugsNEWbackport to 3.2, 3.1 NEWCOMER
12982Add booting an NFS root file system for testimageenhancementMedium3.4 M1UnassignedACCEPTED
14029qemuarm image failed ping testnormalMedium3.4 M1UnassignedNEWAB-INT
5389bitbake/lib/bb/fetch2: filename too longnormalMedium+3.4 M1UnassignedIN PROGRESS IMPLEMENTATION4
5876Add a test for the kernel -c menuconfig optionenhancementMedium+3.4 M1UnassignedACCEPTED3
10061Ctrl+C during BB_HASHCHECK_FUNCTION execution does not interrupt processing nicelyminorMedium+3.4 M1UnassignedNEW3
10731bitbake --observe-only doesn't work with memresnormalMedium+3.4 M1UnassignedNEW5
11781bitbake --observe-only may get KeyErrornormalMedium+3.4 M1UnassignedIN PROGRESS REVIEW3
11899broken 'bitbake --status-only' and 'bitbake -m'normalMedium+3.4 M1UnassignedNEW2
12023"bitbake-layers show-layers" doesn't show layer if it doesn't append itself to BBFILE_COLLECTIONSminorMedium+3.4 M1UnassignedNEW1
12290cross recipe kernel module dependency generation stopped workingnormalMedium+3.4 M1UnassignedACCEPTEDBackport 2
12367moving or removing tmp breaks persistent bitbake servernormalMedium+3.4 M1UnassignedNEW
12374do_rootfs failed when len(TMPDIR) == 410normalMedium+3.4 M1UnassignedNEW2
12760CMake Toolchain File Has Wrong Module PathnormalMedium+3.4 M1UnassignedIN PROGRESS REVIEW1
12963nativesdk-opkg prefixes all internal paths with $SDKPATH and won't worknormalMedium+3.4 M1UnassignedNEW3
13004Automate yocto-check-layer -m optionenhancementMedium+3.4 M1UnassignedNEW
13023Switch to memory resident bitbake by default in 3.3enhancementMedium+3.4 M1UnassignedNEW
13039fetch2: PREMIRROR and SRC_URI with type https and parameter downloadfilename yields invalid urlnormalMedium+3.4 M1UnassignedNEW
13181persist_data sqlite database mixed with forking is irreparably brokennormalMedium+3.4 M1UnassignedNEW
13233fetch2: try_premirror(): improve on updating repo from mirrorenhancementMedium+3.4 M1UnassignedNEW3
13236sstate for host native packagesnormalMedium+3.4 M1UnassignedNEW
13279Make sure users/groups exist for package_write_* tasksnormalMedium+3.4 M1UnassignedNEW
13285YoctoProject Compatibility script improvements needednormalMedium+3.4 M1UnassignedNEW
13338SDK build fails if image contains bashnormalMedium+3.4 M1UnassignedNEWbackports
13353bitbake git fetcher does not honour BB_FETCH_PREMIRRORONLYnormalMedium+3.4 M1UnassignedNEW
13419recipes that add users to groups cannot rely on other recipes creating those groups (when population from sstate happens)normalMedium+3.4 M1UnassignedNEW
13463test linux-yocto-rt kernels toonormalMedium+3.4 M1UnassignedACCEPTED
13612meta-skeleton fails yocto-check-layernormalMedium+3.4 M1UnassignedNEW
13631core-image-full-cmdline qemumips systemd boot failurenormalMedium+3.4 M1UnassignedNEW
13705master] bitbake and hashserve.sock left behind when ^C a buildnormalMedium+3.4 M1UnassignedNEW
13843bitbake worker stuck using 100% cpu on aborted buildnormalMedium+3.4 M1UnassignedNEW
13868Python cache files get lost in packagesnormalMedium+3.4 M1UnassignedNEW
13897POSTINST_INTERCEPTS_DIR broken by undocumented POSTINST_INTERCEPTS_PATHS since thudnormalMedium+3.4 M1UnassignedNEWBackport
13910Intermittent host UID contamination highlighted by devtool testsnormalMedium+3.4 M1UnassignedNEW
13920uninative tarball license compliance in ESDKnormalMedium+3.4 M1UnassignedNEW
13976gdb8.3 do compile with musl is errornormalMedium+3.4 M1UnassignedNEW
14015URL Arguments in MIRROR/PREMIRROR get encodednormalMedium+3.4 M1UnassignedNEW
14023oe-selftest doesn't work with BB_SERVER_TIMEOUT=60normalMedium+3.4 M1UnassignedNEW
14028Autobuilder buildtools run fails with "Qemu ended unexpectedly"normalMedium+3.4 M1UnassignedNEWAB-INT
14045git fetcher deadlock with self-referencing sub-modulesenhancementMedium+3.4 M1UnassignedNEW
14066bitbake core-image-base -c populate_sdk fails when image contains bash, core-utils and package_deb is usednormalMedium+3.4 M1UnassignedNEW
14081Not possible to get src package in image when using PACKAGE_DEBUG_SPLIT_STYLE='debug-file-directory'enhancementMedium+3.4 M1UnassignedNEWBackport
14096perl install race (pod2text)normalMedium+3.4 M1UnassignedNEWAB-INT
141043.1.2 (not an option above) devtool finish does not copy recipe in layerenhancementMedium+3.4 M1UnassignedNEW
14128qemuppc failed to shutdownnormalMedium+3.4 M1UnassignedNEWAB-INT
14150devtool: modify: fails for gstreamer1.0-plugins-goodnormalMedium+3.4 M1UnassignedNEW
14151devtool build fails for python3normalMedium+3.4 M1UnassignedNEW
14154yocto-check-layer fails incorrectly with kernel hash changesnormalMedium+3.4 M1UnassignedNEW
14155yocto-check-layer fails with hash changes if license addednormalMedium+3.4 M1UnassignedNEW
14196Add integration to send data to KCIDBenhancementMedium+3.4 M1UnassignedNEW
14201Bitbake server intermittent timeoutnormalMedium+3.4 M1UnassignedNEWAB-INT
14206oe-selftest perl errors on rpm based distrosnormalMedium+3.4 M1UnassignedNEW
14218Recipe rebuilds can contaminate buildsnormalMedium+3.4 M1UnassignedNEW
14244util-linux script:_size ptest failurenormalMedium+3.4 M1UnassignedNEWAB-INT
14246devtool test failures: github tls timeoutnormalMedium+3.4 M1UnassignedNEWAB-INT
14251core-image-sato-1.0-r0:do_testimage FAILED when starting qemunormalMedium+3.4 M1UnassignedNEWAB-INT AB-INT-TMPFS
14257gstreamer1.0 ptest intermittent failurenormalMedium+3.4 M1UnassignedNEWAB-INT
14259NFS mounting issue on qemux64 oe-selftest glibc.GlibcSelfTestSystemEmulated.test_glibcnormalMedium+3.4 M1UnassignedNEWAB-INT
14262runcmd.RunCmdTests.test_stdin_timeout times outnormalMedium+3.4 M1UnassignedNEWAB-INT
14263lttng-tools ptest intermittent failurenormalMedium+3.4 M1UnassignedNEWAB-INT
14268ruby-ri-docs is not reproduciblenormalMedium+3.4 M1UnassignedNEW
14270go packages are not reproduciblenormalMedium+3.4 M1UnassignedNEW
14272qemumips64 testimage systemd didnt reach login promptnormalMedium+3.4 M1UnassignedNEWAB-INT
14273qemu CPU starvation triggers rcu_preempt stall detectionnormalMedium+3.4 M1UnassignedNEWAB-INT
14274dnf parselogs failed on qemux86-64 due to networking errornormalMedium+3.4 M1UnassignedNEW
14275qemuarm64 parselogs fail due to udev taking to much timenormalMedium+3.4 M1UnassignedNEWAB-INT
14289failure in the command 'bitbake glibc-testsuite -c check'normalMedium+3.4 M1UnassignedNEWAB-INT
14299failure in the command 'bitbake gcc-runtime -c check'normalMedium+3.4 M1UnassignedNEWAB-INT
14300libtool-cross parallelism build failurenormalMedium+3.4 M1UnassignedNEWAB-INT
14303Result of build is not stored in testresult.json with resulttoolenhancementMedium+3.4 M1UnassignedNEW
14341BitbakePrTests.test_stopping_prservice_message failsnormalMedium+3.4 M1UnassignedNEWAB-INT
14236npmsw does not support github URLs in the npm-shrinkwrap.json fileenhancementMedium+3.4 M2UnassignedNEW
824Usability: Improve RRECOMMENDS warning messages for -dbg packagesenhancementLow3.99UnassignedNEW
7982Have an option to exclude some packages from the SDK generationenhancementLow3.99UnassignedNEW1
2082Additional test case: shared sstate-cache between usersenhancementMedium3.99UnassignedNEW 2
6541Error Reporting Tool: Enhancements to searchenhancementMedium3.99UnassignedNEWGUI design pending
6803Sanity check for non-largefile useenhancementMedium3.99UnassignedNEWnewcomer2
8015Debug source splitting breaks when externalsrc is enablednormalMedium3.99UnassignedACCEPTED5
8100Clear taint when recipe rebuildsenhancementMedium3.99UnassignedNEW
8582Error message not in log filenormalMedium3.99UnassignedNEW2
8650RRS: track ptest-enabled and potentially ptest-enabled statusenhancementMedium3.99UnassignedNEWGUI design available3
8688busybox syslog not update-alternatives awarenormalMedium3.99UnassignedNEW2
8732Branch Support for BuildhistoryenhancementMedium3.99UnassignedNEW2
8745Add support for version constraint to DEPENDSenhancementMedium3.99UnassignedNEW5
8909Mention standard fetcher options also in fetcher seaction (not only in SRC_URI in the glossary)enhancementMedium3.99UnassignedIN PROGRESS DESIGN11 May 2017: IN PROGRESS DESIGN2
9069perf: missing python modules for scripts in 'perf report'normalMedium3.99UnassignedIN PROGRESS REVIEW4
9171Consider limiting the scope of depchains to runtime depsnormalMedium3.99UnassignedNEW5
9279Issue with PREFERRED_PROVIDER interaction with overridesnormalMedium3.99UnassignedNEW1
9424systemd tmpfiles.d warnings (volatile, resolv.conf)minorMedium3.99UnassignedNEW1
9753Document automatic layer priority calculationenhancementMedium3.99UnassignedACCEPTED1
9982Move patches directory to WORKDIR/patches from S/patchesnormalMedium3.99UnassignedNEW3
10133uninative tarball should contain layer manifestenhancementMedium3.99UnassignedACCEPTED2
10193bitbake: improve --dump-signatures=SIGNATURE_HANDLERenhancementMedium3.99UnassignedNEW5
10194bitbake-whatchanged is brokennormalMedium3.99UnassignedNEW 5
10322better way to grab layers and get them automatically batched by generating a bash script on the fly to do the tedious partsenhancementMedium3.99UnassignedNEW2
10414devtool: deploy-target: support deploying kernelenhancementMedium3.99UnassignedNEW4
10417devtool: modify: look at optimising kernel rebuildsenhancementMedium3.99UnassignedNEW3
10418devtool: look at devshell integrationenhancementMedium3.99UnassignedNEW2
10454support the multiple containers working off 1 volume modelenhancementMedium3.99UnassignedNEW4
10528Add VNC support for cli containers for QEMUenhancementMedium3.99UnassignedIN PROGRESS REVIEW4
10544use CDT core build to enable building for CMake projectenhancementMedium3.99UnassignedNEW2
10683perl packages should be allarch in many casesenhancementMedium3.99UnassignedNEW2
10865bitbake-prserv needs a --status flagenhancementMedium3.99UnassignedNEW1
10957wic: support generating raw flash imagesenhancementMedium3.99UnassignedIN PROGRESS DESIGN5
11199Fetch.checkstatus() should work on git URIsnormalMedium3.99UnassignedNEW3
11287devtool: upgrade: check for additional license filesenhancementMedium3.99UnassignedNEW3
11308Consider replacing pkg-config with pkgconfenhancementMedium3.99UnassignedNEW8
11605bitbake documentation: "file-checksums" needs to be documentedenhancementMedium3.99New Comer BugsNEW1
11623Can't generate eSDK when using a locked-sigs.incnormalMedium3.99UnassignedNEW1
11629document in tips and tricks how to bring up a de10-nano altera HPS with Yocto PokyenhancementMedium3.99UnassignedNEW3
11706oe-setup-rpmrepo no longer works with RSSnormalMedium3.99UnassignedIN PROGRESS DESIGN 0.3
11716Add recipe metadata to rpmsenhancementMedium3.99UnassignedNEW5
11801rpmbuild fails randomly when try to build a spec filenormalMedium3.99UnassignedNEW3
11890Allow installation of pure Python modules without building python3-nativeenhancementMedium3.99UnassignedNEW5
11892Missing workflow for identifying taskhash errorsenhancementMedium3.99UnassignedNEW1
11908include more info when signatures do not match on the SstateTest unit testsenhancementMedium3.99UnassignedNEW1
12068[psplash] wrong support of 800 x 480 imagesminorMedium3.99UnassignedNEW1
12086Create an autobuilder script to test for long path errorsenhancementMedium3.99UnassignedNEW3
12153in an esdk, devtool fails to build ovmfnormalMedium3.99UnassignedACCEPTED 5
12168media player - must be warned that it is not possible to play MPEG-1 and MP3 formatsenhancementMedium3.99UnassignedNEW2
12172devtool build linux-yocto fails to deploy bzImage into tmp/deploy/images/<arch>/bzImagenormalMedium3.99UnassignedNEW 5
12284LIC_FILES_CHKSUM test-case throws false-positives on production machine onlynormalMedium3.99UnassignedNEW5
12313recipetool needs a place to put dummy recipes / bbappendsenhancementMedium3.99UnassignedNEW 5
12389oe-selftest devtool tests fails when repository comes from a tarballnormalMedium3.99New Comer BugsNEW
12484Allow triggering updates from the web interfaceenhancementMedium3.99UnassignedIN PROGRESS DESIGN
12556devtool is passing -C to git and this is throwing errorsnormalMedium3.99UnassignedNEW
12636patchtest is failing to understand the rename patchnormalMedium3.99UnassignedIN PROGRESS REVIEW
12697oe-build-perf-report: support annotations for chartsenhancementMedium3.99UnassignedNEW
12922Remove layerbranch automatically when conf/layer.conf is gone ?enhancementMedium3.99UnassignedNEW
13017PnP target QAnormalMedium3.99UnassignedNEW
13156linux-fimware recipe is an abominationenhancementMedium3.99UnassignedNEW
13205Bitbake should warn about whitespace misuse in variable assignmentsenhancementMedium3.99UnassignedNEW
13206Bitbake needs a lint-like toolenhancementMedium3.99UnassignedNEW
13321Integrate fossology copyright scanning into an OE buildenhancementMedium3.99UnassignedNEW
13322Integrate fossology or scancode license scanning into an OE buildenhancementMedium3.99UnassignedNEW
13343Make INHIBIT_PACKAGE_STRIP_FILES support wildcardenhancementMedium3.99UnassignedNEW2
13552Cannot build manuals without internet connectivityenhancementMedium3.99UnassignedNEW
13875Include YP docs in SDKnormalMedium3.99UnassignedNEW
4304Do automated upgrade path testingenhancementMedium+3.99UnassignedNEW 4
7683Provide means of turning a recipe change into a bbappendenhancementMedium+3.99UnassignedNEW4
9104ffmpeg libraries are missing -dbg packagingnormalMedium+3.99UnassignedNEW5
9858Make xattrs in images work [meta]enhancementMedium+3.99UnassignedNEW5
10165Check for and explain if UTF-8 is missingnormalMedium+3.99UnassignedNEW1
10597license_create_manifest fails when linux-dummy is used to create own kernelnormalMedium+3.99UnassignedNEW2
10629package brought in by runtime dependency of a complementary package does not have its own complementary package installednormalMedium+3.99UnassignedNEW5
10684Distributed build supportenhancementMedium+3.99UnassignedNEW15
10715Patchwork should change status when patches are pushed into mut (master under test) and again when they goto masterenhancementMedium+3.99UnassignedIN PROGRESS IMPLEMENTATION2
10716Patchwork: track older release branchesnormalMedium+3.99UnassignedACCEPTED2
10974Tests for Build Appliance need to be automatedenhancementMedium+3.99UnassignedNEW3
11138Extensible SDK: recipe-specific sysroots broke user additions to the SDK's shared sysrootnormalMedium+3.99UnassignedNEW2
11360oe-build-perf-report: show multiple data sets per chartenhancementMedium+3.99UnassignedNEW 5
11528Enable simple toolchain switchingenhancementMedium+3.99UnassignedNEW5
11783Should be able to define Target Proxy settings and have them appear in imagesenhancementMedium+3.99UnassignedNEW5
11904Bad line continuation in bblayers.conf causes ugly server messagenormalMedium+3.99UnassignedNEW0.5
11933oe-selftest: unset SANITY_TESTED_DISTROS automatically when oe-selftest is launchednormalMedium+3.99UnassignedNEW3
11963QA: Create automated testing to cover ESDK artifacts downloaded from the autobuildernormalMedium+3.99UnassignedNEW3
12141Pseudo: Annotate error messagesenhancementMedium+3.99UnassignedNEW
12239enable automated testing of non core layers with common usagenormalMedium+3.99UnassignedNEW2
12323automake does not support buildtest-TESTS in parallel modenormalMedium+3.99UnassignedNEW3
12412WIC: rootfs wrong file ownership on rocko branchnormalMedium+3.99UnassignedIN PROGRESS DESIGN
12688yocto-check-layer should allow PV changesnormalMedium+3.99UnassignedACCEPTED
13097mips ifunc support appears brokennormalMedium+3.99UnassignedNEW
13330add resulttool report option for graphical outputenhancementMedium+3.99UnassignedNEW
13407Enable PGO for python when reproducible builds are enablednormalMedium+3.99UnassignedNEW
13659PRServ should have a read-only port or endpointnormalMedium+3.99UnassignedNEW
13846run piglit testsenhancementMedium+3.99UnassignedNEW
1467Sync class header comments with reference manualenhancementLowFutureUnassignedNEW 1
1658depexp like features without XenhancementLowFutureUnassignedNEW
1893Incremental deb image generationenhancementLowFutureUnassignedNEW 10
1953License Compliance: Create License Responsibility FileenhancementLowFutureUnassignedACCEPTED(Development) 2
1974BitBake Contributor documentationenhancementLowFutureUnassignedACCEPTED 1
2025runqemu scripts should attempt sane defaults for unknown machinesenhancementLowFutureUnassignedNEW 3
2951Review and remove unnecessary uses of _prepend/_appendenhancementLowFutureUnassignedNEW
3252Binary level package selection and configuration tool.enhancementLowFutureUnassignedIN PROGRESS DESIGN 20
3253adding home automation layer to yoctoenhancementLowFutureUnassignedNEW
3498RDEPENDS of packages created by PACKAGES_DYNAMIC not built before image rootfsenhancementLowFutureUnassignedACCEPTED
4011Merge machine specific config recipes into one recipe to rule them allenhancementLowFutureUnassignedNEW
4053Contribute the contrib/vim files to vimenhancementLowFutureUnassignedACCEPTED0.2
4085Not all WARNINGS are stored in qa.logenhancementLowFutureUnassignedACCEPTED
4530gconv data needs virtual providersenhancementLowFutureUnassignedNEW2
4976Add flag for package to signal reboot is required after installationenhancementLowFutureUnassignedNEW
5033Way to audit all optional dependenciesenhancementLowFutureUnassignedNEW 10
5605Add ptest for ffmpegenhancementLowFutureUnassignedNEW
5675Add a ROOT_PASSWD feature for imagesenhancementLowFutureUnassignedNEW
5785Make it possible to sync a defconfig from WORKDIR back to the metadataenhancementLowFutureUnassignedNEW
6451save which recipe fetches which sourceenhancementLowFutureUnassignedNEW5
6604Clone a Toaster projectenhancementLowFutureUnassignedNEWGUI design pending
6670all compatible recipes page should link to layer source recipe with the layer nameenhancementLowFutureUnassignedNEW
7219Show the file size of the license manifest when available for download in the build dashboardenhancementLowFutureUnassignedNEWbuild dashboard page
7294For QA Issues errors and warnings, toaster should recognize the error and provide suggestions to the user on how the error can be repairedenhancementLowFutureUnassignedNEWGUI design pending
7827Handle if bitbake server code changes when memory residentenhancementLowFutureUnassignedNEW
8036Request to allow people to set pagination to allenhancementLowFutureUnassignedNEW 4.5
8105oe-selftest: allow breaking out without interrupting the current testenhancementLowFutureUnassignedNEW
8156lib/bb/fetch2/svn.py should support latest_versionstring()enhancementLowFutureUnassignedNEW1
8577Add a global UI widget to show progress of buildsenhancementLowFutureUnassignedNEWGUI design pending
8677Layer index: allow searching the metadataenhancementLowFutureUnassignedNEW
8755Remote signing of RPM packagesenhancementLowFutureUnassignedIN PROGRESS REVIEW
9173Create a way that sstate will automatically be removed after setsceneenhancementLowFutureUnassignedNEW1
9203Automatically paginate bitbake -e outputenhancementLowFutureUnassignedNEW1
9762Add support for poisoning of variablesenhancementLowFutureUnassignedNEW3
9839The "clear search" button on the – "Add | Remove packages table" - does not clearnormalLowFutureUnassignedNEW
9891nasm should be a cross recipeenhancementLowFutureUnassignedNEW
9980create src packages that can be deployed to image targetsenhancementLowFutureUnassignedNEW
10453add .inputrc file for the default users so the up arrow history worksenhancementLowFutureUnassignedNEW0.5
10559recipetool: generate install function for debian packagesenhancementLowFutureUnassignedACCEPTED
10728Create Test Plan to verify functionallity of the combo-layer scriptenhancementLowFutureUnassignedACCEPTED5
10782git fetch has multiple progress barsminorLowFutureUnassignedNEW 2
10790Run SDK tests inside containerenhancementLowFutureUnassignedNEW5
10834fetch progress bar doesn't account for multiple URLsminorLowFutureUnassignedNEW 1
11281wic: should be able to run with or without bitbake/native toolsenhancementLowFutureUnassignedNEW 7
11424poky-tiny + Link Time OptimizationenhancementLowFutureUnassignedACCEPTEDLET REVIEW20
12166Provide adequate solution for setting correct LOCALE in guest machineenhancementLowFutureUnassignedNEW1
12862do_package_setscene is unwillingly skippednormalLowFutureUnassignedNEW
13217"bitbake -c create_manifest python" automatically overwrites upstream python2-manifest.json, breaking python buildminorLowFutureUnassignedNEW
405Add a mechanism to do pre-build sanity based on specific configurationsenhancementMediumFutureUnassignedACCEPTED 20
1525[multilib] Triggering building a 64 bit kernel with a 32 bit userspaceenhancementMediumFutureUnassignedIN PROGRESS DESIGN 10
3059psplash doesn't blend if image contains alpha channelenhancementMediumFutureUnassignedNEW
3887Merge buildstats into build history and have one data collection mechanismenhancementMediumFutureUnassignedNEW
4091Add support to bitbake fetcher to fetch files from bare repos for PREMIRRORSenhancementMediumFutureUnassignedNEW
4120rootfs_deb doesn't support BAD_RECOMMENDATIONSenhancementMediumFutureUnassignedNEW 10
4331Visualising single package sizeenhancementMediumFutureUnassignedNEW 5
4516SPDX License Manifests for ImagesenhancementMediumFutureUnassignedNEW3
4517SPDX license calculation toolenhancementMediumFutureUnassignedNEW10
5346Investigate build performance variance between different host OS-es on same HWnormalMediumFutureUnassignedNEW
5399Analyze Sharing PR server between builders with different metadataenhancementMediumFutureUnassignedNEW 1
5429Add ability for SDK-from-image to pick up additional host/target tools automaticallyenhancementMediumFutureUnassignedNEW
5854Investigate sstate package compression improvementsenhancementMediumFutureUnassignedNEW
5955Enhance PATCHTOOL = "git" to be able to pop off patch seriesenhancementMediumFutureUnassignedNEW
6234Implement model for project owner / userenhancementMediumFutureUnassignedNEW 2
6259Investigate OSTree integrationenhancementMediumFutureUnassignedNEW
6580[PATCH] Breaks builds when running as confined SELinux usernormalMediumFutureUnassignedNEW
6603Export / Import Toaster projectsenhancementMediumFutureUnassignedNEWGUI design pending
6649Ability to report locked sigs deltaenhancementMediumFutureUnassignedNEW 5
6764Enforce a specific allowed list of LicensesenhancementMediumFutureUnassignedNEW3
6840Seeing builds delta in ToasterenhancementMediumFutureUnassignedNEWGUI design pending
6855Add comprehensive regression tests for shared state functionalityenhancementMediumFutureUnassignedNEW5
6897Customise the Django admin interfaceenhancementMediumFutureUnassignedNEW
6898Design Toaster configuration interfaceenhancementMediumFutureUnassignedNEWGUI design pending
6915Toaster should handle ASSUME_PROVIDEDenhancementMediumFutureUnassignedNEWGUI design pending
6916Toaster should turn QA check names in warnings / errors into linksenhancementMediumFutureUnassignedNEWGUI design pending
6953Branding SupportenhancementMediumFutureUnassignedNEW
7038For cached tasks, indicate in which URL the sstate object was foundenhancementMediumFutureUnassignedNEW
7110Builds of "world" are pretty ugly in toaster UIenhancementMediumFutureUnassignedNEWGUI design pending
7234warn the user if the project configuration settings aren't reflected in the buildenhancementMediumFutureUnassignedNEWGUI design pending, still (2021)10
7235warn the user about unexpected configuration changes in variable historyenhancementMediumFutureUnassignedNEWGUI design pending
7328Package feed publishing toolenhancementMediumFutureUnassignedIN PROGRESS IMPLEMENTATION 5
7476Improve license manifest descriptionenhancementMediumFutureUnassignedNEW2
7527Integrate Toaster with JenkinsenhancementMediumFutureUnassignedNEW10
7727toaster: show bbappend information for recipesenhancementMediumFutureUnassignedNEWGUI design pending 4
7742Toaster: Remove constraints when setting the layers checkout directoryenhancementMediumFutureUnassignedNEW
7748Provide a way to do a Toaster cleanup and start again if you get the initial set up wrongenhancementMediumFutureUnassignedNEW
8008Expose branch mapping through the layer index UIenhancementMediumFutureUnassignedNEW
8394patchwork: ensure that patches received during a PW server outage are processedenhancementMediumFutureUnassignedNEW 3
8426Improve how we display layer dependenciesenhancementMediumFutureUnassignedNEWGUI design pending 6
8531runexported.py parameter support for: -f <manifest>enhancementMediumFutureUnassignedIN PROGRESS REVIEW
8534need export manifest files to SDK package under /conf/test/ folders of every layerenhancementMediumFutureUnassignedNEW15
8714Patchwork: display notification in series view when a build is started using the seriesenhancementMediumFutureUnassignedIN PROGRESS DESIGN 5
8715Update patchwork / build status page on patch test build completionenhancementMediumFutureUnassignedNEW2
8729grub: create a script to boot between rootfs and a maintenance partitionenhancementMediumFutureUnassignedIN PROGRESS REVIEW3
8760Autobuilder additional task log availabilityenhancementMediumFutureUnassignedNEW 2
8789extensible SDK: allow disabling devtool subcommands based on capabilitiesenhancementMediumFutureUnassignedNEW2
8928extensible SDK - add a way to prepare the sdk for offline usageenhancementMediumFutureUnassignedNEW3
9007Write BitBake contribution guidelinesnormalMediumFutureUnassignedNEW 0.5
9080Autobuilder/oe-selftest: Have a way to specify a which oe-self tests get run on a forced AB jobenhancementMediumFutureUnassignedNEW2
9153Enhance build performance dataenhancementMediumFutureUnassignedNEWGUI design pending 4
9387Extensible SDK: add image customisation functionalityenhancementMediumFutureUnassignedNEW5
9391refactor syslinux.bbclass, grub-efi.bbclass and gummiboot.bbclassenhancementMediumFutureUnassignedNEW5
9463An easier way to debug package install (do_rootfs, do_populate_sdk)enhancementMediumFutureUnassignedNEW 10
9479Extensible SDK breaks if python-dependent items added to TOOLCHAIN_HOST_TASKnormalMediumFutureUnassignedNEW2
9588Create a method for describing builds and desired output. aka a build descriptorenhancementMediumFutureUnassignedNEW5
9589Create a script for consuming a "build descriptor"enhancementMediumFutureUnassignedNEW5
9651Error report web: Optimize searching timesenhancementMediumFutureUnassignedNEW3
9692QA check for #! interpreter should handle '/usr/bin/env something'normalMediumFutureNew Comer BugsNEWNEWCOMER5
9779remote profilingenhancementMediumFutureUnassignedNEW
9821create a configuration for a deployable autobuilder clusterenhancementMediumFutureUnassignedNEW 5
10130Excessive warnings for incorrectly formatted LICENSEminorMediumFutureUnassignedNEW1
10253Better user display/access of PACKAGECONFIG options for recipesenhancementMediumFutureUnassignedNEW
10452allow the samba container to host multiple volumesenhancementMediumFutureUnassignedNEW 2
10476Unify exception handling in core/classesenhancementMediumFutureUnassignedNEW 3
10505Extensible SDK: make it easier to track changes to the metadataenhancementMediumFutureUnassignedNEW2
10600Extensible SDK: add a more practical means of adding components at build timeenhancementMediumFutureUnassignedNEW1
10622buildstats: use JSON formatenhancementMediumFutureUnassignedNEW 3
10653Improve Node.js developer workflow.normalMediumFutureUnassignedNEW
10733image license not copied to rootfsnormalMediumFutureUnassignedNEW1
10798Extensible SDK: sdk-update fails with error if no updates are availablenormalMediumFutureUnassignedNEW0.5
10827Run oe-selftest -r wic for every patch coming to openembedded-core, poky and bidbake-devel listsenhancementMediumFutureUnassignedIN PROGRESS IMPLEMENTATIONLET 7
10829runqemu: Add python moduleenhancementMediumFutureUnassignedNEW15
10847testimage: add the ability to test dynamic IP addr targetsenhancementMediumFutureUnassignedNEW
10852Extensible SDK: improve logic for setting core layer nameminorMediumFutureUnassignedNEW1
10950Allow binaries to be shared along with some compatibility metadataenhancementMediumFutureUnassignedNEW5
11011Double parse on eSDK installationnormalMediumFutureUnassignedNEW1
11015devtool: fails to add node.js project that has local dependencynormalMediumFutureUnassignedNEW2
11145Optionally start shared PRServer with controllerenhancementMediumFutureUnassignedNEW 0.5
11159Using RPM4, it is not possible to control a multiarch MIPS64 system w/o errornormalMediumFutureUnassignedACCEPTED
11261Implement log rotation for WikilogenhancementMediumFutureUnassignedNEW2
11314shell parser: support $(( ))enhancementMediumFutureUnassignedACCEPTED 2
11350eSDK should handle SRCREV = "${AUTOREV}"enhancementMediumFutureUnassignedNEW2
11397oe-build-perf-report: show blocking tasksenhancementMediumFutureUnassignedNEW 4
11398oe-build-perf-report: interactive timeline selection in the html reportenhancementMediumFutureUnassignedNEW 3
11458oe-build-perf-report: improve tooltips of html reportenhancementMediumFutureUnassignedNEW 2
11466TPM 2.0 support (under qemu)enhancementMediumFutureUnassignedIN PROGRESS IMPLEMENTATION3
11497eSDK: create test case for populate_sdk_ext using shared statesnormalMediumFutureUnassignedNEW0.5
11504eSDK: allow rolling back to a previous versionenhancementMediumFutureUnassignedNEW3
11505eSDK: move SDK subcommands out to a separate commandenhancementMediumFutureUnassignedNEW3
11517check for real signed-off-by namesenhancementMediumFutureUnassignedNEW 1
11546oe-build-perf-report: implement thresholds for measurement resultsenhancementMediumFutureUnassignedNEW 3
11677eSDK: add layer management functionalityenhancementMediumFutureUnassignedNEW6
11807kernel tooling should support building in firmwareenhancementMediumFutureUnassignedNEW3.5
11946Builds should include a manifest of hashes for various revs of tools and sources usedenhancementMediumFutureUnassignedNEW1
11975Script to validate tap devicesenhancementMediumFutureUnassignedNEW3
11979Create EPUB version of docsenhancementMediumFutureUnassignedNEW20
12046Allow shared-mime-info to just install the cacheenhancementMediumFutureUnassignedNEW2
12115eSDK: building the eSDK for two different machines can trigger an sstate_install errornormalMediumFutureUnassignedNEW1
12165patchtest: properly fix "too many open files" errorenhancementMediumFutureUnassignedNEW 2
12283Building a fitImage including INITRAMFS_IMAGE (wo/ BUNDLE) cause the kernel to depend on rootfs which is badnormalMediumFutureUnassignedACCEPTED3
12296standalone wic in "classic" SDKenhancementMediumFutureUnassignedNEW
12344Unable to create derivative SDK within eSDK environmentnormalMediumFutureUnassignedNEW
12413Add a more helpful error message if the workdir is owned by uid/gid 0enhancementMediumFutureUnassignedNEW
12593Monitor resource limits?enhancementMediumFutureUnassignedNEW
12716Replace unfs3 with nfs-ganesha?enhancementMediumFutureNew Comer BugsNEW
12904Port panel from apm/acpi to sysfsenhancementMediumFutureNew Comer BugsNEWnewcomer
12912Re-architect fit-image.bbclass rather than continue with wrong kernel-fitimage.bbclass approachenhancementMediumFutureUnassignedNEW
13159Add support for dlangenhancementMediumFutureUnassignedACCEPTED
13303git fetcher should verify tags for releasesenhancementMediumFutureUnassignedNEW
13362eSDK adding packages layernormalMediumFutureUnassignedNEW
13387binutils on target broken with gcc 9 on mipsmajorMediumFutureUnassignedNEW
13698buildbot got this traceback when running stable/thud-nutnormalMediumFutureUnassignedNEW
13900For git sources, support specifying additional patches to backport via their commit sha ID's in the SRC_URIenhancementMediumFutureUnassignedNEW
14072modification to BB_HASHBASE_WHITELIST from within recipe should trigger a warningenhancementMediumFutureUnassignedNEW
14205[Poky] Poky's sanity.bbclass and path.py assume tar is gtarnormalMediumFutureUnassignedNEW
8744Need to standardize on a format for security bugsnormalMediumQ4New Comer BugsNEW
 356       

Non-Prioritized Bugs (Not Yocto)

IDSummary (35 tasks) SeverityPMilestoneAssigneeStatusWhiteboardE
8336[internalsolv] Problem when upgrading a package which depends on a new package (old issue #32)minorUndecided1.0Alex StewartNEW
8337Make opkg translatable (old issue #42)enhancementUndecided1.0Alex StewartNEW
8340libopkg needs a better error reporting mechanism (old issue #63)enhancementUndecided0.5Alex StewartACCEPTED
8342[internalsolv] Opkg fails to attempt all satisfying dependencies after installing the first one fails (old issue #85)minorUndecided1.0Alex StewartNEW
8343Downgrade to Prefer (old issue #111)enhancementUndecided0.5Alex StewartNEW
8345[internalsolv] Install package(s) only after download of all needed packages. (old issue #116)enhancementUndecided1.0Alex StewartNEW
8346Check for package list update before downloading (old issue #117)enhancementUndecided1.0Alex StewartNEW
8347Review performance of algorithms using pkg_vec (old issue #120)enhancementUndecided1.0Alex StewartNEW
8349[internalsolv] dist-upgrade feature (old issue #126)enhancementUndecided1.0Alex StewartNEW
8350Customisable uid/gid translation during installation (old issue #129)enhancementUndecided0.5Alex StewartACCEPTED
8360[internalsolv] Packages fail to install when Recommends can't be installed (old issue #165)minorUndecided---Alex StewartNEW
8537Feature request: new libopkg APIenhancementUndecided1.0Alex StewartNEW
8564Deprecated OpenSSL signing supportmajorUndecided0.5Alex StewartIN PROGRESS DESIGN
8565Add global preinst/postinst hooks to opkgenhancementUndecided1.0Alex StewartNEW
8912[internalsolv] opkg remove --autoremove' does not fully uninstall product.minorUndecided---Alex StewartNEW
9792[internalsolv] globs don't work on opkg commandsenhancementUndecided---Alex StewartACCEPTED
9830Opkg's pre-depends not being honored appropriatelynormalUndecided0.5Alex StewartACCEPTED
9938[internalsolv] Upgrade of package with versioned Depends failsminorUndecided---Alex StewartNEW
9973When relative paths are not allowed in options show an appropriate error messageenhancementUndecided0.5Alex StewartACCEPTED
10277[internalsolv] Package install upgrades provider of virtual dependency incorrectlyminorUndecided---Alex StewartNEW
10461Uninstall leaks common directories if packages removed out-of-ordernormalUndecided0.5Alex StewartACCEPTED
12223opkg marks package as installed despite a dependency failing to installnormalUndecided0.5Alex StewartNEW
12275[RFE] option to statically link in all shared objects for opkgenhancementUndecided---Alex StewartNEW
12474If `opkg install file` collides with repo pkg with same name/version, the repo metadata is usednormalUndecided0.5Alex StewartACCEPTED
12500[libsolv] Missing leaf dependency gives error on higher dependencies that nothing provides them.enhancementUndecided1.0Alex StewartACCEPTED
12797[internalsolv] force-removal-of-dependent-packages flag incorrectly remove Essential package dependenciesnormalUndecided1.0Alex StewartACCEPTED
13197opkg download doesn't download older version of a package if newer version is installednormalUndecided0.5Alex StewartACCEPTED
13593Installation of package is slownormalUndecided0.4.5Alex StewartACCEPTED
13744Support "porcelain" option to preserve output format for script parsingenhancementUndecided---Alex StewartNEW
13942Debian-Repos: Add support for the 'sources.list' configuration formatminorUndecided---Alex StewartACCEPTED
13943Debian-Repos: Improve update operation for architecture 'all'normalUndecided---Alex StewartACCEPTED
13944Improve the install operation if 'nodeps' option is usedenhancementUndecided0.4.5Alex StewartACCEPTED
14107The libopkg source should consistently use stdbool for its boolean value implementation, for currency and consistency.enhancementUndecided0.4.5Alex StewartACCEPTED2
14178Empty "md5sum" and/or "size" entries in Packages file cause segfault in opkgnormalUndecided---Alex StewartACCEPTED
14233opkg configure in run-postinsts taking 8s.majorUndecided---Alejandro del CastilloNEW
 35       
IDSummary (2 tasks) SeverityPMilestoneAssigneeStatusWhiteboardE
13024Add buck-security testsenhancementUndecided---akusterNEW
14304Add build dependency for pod2mannormalUndecided---akusterNEW
 2       

Non-Targeted Bugs (Not Yocto)

IDSummary (12 tasks) SeverityPMilestoneAssigneeStatusWhiteboardE
8163opkg don't resume big upgrades (old issue #17)minorMedium---Alex StewartNEW
8360[internalsolv] Packages fail to install when Recommends can't be installed (old issue #165)minorUndecided---Alex StewartNEW
8912[internalsolv] opkg remove --autoremove' does not fully uninstall product.minorUndecided---Alex StewartNEW
9792[internalsolv] globs don't work on opkg commandsenhancementUndecided---Alex StewartACCEPTED
9938[internalsolv] Upgrade of package with versioned Depends failsminorUndecided---Alex StewartNEW
10277[internalsolv] Package install upgrades provider of virtual dependency incorrectlyminorUndecided---Alex StewartNEW
12275[RFE] option to statically link in all shared objects for opkgenhancementUndecided---Alex StewartNEW
13744Support "porcelain" option to preserve output format for script parsingenhancementUndecided---Alex StewartNEW
13942Debian-Repos: Add support for the 'sources.list' configuration formatminorUndecided---Alex StewartACCEPTED
13943Debian-Repos: Improve update operation for architecture 'all'normalUndecided---Alex StewartACCEPTED
14178Empty "md5sum" and/or "size" entries in Packages file cause segfault in opkgnormalUndecided---Alex StewartACCEPTED
14233opkg configure in run-postinsts taking 8s.majorUndecided---Alejandro del CastilloNEW
 12       
IDSummary (2 tasks) SeverityPMilestoneAssigneeStatusWhiteboardE
13024Add buck-security testsenhancementUndecided---akusterNEW
14304Add build dependency for pod2mannormalUndecided---akusterNEW
 2       
Personal tools