Bug Triage

From Yocto Project
(Difference between revisions)
Jump to: navigation, search
(Old Milestone)
(Old Milestone)
Line 169: Line 169:
 
   |severity=!janitors
 
   |severity=!janitors
 
   |priority= !Undecided
 
   |priority= !Undecided
   |columns=id,summary,to,status,severity,priority,milestone
+
   |columns=id,summary,to,status,severity,priority,milestone, whiteboard
 
   |sort=milestone
 
   |sort=milestone
 
   |noresultsmessage="No matching bugs found."
 
   |noresultsmessage="No matching bugs found."

Revision as of 09:35, 28 July 2014

Contents

Goal

The output of the bug triage meeting should be that all bugs have an owner, a target milestone, and a priority.

Prior to the meeting, each Product Owner should review their Weekly New and High Bugs and be ready with any opens. An example open would be a bug that may need to change Products.

Roles

  • Call facilitator: Stephen K. Jolley
    • Ensure we keep to the agenda, don't rathole on bug resolution, and stay within our time block.

Agenda

  • Opens
    • Collect opens
    • Discuss opens
  • Review Queries
    • State number and owner
    • Owner makes any modifications
    • Assign owner, target milestone, and priority.

Note: for Minnowboard or MinnowBoard-MAX bugs go to: Minnow Bug Triage

Bug Criteria

  • Priority-Severity
    • High-Critical: Two Week
    • High: Milestone
    • Medium: Nice to have for milestone, must have for release

Bug Status Dashboards

Weekly - https://wiki.yoctoproject.org/charts/combo.html

Daily - https://wiki.yoctoproject.org/charts/daily/combo.html

Yocto Bug Triage Searches

Non-Prioritized Bugs

IDSummary (71 tasks) SeverityPMilestoneAssigneeStatusWhiteboardE
8336[internalsolv] Problem when upgrading a package which depends on a new package (old issue #32)minorUndecided1.0Alejandro del CastilloNEW
8337Make opkg translatable (old issue #42)enhancementUndecided---Alejandro del CastilloNEW
8338ManpagesenhancementUndecided---Alejandro del CastilloNEW
8339Manpages (old issue #56)enhancementUndecided1.0Alejandro del CastilloNEW
8340libopkg needs a better error reporting mechanism (old issue #63)enhancementUndecided0.4Alejandro del CastilloNEW
8342[internalsolv] Opkg fails to attempt all satisfying dependencies after installing the first one fails (old issue #85)minorUndecided0.4Alejandro del CastilloNEW
8343Downgrade to Prefer (old issue #111)enhancementUndecided0.4Alejandro del CastilloNEW
8344update-alternatives: Support change of link path during upgrade (old issue #113)normalUndecided0.4Alejandro del CastilloNEW
8345Install package(s) only after download of all needed packages. (old issue #116)enhancementUndecided0.4Alejandro del CastilloNEW
8346Check for package list update before downloading (old issue #117)enhancementUndecided1.0Alejandro del CastilloNEW
8347Review performance of algorithms using pkg_vec (old issue #120)enhancementUndecided1.0Alejandro del CastilloNEW
8349dist-upgrade feature (old issue #126)enhancementUndecided1.0Alejandro del CastilloNEW
8350Customisable uid/gid translation during installation (old issue #129)enhancementUndecided0.4Alejandro del CastilloNEW
8351double entries in the info file (old issue #142)normalUndecided0.4Alejandro del CastilloNEW
8352Needs a more detailed error message if an upgarde is not possible (old issue #143)normalUndecided0.4Alejandro del CastilloNEW
8353Add multiple compression algorithms support (old issue #148)enhancementUndecided0.4Alejandro del CastilloNEW
8355Not possible to build static opkg 0.3 (old issue #158)normalUndecided0.4Alejandro del CastilloNEW
8356Opkg flag always returns successminorUndecided0.4Alejandro del CastilloNEW
8357Add comman line option to skip package signature check (old issue #161)normalUndecided0.4Alejandro del CastilloNEW
8359[internalsolv] --force-removal-of-dependent-packages does not remove packages depending on the removed package (old issue #163)normalUndecided0.4Alejandro del CastilloNEW
8360[internalsolv] Packages fail to install when Recommends can't be installed (old issue #165)normalUndecided0.4Alejandro del CastilloNEW
8537Feature request: new libopkg APIenhancementUndecided0.4Alejandro del CastilloNEW
8564Deprecated OpenSSL signing supportnormalUndecided---Alejandro del CastilloNEW
8565Add global preinst/postinst hooks to opkgenhancementUndecided---Alejandro del CastilloNEW
8598--offline-root works only when i install using ipk isntead of package namenormalUndecided---Alejandro del CastilloNEW
8599when i use force downgrade option i have to give full ipk pathnormalUndecided---Alejandro del CastilloNEW
8912[internalsolv] opkg remove --autoremove' does not fully uninstall product.normalUndecided---Alejandro del CastilloNEW
8946opkg install does not appear to fail on file overwritemajorUndecided0.4Alejandro del CastilloNEW
8947opkg conffile resolution cannot detect unmodified conffiles modified in upgraded packagemajorUndecided---Alejandro del CastilloNEW
8948Implement *.md5sums (or equivalent)enhancementUndecided---Alejandro del CastilloNEW
9060If an install succeeds despite broken deps due to --force-depends, it still outputs a diagnostic that makes it look like it failednormalUndecided---Alejandro del CastilloNEW
9238opkg-make-index reformats package description when generating repo index from package control filenormalUndecided--- NEW
9348Opkg requires root privileges for all operationsmajorUndecided---Alejandro del CastilloNEW
9658Detect postinst failing verses asking to be delayed?normalUndecided---Alejandro del CastilloNEW
9792[libsolv] globs don't work on opkg commandsnormalUndecided---Alejandro del CastilloNEW
9830Opkg's pre-depends not being honored appropriatelynormalUndecided---Alejandro del CastilloNEW
9887Directory permissions are overwritten during installnormalUndecided---Alejandro del CastilloNEW
9901Missing package during installation leaves status file in bad statenormalUndecided---Alejandro del CastilloNEW
9906Opkg is not storing Installed-Size on the status filenormalUndecided---Alejandro del CastilloNEW
9920opkg-utils: disallow package names that are not all lower casenormalUndecided---Alejandro del CastilloNEW
9938[internalsolv] Upgrade of package with versioned Depends failsnormalUndecided---Alejandro del CastilloNEW
9939[libsolv] Recommends dependencies should upgrade during a package upgradenormalUndecided---Alejandro del CastilloNEW
9964Suggested fleshing out of the do_compile documentationnormalUndecided2.2 M3Scott RifenbarkREOPENED18 July 2016: IN PROGRESS REVIEW1
9973When relative paths are not allowed in options show an appropriate error messagenormalUndecided---Alejandro del CastilloNEW
9992If we run oe-init-build-env with an argument for builddir, toaster start failsnormalUndecided---Toaster default assigneeNEW
9993uninative loader: no error on checksum failuremajorUndecided---Paul EggletonNEW
9994yocto-uninative.inc: please create and use a new uninative tarballnormalUndecided---Tracy GraydonNEW
9995Network icon is not displayed properly on SATOminorUndecided2.2 M2Richard PurdieNEW
9996Testimage is failing due missing "__init__.py" filemajorUndecided2.2 M3Mariano LopezIN PROGRESS REVIEW1
9997oe-selftest: make available xmlrunner at the autobuilder workersnormalUndecided2.2 M3Michael HalsteadNEEDINFO1
9998packaging: src separately from dbgenhancementUndecided---Paul EggletonNEW
9999Random warning: Unrecognised command on FIFOnormalUndecided---Ross BurtonNEW
10000Add source code for build appliance imageenhancementUndecided---Juro BystrickyNEW
10001bugzilla crashes when selecting "my plans"normalUndecided---Michael HalsteadNEW
10002Suggested glossary entries for PATH and EXTRANATIVEPATHnormalUndecided2.2 M3Scott RifenbarkNEEDINFO1
10005Krogoth-next checkuri failuresnormalUndecided2.1.2Armin KusterACCEPTED
10006[Autobuilder] - public WIC buildset artifacts for genericx86normalUndecided---Bill RandleIN PROGRESS REVIEW
10007krogoth-next arm Running Sanity Tests failesnormalUndecided---Armin KusterACCEPTED
10008[Test Case 25] connection to Target can not be carried outnormalUndecided---Tim OrlingNEW
10009ssh keys generated with invalid format core-image-sato-sdk-genericx86majorUndecided---Saul WoldNEW
10010CheckOutLayers build step fails if OPTIMIZED_GIT_CLONE is not TruenormalUndecided2.2 M3Bill RandleIN PROGRESS REVIEW
10011Suggested addition to the PROVIDES glossary entry to explain virtual targetsnormalUndecided---Scott RifenbarkNEW
10012Suggested rewriting of the (currently semi-nonsensical) INITRAMFS_IMAGE glossary entrynormalUndecided---Scott RifenbarkNEW
10013Suggested changes to the INITRAMFS_IMAGE_BUNDLE glossary entrynormalUndecided---Scott RifenbarkNEW
10014linux-yocto: __lru_cache_add memory leak in krogoth 4.1.28 kernelnormalUndecided---Saul WoldNEW
10015oe-selftest --coverage produces empty coverage report on OpenSUSEnormalUndecided---Humberto IbarraNEW
10016Fail to build linux-yocto for custom qemumips64 bsp with yocto-bspnormalUndecided---Leonardo Sandoval GonzalezNEW
10017base.bbclass: Having ${D} in do_install[dirs] is redundant, since it's already in do_install[cleandirs]enhancementUndecided---Richard PurdieNEW
10018pulseaudio server crashes on bluetooth disconnectnormalUndecided---Jussi KukkonenNEW
10019build-perf-test-wrapper.sh failing to execute performance testnormalUndecided---Leonardo Sandoval GonzalezNEW
10022[Test Case 145] New yocto project BB Commander does not accept any foldernormalUndecided---Tim OrlingNEW
 71       

Non-Targeted Bugs

Low bugs not included.

IDSummary (49 tasks) SeverityPMilestoneAssigneeStatusWhiteboardE
8165[libsolv] opkg_list_upgradable_cmd() does not work with an external solver enabled.normalMedium---Alejandro del CastilloNEW
8337Make opkg translatable (old issue #42)enhancementUndecided---Alejandro del CastilloNEW
8338ManpagesenhancementUndecided---Alejandro del CastilloNEW
8564Deprecated OpenSSL signing supportnormalUndecided---Alejandro del CastilloNEW
8565Add global preinst/postinst hooks to opkgenhancementUndecided---Alejandro del CastilloNEW
8598--offline-root works only when i install using ipk isntead of package namenormalUndecided---Alejandro del CastilloNEW
8599when i use force downgrade option i have to give full ipk pathnormalUndecided---Alejandro del CastilloNEW
8912[internalsolv] opkg remove --autoremove' does not fully uninstall product.normalUndecided---Alejandro del CastilloNEW
8947opkg conffile resolution cannot detect unmodified conffiles modified in upgraded packagemajorUndecided---Alejandro del CastilloNEW
8948Implement *.md5sums (or equivalent)enhancementUndecided---Alejandro del CastilloNEW
9060If an install succeeds despite broken deps due to --force-depends, it still outputs a diagnostic that makes it look like it failednormalUndecided---Alejandro del CastilloNEW
9238opkg-make-index reformats package description when generating repo index from package control filenormalUndecided--- NEW
9348Opkg requires root privileges for all operationsmajorUndecided---Alejandro del CastilloNEW
9658Detect postinst failing verses asking to be delayed?normalUndecided---Alejandro del CastilloNEW
9792[libsolv] globs don't work on opkg commandsnormalUndecided---Alejandro del CastilloNEW
9830Opkg's pre-depends not being honored appropriatelynormalUndecided---Alejandro del CastilloNEW
9852Use the eventreplay mechanism for testingenhancementMedium---Ed BartoshACCEPTED3
9887Directory permissions are overwritten during installnormalUndecided---Alejandro del CastilloNEW
9895Provide UI to allow local layers to be published to layerindex.enhancementMedium+---Toaster default assigneeNEW
9901Missing package during installation leaves status file in bad statenormalUndecided---Alejandro del CastilloNEW
9906Opkg is not storing Installed-Size on the status filenormalUndecided---Alejandro del CastilloNEW
9914For imported layers, remember the value of the last directory and the last Git repositoryenhancementMedium---Toaster default assigneeNEW
9920opkg-utils: disallow package names that are not all lower casenormalUndecided---Alejandro del CastilloNEW
9924Prevent users from using HEAD as Git revision when importing layersenhancementMedium---Toaster default assigneeNEW
9938[internalsolv] Upgrade of package with versioned Depends failsnormalUndecided---Alejandro del CastilloNEW
9939[libsolv] Recommends dependencies should upgrade during a package upgradenormalUndecided---Alejandro del CastilloNEW
9971Toaster does not report progress while setscene tasks are runningnormalMedium---Elliot SmithACCEPTED5
9973When relative paths are not allowed in options show an appropriate error messagenormalUndecided---Alejandro del CastilloNEW
9992If we run oe-init-build-env with an argument for builddir, toaster start failsnormalUndecided---Toaster default assigneeNEW
9993uninative loader: no error on checksum failuremajorUndecided---Paul EggletonNEW
9994yocto-uninative.inc: please create and use a new uninative tarballnormalUndecided---Tracy GraydonNEW
9998packaging: src separately from dbgenhancementUndecided---Paul EggletonNEW
9999Random warning: Unrecognised command on FIFOnormalUndecided---Ross BurtonNEW
10000Add source code for build appliance imageenhancementUndecided---Juro BystrickyNEW
10001bugzilla crashes when selecting "my plans"normalUndecided---Michael HalsteadNEW
10006[Autobuilder] - public WIC buildset artifacts for genericx86normalUndecided---Bill RandleIN PROGRESS REVIEW
10007krogoth-next arm Running Sanity Tests failesnormalUndecided---Armin KusterACCEPTED
10008[Test Case 25] connection to Target can not be carried outnormalUndecided---Tim OrlingNEW
10009ssh keys generated with invalid format core-image-sato-sdk-genericx86majorUndecided---Saul WoldNEW
10011Suggested addition to the PROVIDES glossary entry to explain virtual targetsnormalUndecided---Scott RifenbarkNEW
10012Suggested rewriting of the (currently semi-nonsensical) INITRAMFS_IMAGE glossary entrynormalUndecided---Scott RifenbarkNEW
10013Suggested changes to the INITRAMFS_IMAGE_BUNDLE glossary entrynormalUndecided---Scott RifenbarkNEW
10014linux-yocto: __lru_cache_add memory leak in krogoth 4.1.28 kernelnormalUndecided---Saul WoldNEW
10015oe-selftest --coverage produces empty coverage report on OpenSUSEnormalUndecided---Humberto IbarraNEW
10016Fail to build linux-yocto for custom qemumips64 bsp with yocto-bspnormalUndecided---Leonardo Sandoval GonzalezNEW
10017base.bbclass: Having ${D} in do_install[dirs] is redundant, since it's already in do_install[cleandirs]enhancementUndecided---Richard PurdieNEW
10018pulseaudio server crashes on bluetooth disconnectnormalUndecided---Jussi KukkonenNEW
10019build-perf-test-wrapper.sh failing to execute performance testnormalUndecided---Leonardo Sandoval GonzalezNEW
10022[Test Case 145] New yocto project BB Commander does not accept any foldernormalUndecided---Tim OrlingNEW
 49       

Unassigned Bugs

IDSummary (70 tasks) SeverityPMilestoneAssigneeStatusWhiteboardE
139Set default gcc instruction generation to TARGET_ARCH on targetenhancementMediumFutureUnassignedNEW5
256Sync up RPM version policy with rest of system (including support '~' in version strings)enhancementMediumFutureUnassignedNEWMoved from Laurentiu to Unassigned10
760[script] no options to use kernel nfs server as nfsrootenhancementLowFutureUnassignedNEWMoved from Laurentiu to Unassigned7
1550Enhance TARGET_VENDOR field supportenhancementLowFutureUnassignedNEWP33
1560Enable recipe specific sysrootsenhancementLowFutureUnassignedACCEPTED5
1658depexp like features without XenhancementLowFutureUnassignedNEW
1789[Autobuilder] Optionally generate a HTML logenhancementMediumFutureUnassignedNEW2
2025runqemu scripts should attempt sane defaults for unkown machinesminorLowFutureUnassignedNEW3
2086Rewrite bbvars.py to use bitbake to find variablesminorLowFutureUnassignedNEW
2087Address LTP and POSIX compliance testsminorLowFutureUnassignedNEW
2273Evaluate current image space settingsenhancementLowFutureUnassignedNEWMoved from Laurentiu to Unassigned4
2348Cleanup package.bbclass - runstrip and split_and_strip_files checksminorLowFutureUnassignedNEW
2413fri2: enable user input buttonminorLowFutureUnassignedNEWMoved from Kevin to Unassigned10
2421[Performance] Further improvements for turning off doc generation for -native (and similar) packagesenhancementLowFutureUnassignedNEW
2782screen hangs with ttyS0normalLowFutureUnassignedNEW
2951Review and remove unnecessary uses of _prepend/_appendminorLowFutureUnassignedNEW
3256Debugging tools and binaries need to be attached to target run timeminorLowFutureUnassignedNEW
3463Define PREEMPT_RT validation suiteenhancementMediumFutureUnassignedACCEPTED3
3763generate error if file in FILES is not foundenhancementLowFutureUnassignedNEW
3887Merge buildstats into build history and have one data collection mechanismenhancementMediumFutureUnassignedIN PROGRESS DESIGN
3976Support ~ in package versionsenhancementMediumFutureUnassignedNEWMoved from Laurentiu to Unassigned
4059init-install.sh assumes boot device is the same as the one selected when it is runnormalMediumFutureUnassignedNEW
4402Customise the summary of all the information available for one build + image recipe combinationenhancementMediumFutureUnassignedNEW10
4436Add ptest for glibcenhancementMediumFutureUnassignedNEWMoved from Laurentiu to Unassigned5
4437Add ptest for gccenhancementMediumFutureUnassignedNEWMoved from Laurentiu to Unassigned5
4525Use buildhistory to log key values and track regressionenhancementMediumFutureUnassignedNEW
4526Record image size from buildhistory to track regressionenhancementMediumFutureUnassignedNEW1.5
4578x32 ABI performance comparisonenhancementMediumFutureUnassignedNEW
4929Add support for pacman as package_pacman/xy.bbclassenhancementLowFutureUnassignedNEW
5005Ability to use rpmbuild to build packages (via the SDK)enhancementLowFutureUnassignedNEWMoved from Laurentiu to Unassigned
5430Notification systemenhancementLowFutureUnassignedNEW
5538Implement Backend API controller for buildbotenhancementMediumFutureUnassignedNEW
5605Add ptest for libavenhancementLowFutureUnassignedNEW
5695python: ptest cases failednormalLowFutureUnassignedNEWMoved from Laurentiu to Unassigned
5782Do not configure sftp for the ssh daemon by defaultminorLowFutureUnassignedIN PROGRESS DESIGNRoxanna is no longer at Intel
5785Make it possible to sync up configurations with defconfigenhancementLowFutureUnassignedNEW
5955Enhance PATCHTOOL = "git" to be able to pop off patch seriesenhancementMediumFutureUnassignedNEW
6234Implement model for project owner / userenhancementMedium2.3UnassignedNEW2
6284Random package/image builder (fuzzy build)enhancementMediumFutureUnassignedNEW4
6498Latencytop -d does not work for qemuppc and qemuarmnormalLowFutureUnassignedWaitForUpstreamRoxanna is no longer at Intel
6573meta-toolchain-qte: Cannot be used to produce "Debug" and "Release" builds of Qt application outside Yocto buildsystemnormalLowFutureUnassignedNEW
6649Ability to report locked sigs deltaenhancementMediumFutureUnassignedNEW5
6670all compatible recipes page should link to layer source recipe with the layer nameenhancementMediumFutureUnassignedNEW
6706Include maintainers list for layersenhancementMediumFutureUnassignedNEW
6778Add "import layer" to layer suggestions drop downenhancementMediumFutureUnassignedNEWproject configuration page
6840Seeing builds delta in ToasterenhancementMediumFutureUnassignedNEWGUI design pending
6897Customise the Django admin interfaceenhancementMediumFutureUnassignedNEWGUI design pending
6950bitbake errors must have unique ids to make them easily greppable in the sourceenhancementLowFutureUnassignedNEW
6978For the local release in Toaster, show local path to layer directory instead of Git URLenhancementMediumFutureUnassignedNEWproject configuration page
7038For cached tasks, indicate in which URL the sstate object was foundenhancementMediumFutureUnassignedNEW
7219Show the file size of the license manifest when available for download in the build dashboardenhancementLowFutureUnassignedNEWbuild dashboard page
7294For QA Issues errors and warnings, toaster should recognize the error and provide suggestions to the user on how the error can be repairedenhancementLowFutureUnassignedNEWGUI design pending
7355Strange outcome in Toaster 'covered' tasks queriesnormalMediumFutureUnassignedNEW
7457Split "Previous Build" tasksenhancementMediumFutureUnassignedNEW
7503Add support for MultiPath TCP for YP Linux images/specific imageenhancementMediumFutureUnassignedNEW
7527Integrate Toaster with JenkinsenhancementMediumFutureUnassignedNEW10
7727toaster: show bbappend information for recipesenhancementMediumFutureUnassignedNEWGUI design pending4
7742Remove constraints when setting the layers checkout directoryenhancementMediumFutureUnassignedNEW
7748Provide a way to do a Toaster cleanup and start again if you get the initial set up wrongenhancementMediumFutureUnassignedNEW
7954pigz has resource race issuesnormalMediumFutureUnassignedNEW
8008Expose branch mapping through the layer index UIenhancementMediumFutureUnassignedNEW
8109fail to build glibc for aarch64 on fedora 22 i686normalLowFutureUnassignedNEW
8123the aarch64 toolchain can not build iptables on i686 hostnormalLowFutureUnassignedNEW
8482Support multi-nodes interoperability testingenhancementMedium+FutureUnassignedNEW
9302Failed to start qemu with toolchain sysrootnormalMedium2.1.1UnassignedNEW
9362Failed to run and debug a project to qemux86 in EclipsenormalMedium2.1.1UnassignedNEW3
9532useradd / extrausers chain pseudo, causing stack overflows (segfaults)normalMediumFutureUnassignedNEW
9779remote profilingenhancementMediumFutureUnassignedNEW
9891nasm should be a cross recipeenhancementLowFutureUnassignedNEW
9892v86d fails to build on arm64 hostenhancementLowFutureUnassignedIN PROGRESS REVIEW
 70       

New This Week

IDSummary (59 tasks) SeverityPMilestoneAssigneeStatusWhiteboardE
9969Display target:task correctly on build dashboard (and elsewhere)normalMedium2.2 M4Elliot SmithACCEPTEDGUI design available3
9971Toaster does not report progress while setscene tasks are runningnormalMedium---Elliot SmithACCEPTED5
10005Krogoth-next checkuri failuresnormalUndecided2.1.2Armin KusterACCEPTED
10007krogoth-next arm Running Sanity Tests failesnormalUndecided---Armin KusterACCEPTED
9972recipetool: setvar fails on empty bbappend filenormalMedium2.2 M3Paul EggletonIN PROGRESS REVIEW
9986ETA reported for meta-swupd layer is off scale by 1 or 2 orders of magnitudenormalMedium2.2Paul EggletonIN PROGRESS REVIEW
9987sysprof has floating dependency on polkitnormalMedium2.2 M3Maxin B. JohnIN PROGRESS REVIEW
9988Suggested clarification of the STAGING_DIR_* glossary entriesenhancementMedium2.2 M3Scott RifenbarkIN PROGRESS REVIEW21 July 2016: IN PROGRESS REVIEW1
9991gcc6: qtbase5 compile error.normalMedium+2.2 M3Khem RajIN PROGRESS REVIEW
9996Testimage is failing due missing "__init__.py" filemajorUndecided2.2 M3Mariano LopezIN PROGRESS REVIEW1
10006[Autobuilder] - public WIC buildset artifacts for genericx86normalUndecided---Bill RandleIN PROGRESS REVIEW
10010CheckOutLayers build step fails if OPTIMIZED_GIT_CLONE is not TruenormalUndecided2.2 M3Bill RandleIN PROGRESS REVIEW
9997oe-selftest: make available xmlrunner at the autobuilder workersnormalUndecided2.2 M3Michael HalsteadNEEDINFO1
10002Suggested glossary entries for PATH and EXTRANATIVEPATHnormalUndecided2.2 M3Scott RifenbarkNEEDINFO1
9973When relative paths are not allowed in options show an appropriate error messagenormalUndecided---Alejandro del CastilloNEW
9974Extensible SDK: reparse occurs on first devtool useminorMedium2.2Paul EggletonNEW
9975Analyse performance regression in 2.1majorHigh2.2 M3Ross BurtonNEW
9977Time, CPU and Disk I/O tables have the wrong core columnsminorLowFutureToaster default assigneeNEW
9978Toaster is showing incorrect task dependency informationnormalMedium+2.2 M4Michael WoodNEW
9979patchtest: provide a command line argument to list the discovered test casesenhancementMedium2.3Leonardo Sandoval GonzalezNEW
9980create src packages that can be deployed to image targetsenhancementMediumFutureMark HatleNEW
9981Make Autobuilder workers get hostname dynamicallyenhancementMedium2.3Bill RandleNEW
9982npm.bbclass install function will package patches directorynormalMedium2.2Brendan Le FollNEW
9990Yocto 1.7 for phycore-vybrid is unable to boot.criticalMedium+1.7.4Atul BansalNEW
9992If we run oe-init-build-env with an argument for builddir, toaster start failsnormalUndecided---Toaster default assigneeNEW
9993uninative loader: no error on checksum failuremajorUndecided---Paul EggletonNEW
9994yocto-uninative.inc: please create and use a new uninative tarballnormalUndecided---Tracy GraydonNEW
9995Network icon is not displayed properly on SATOminorUndecided2.2 M2Richard PurdieNEW
9998packaging: src separately from dbgenhancementUndecided---Paul EggletonNEW
9999Random warning: Unrecognised command on FIFOnormalUndecided---Ross BurtonNEW
10000Add source code for build appliance imageenhancementUndecided---Juro BystrickyNEW
10001bugzilla crashes when selecting "my plans"normalUndecided---Michael HalsteadNEW
10008[Test Case 25] connection to Target can not be carried outnormalUndecided---Tim OrlingNEW
10009ssh keys generated with invalid format core-image-sato-sdk-genericx86majorUndecided---Saul WoldNEW
10011Suggested addition to the PROVIDES glossary entry to explain virtual targetsnormalUndecided---Scott RifenbarkNEW
10012Suggested rewriting of the (currently semi-nonsensical) INITRAMFS_IMAGE glossary entrynormalUndecided---Scott RifenbarkNEW
10013Suggested changes to the INITRAMFS_IMAGE_BUNDLE glossary entrynormalUndecided---Scott RifenbarkNEW
10014linux-yocto: __lru_cache_add memory leak in krogoth 4.1.28 kernelnormalUndecided---Saul WoldNEW
10015oe-selftest --coverage produces empty coverage report on OpenSUSEnormalUndecided---Humberto IbarraNEW
10016Fail to build linux-yocto for custom qemumips64 bsp with yocto-bspnormalUndecided---Leonardo Sandoval GonzalezNEW
10017base.bbclass: Having ${D} in do_install[dirs] is redundant, since it's already in do_install[cleandirs]enhancementUndecided---Richard PurdieNEW
10018pulseaudio server crashes on bluetooth disconnectnormalUndecided---Jussi KukkonenNEW
10019build-perf-test-wrapper.sh failing to execute performance testnormalUndecided---Leonardo Sandoval GonzalezNEW
10020Handle oe-core layer version 9majorHigh2.2 M2Bill RandleNEW
10022[Test Case 145] New yocto project BB Commander does not accept any foldernormalUndecided---Tim OrlingNEW
9964Suggested fleshing out of the do_compile documentationnormalUndecided2.2 M3Scott RifenbarkREOPENED18 July 2016: IN PROGRESS REVIEW1
9965Suggested fleshing out of the do_configure documentationnormalMedium2.2 M3Scott RifenbarkRESOLVED18 July 2016: IN PROGRESS REVIEW1
9966Suggested fleshing out of the do_install documentationnormalUndecided2.2 M3Scott RifenbarkRESOLVED18 July 2016: IN PROGRESS REVIEW1
9967Suggested fleshing out of the do_package documentationenhancementUndecided2.2 M3Scott RifenbarkRESOLVED18 July 2016: IN PROGRESS REVIEW1
9968Suggested fleshing out of the do_populate_sysroot documentationenhancementUndecided2.2 M3Scott RifenbarkRESOLVED18 July 2016: IN PROGRESS REVIEW1
9970Suggested fleshing out of the do_deploy documentationenhancementUndecided2.2 M3Scott RifenbarkRESOLVED19 July 2016: RESOLVED1
9976Suggested addition to 2.3. Debugging Build Failures re. missing build-time dependenciesenhancementUndecided2.2 M3Scott RifenbarkRESOLVED19 July 2016: RESOLVED1
9983host-user-contaminated, invalid-chars, and invalid-packageconfig are missing from '7.62. insane.bbclass'enhancementUndecided2.2 M3Scott RifenbarkRESOLVED19 July 2016: RESOLVED1
9984Suggested clarification of the '3.1.2. Variable Expansion' sectionenhancementMedium2.2 M3Scott RifenbarkRESOLVED21 July 2016: IN PROGRESS REVIEW1
9985Suggested clarification and motivation for the override-style operatorsnormalMedium2.2 M3Scott RifenbarkRESOLVED21 July 2016: RESOLVED1
9989Two tiny documentation nits re. D and do_checkpkgenhancementMedium2.2 M3Scott RifenbarkRESOLVED21 July 2016: IN PROGRESS REVIEW1
10003Mention what happens when non-existent variables are expandednormalUndecided2.2 M3Scott RifenbarkRESOLVED22 July 2016: IN PROGRESS REVIEW1
10004mail command missing on ubuntu1604 workernormalUndecided2.2 M3Michael HalsteadRESOLVED
10021testimage test_parselogs WIC image failed for dmi firmware registration, ioremap error,normalUndecided2.2California SullivanRESOLVED
 59      24

High Bugs

IDSummary (21 tasks) SeverityPMilestoneAssigneeStatusWhiteboardE
9897[Krogoth] Failed to build pkgconfig-native on Fedora24normalHigh2.1.1Tim OrlingIN PROGRESS REVIEW2
8648Automatic testing of incoming patchesenhancementHigh2.2 M2Leonardo Sandoval GonzalezIN PROGRESS REVIEWTesting in Progress10
8649Script to assemble patches for autobuilder testingenhancementHigh2.2 M2Leonardo Sandoval GonzalezIN PROGRESS IMPLEMENTATION15
9457patchtest: document deployment with isolation featuresenhancementHigh2.2 M2Leonardo Sandoval GonzalezNEW5
4431Set up buildhistory-web for autobuilderenhancementHigh2.2 M2Michael HalsteadACCEPTED3
9961intel-quark: 4.4.14 does not compilenormalHigh2.2 M2Saul WoldNEWmeta-intel blocker
9255Allow rootfs tasks to run in parallel with rpmenhancementHigh2.2 M2Stephano CetolaIN PROGRESS REVIEW0.5
10020Handle oe-core layer version 9majorHigh2.2 M2Bill RandleNEW
9954report tool: a communication mechanism for sending resultsenhancementHigh2.2 M3Benjamin EsquivelNEW
9904patchwork: show cover letter message in series created with pull requestenhancementHigh2.2 M3Jose LamegoNEW1
9941patchwork: ensure series are created for all submittersnormalHigh2.2 M3Jose LamegoNEW2
9929pseudo 1.8.1: potential performance regressionnormalHigh2.2 M3Joshua LockNEW
9131Prelink breaks fork IFUNCmajorHigh2.2 M3Mark HatleIN PROGRESS IMPLEMENTATION10
5546Optimise away meta-oe X init mechanismenhancementHigh2.2 M3Maxin B. JohnACCEPTED2
5470bitbake-layers cannot be used with memory resident bitbake runningnormalHigh2.2 M3Paul EggletonIN PROGRESS IMPLEMENTATION5
9588Create a method for describing builds and desired output. aka a build descriptorenhancementHigh2.2 M3Randy WittNEW5
9592Add a mechanism for creating build appliance as a container imageenhancementHigh2.2 M3Randy WittACCEPTED4
7518Build multiple machines in the same bitbake invocationenhancementHigh2.2 M3Richard PurdieIN PROGRESS IMPLEMENTATION15
9975Analyse performance regression in 2.1majorHigh2.2 M3Ross BurtonNEW
9298Autobuilder enable KVM on the cluster for x86, x86-64enhancementHigh2.2 M3Bill RandleNEW4.5
5866Reproducible builds: identical binariesenhancementHigh2.3Juro BystrickyNEW5
 21       

Medium+ Bugs !(Future,1.7)

IDSummary (89 tasks) SeverityPMilestoneAssigneeStatusWhiteboardE
7641CVE-2014-9365 python: failure to validate certificates in the HTTP client with TLS (PEP 476)normalMedium+1.7.4Armin KusterACCEPTED5
8028Garbage in SDK manifest filenormalMedium+1.7.4Armin KusterIN PROGRESS REVIEW3
9990Yocto 1.7 for phycore-vybrid is unable to boot.criticalMedium+1.7.4Atul BansalNEW
9520test_parselogs failed on udevd[342] inotify_add_watch /dev/loop when running test imagenormalMedium+2.1.1Alejandro HernandezIN PROGRESS DESIGNWill need to be backported to 2.1.2 also
9847Intel Saddle Brook (Skylake-H) Krogoth image doesn't boot - hangs at Yocto screencriticalMedium+2.1.1Kartikey Rameshbhai ParmarNEW
1989Default module selections need attentionminorMedium+2.2Bruce AshfieldIN PROGRESS IMPLEMENTATION4
9425Custom image cannot be downloaded until after it is builtnormalMedium+2.2 M1Michael WoodREOPENED4
8142avahi daemon fails to start on systemd while testing core-image-satonormalMedium+2.2 M2Aníbal LimónACCEPTED5
8771test_smart_channel_add (oeqa.runtime.smart.SmartRepoTest) failed in AutobuildernormalMedium+2.2 M2Aníbal LimónIN PROGRESS DESIGN5
9809List python/bitbake libraries that are not being tested by oe-selftestnormalMedium+2.2 M2Ed BartoshIN PROGRESS REVIEWNIR 7/82
9752ptest results do not include all the components testedmajorMedium+2.2 M2Plauchu EdwinNEW1
9828[Beaglebone] mouse doesn't work when system startupnormalMedium+2.2 M2Plauchu EdwinNEW5
9867yocto-bsp: listing values for some properties throws exceptionnormalMedium+2.2 M2Humberto IbarraACCEPTED
9774systemd-boot: Add new test target as what the existing gummiboot doesnormalMedium+2.2 M2Jose Perez CIN PROGRESS REVIEW
9851piglit fails to build on qemux86*normalMedium+2.2 M2Jussi KukkonenIN PROGRESS REVIEW0.5
8525selftest needs to control distro configurationnormalMedium+2.2 M2Leonardo Sandoval GonzalezACCEPTED10
9763tar --exclude option is position-sensitivenormalMedium+2.2 M2Leonardo Sandoval GonzalezACCEPTED1
9660Create a YP-2.2 test plan for SWUpdnormalMedium+2.2 M2LibertadACCEPTED
9474epiphany doesn't work on ARMnormalMedium+2.2 M2Robert YangIN PROGRESS REVIEW1
8383smart runtime test failurenormalMedium+2.2 M2Mariano LopezACCEPTED2
9764testimage: test installation of packages in the DUT without package managernormalMedium+2.2 M2Mariano LopezIN PROGRESS REVIEW1
9765testexport: Test SDK generation and installation for exported tests.normalMedium+2.2 M2Mariano LopezIN PROGRESS IMPLEMENTATION1
9351Issues using bitbake with externalsrc and gitnormalMedium+2.2 M2Markus LehtonenIN PROGRESS REVIEW1
9555Create Toaster Docker containernormalMedium+2.2 M2Randy WittIN PROGRESS IMPLEMENTATION1.5
9513Failed to install sdk_ext for i686normalMedium+2.2 M2Richard PurdieACCEPTED
8988test_rpm_query_nonroot (oeqa.runtime.rpm.RpmInstallRemoveTest) - Failed to create new usernormalMedium+2.2 M2Ross BurtonNEWJethro Backport1
9064do_unpack does not wipe old source treemajorMedium+2.2 M2Ross BurtonIN PROGRESS REVIEW1
9105[MARS] Cannot install eclipse-poky pluginnormalMedium+2.2 M2Tim OrlingIN PROGRESS REVIEW1.5
8673distutils3 packages installed via an egg file cannot be imported by the python3 interpreternormalMedium+2.2 M3Alejandro HernandezACCEPTED2
9757python3-git requires operator and enum modulesnormalMedium+2.2 M3Alejandro HernandezACCEPTED1
9905Add build sets to test new OS Distribution in AutobuildernormalMedium+2.2 M3Aníbal LimónNEW
9617Create Toaster Docker production containernormalMedium+2.2 M3brian averyIN PROGRESS DESIGN3
9440SERIAL_CONSOLES_CHECK doesn't work if kernel console name and device node name differnormalMedium+2.2 M3California SullivanNEW1
9863Changing files in packages-split with populate_packages_prepend does not impact rpm packages, while it does for deb and ipknormalMedium+2.2 M3Ed BartoshACCEPTED
9133Eclipse plugin testing integrate into ABnormalMedium+2.2 M3Plauchu EdwinNEW5
9689Add support for automatic runtime testing in DUT (master bug)normalMedium+2.2 M3Plauchu EdwinNEW5
8440Toaster has some issues when showing builds that fail at the build request stagenormalMedium+2.2 M3Elliot SmithIN PROGRESS REVIEWGUI design available8
8443Builds that failed at the build request stage need a custom dashboardnormalMedium+2.2 M3Elliot SmithIN PROGRESS REVIEWLook at 84403
9475db locking - Nothing happens when you click the "Create custom image" buttonnormalMedium+2.2 M3Elliot SmithIN PROGRESS REVIEW20
5319Need a test to verify firstboot postinst script ordernormalMedium+2.2 M3Francisco PedrazaNEW43
9652boot and install from USB shows warning message "(sdx): Volume was not properly unmounted...Please run fsck."majorMedium+2.2 M3Jianxun ZhangACCEPTEDNeeds to be backported to 1.8.3 2
9942patchwork: ensure patches are not marked as Accepted when a newer Series revision is modifiednormalMedium+2.2 M3Jose LamegoNEW2
9783Implement automated testing for meta-swupdnormalMedium+2.2 M3Joshua LockNEW5
9857sstate install doesn't preserve extended attributes on filesnormalMedium+2.2 M3Joshua LockIN PROGRESS IMPLEMENTATION3
9281Changing SDK_OS hits warnings unless you wipe tmpnormalMedium+2.2 M3Juro BystrickyACCEPTED1
9953patchtest-oe: some series cannot be parse correctly and no checks can be donenormalMedium+2.2 M3Leonardo Sandoval GonzalezNEW
9955patchtest-oe: string encoding error on some seriesnormalMedium+2.2 M3Leonardo Sandoval GonzalezNEW
9959patchtest-oe: the check for 'signed-off-by' format is failing on unicode namesmajorMedium+2.2 M3Leonardo Sandoval GonzalezNEW
8570problems with gdk-pixbuf and pango loading on multilibnormalMedium+2.2 M3Robert YangNEW2
9575Test SDK EXT failed on core-image-sato for MIPS architecturecriticalMedium+2.2 M3Robert YangNEW5
9577gen-lockedsig-cache fails when populating sdk ext on PPC architecturenormalMedium+2.2 M3Robert YangNEW3
9639cmake-native autodetects libidn-nativenormalMedium+2.2 M3Robert YangNEW
9932testimage/testexport: Extracting packages with symlinks failsnormalMedium+2.2 M3Mariano LopezACCEPTED2
9943userdel_sysroot_sstate() deletes only first user/groupnormalMedium+2.2 M3Mariano LopezIN PROGRESS REVIEW1
9499license.bbclass find_license_files does not process LICENSE_pn variables correctlynormalMedium+2.2 M3Markus LehtonenIN PROGRESS REVIEW1
9662patchdir fails silently if no trailing slash is presentnormalMedium+2.2 M3Markus LehtonenNEW1
8078useradd.bbclass: useradd_preinst not run when rebuilding on second MACHINEmajorMedium+2.2 M3Maxin B. JohnACCEPTED3
9455When I try to make a new project toaster cries "Fields missing: projectversion"normalMedium+2.2 M3Michael WoodIN PROGRESS IMPLEMENTATION4
8884Locked signature warning is shown even if package can be fetched from SSTATE_MIRRORSnormalMedium+2.2 M3Paul EggletonNEW1
9038extensible sdk - generates empty manifests/needs file with what is installednormalMedium+2.2 M3Paul EggletonNEW2
9083Extensible SDK: SDK installation ERROR: Unexpected tasks left over to be executednormalMedium+2.2 M3Paul EggletonIN PROGRESS REVIEW1
9626ERROR: core-image-sato-1.0-r0 do_testsdkext: Couldn't install the SDK EXT:normalMedium+2.2 M3Paul EggletonIN PROGRESS REVIEW
8642The "32" is a broken symlink in aarch64's mutilib SDKnormalMedium+2.2 M3Chen QiIN PROGRESS REVIEW3
9772musl libgcc_s.so.1 missing symbols on targetnormalMedium+2.2 M3Khem RajIN PROGRESS REVIEW
9991gcc6: qtbase5 compile error.normalMedium+2.2 M3Khem RajIN PROGRESS REVIEW
9740[PATCH] fetch: copy files with -HnormalMedium+2.2 M3Richard PurdieIN PROGRESS REVIEW
9902the tmp/cache can get corrupted and prevent buildingnormalMedium+2.2 M3Richard PurdieIN PROGRESS REVIEW
9104ffmpeg libraries are missing -dbg packagingnormalMedium+2.2 M3Ross BurtonNEW5
9287Failed to build nativesdk-glibc for qemumips and qemumips64 on Fedora 23 i686normalMedium+2.2 M3Ross BurtonNEW1
9554Add section for on-target debuggingnormalMedium+2.2 M3Ross BurtonNEW6 June 2016: Docs requesting some information2
9776RPM/SMART fail on qemuarmnormalMedium+2.2 M3Ross BurtonACCEPTED5
9369Extensible SDK: oe-selftest test does not test that update actually worksnormalMedium+2.2 M3Stephano CetolaIN PROGRESS DESIGN2
9491Enable explicit removal of support packages when not needednormalMedium+2.2 M3Stephano CetolaIN PROGRESS IMPLEMENTATION
9789systemd rootfs-postprocess command should check staticidsnormalMedium+2.2 M3Stephano CetolaACCEPTED
9793Toaster container solution should be extended to run on windows (and mac)normalMedium+2.2 M3Stephano CetolaACCEPTED
9815SSTATE_MIRRORS does not support http* with basic authenticationnormalMedium+2.2 M3Stephano CetolaIN PROGRESS DESIGN
8210Should be able to restart a crashed vnc servernormalMedium+2.2 M3Bill RandleNEW3
9285Failed to build gobject-introspection for qemumips64 on i686 hostsnormalMedium+2.2 M3Yi ZhaoWaitForUpstream1
8576QemuRunner logging for qemu start failure does not log anything to the console in oe-selftestmajorMedium+2.2 M4Francisco PedrazaNEW2
8578opkg-make-index skips some packages so the package index is not up to date during rootfs generationnormalMedium+2.2 M4Robert YangNEW5
9416rpm: tmpfile creation failsnormalMedium+2.2 M4Markus LehtonenACCEPTED3
9978Toaster is showing incorrect task dependency informationnormalMedium+2.2 M4Michael WoodNEW
9566devtool documentation is duplicated in dev and sdk manualsnormalMedium+2.2 M4Paul EggletonACCEPTED4
9620Update layer index to django 1.8 ltsnormalMedium+2.2 M4Paul EggletonIN PROGRESS IMPLEMENTATION
9667Image types in quick start guide should be appropriate and consistentnormalMedium+2.2 M4Scott RifenbarkACCEPTED2
9692QA check for #! interpreter should handle '/usr/bin/env something'normalMedium+2.2 M4Stephano CetolaIN PROGRESS DESIGN5
8879opkg-utils is built when build lib32-imagemajorMedium+2.3Robert YangIN PROGRESS IMPLEMENTATION5
9918Use bitbakes fetcher code to grab layers, do checkouts, etc.normalMedium+2.3Toaster default assigneeNEW
9522Documentation isn't cachablenormalMedium+Q3Michael HalsteadACCEPTED
 89       

Medium+ Enhancements by Owner !(Future,1.7)

IDSummary (109 tasks) SeverityPMilestoneAssigneeStatusWhiteboardE
 0       
Armin Kuster
9383Move to LSB 5enhancementMedium+2.2 M3Armin KusterNEW3
 1       
Alexander Kanavin
8584Enable building API documentationenhancementMedium+2.2 M3Alexander KanavinIN PROGRESS IMPLEMENTATION10
 1       
Aníbal Limón
8962AUH: Add support for meta-intelenhancementMedium+2.2 M2Aníbal LimónNEW3
9299Enable Tracing boot and process times in testing imagesenhancementMedium+2.2 M2Aníbal LimónIN PROGRESS REVIEW3
9678Include automated test execution and reporting in AutobuilderenhancementMedium+2.2 M2Aníbal LimónIN PROGRESS DESIGN6
9756Plan clean up and improvements for oeqaenhancementMedium+2.2 M3Aníbal LimónIN PROGRESS IMPLEMENTATION2
 4       
Belen Barros Pena
6640Customise BitBake and layer versions in a projectenhancementMedium+2.3Belen Barros PenaNEWGUI design pending7
 1       
Benjamin Esquivel
9682enable xml output in OeTest class for report consumersenhancementMedium+2.2 M2Benjamin EsquivelIN PROGRESS REVIEW5
6319Automated storage and graphing of build performance metricsenhancementMedium+2.2 M4Benjamin EsquivelNEW5
6862input subsystem testingenhancementMedium+2.3Benjamin EsquivelNEW5
 3       
Brendan Le Foll
9537recipetool: support node.js code outside of npmenhancementMedium+2.2 M3Brendan Le FollNEW
 1       
Bruce Ashfield
8179It should be possible to disable kernel features using config fragmentsenhancementMedium+2.2 M3Bruce AshfieldIN PROGRESS IMPLEMENTATION10
9466enhance kernel configuration audit to include reasons for missing configs, and required config checkingenhancementMedium+2.2 M3Bruce AshfieldIN PROGRESS IMPLEMENTATION7
 2       
Daniela Plascencia
9874patchtest-oe: check that patches are removed if these are removed from the SRC_URIenhancementMedium+2.2 M2Daniela PlascenciaACCEPTED2
9875patchtest-oe: in case upstream link change (SRC_URI), check that checksums flags also indicated this changeenhancementMedium+2.2 M2Daniela PlascenciaIN PROGRESS DESIGN
 2       
Ed Bartosh
9869Provide a per-target manifest of files which were, or would have been, producedenhancementMedium+2.2 M3Ed BartoshNEW
 1       
Plauchu Edwin
8480Extendable structure for test controller to support kinds of image flash methods and communication methods with DUTenhancementMedium+2.2 M2Plauchu EdwinNEW7
9132Toaster automated testing inclusion at the AutobuilderenhancementMedium+2.2 M3Plauchu EdwinIN PROGRESS IMPLEMENTATION5
9732Send email notifications for automated testing result eventsenhancementMedium+2.3Plauchu EdwinNEW5
 3       
Elliot Smith
9631add state Transitions to progress bar as well as build progress.enhancementMedium+2.2 M3Elliot SmithIN PROGRESS REVIEWGUI design available10
 1       
Francisco Pedraza
9871patchtest-oe: make sure description is present on patchesenhancementMedium+2.2 M2Francisco PedrazaIN PROGRESS REVIEW
4528boot time should be tracked for systemd and SysVinitenhancementMedium+2.2 M3Francisco PedrazaACCEPTED2
6359Include QA tests for kernel-dev manual tasksenhancementMedium+2.2 M3Francisco PedrazaACCEPTED10
9088Extensible SDK add tests for devtoolenhancementMedium+2.2 M3Francisco PedrazaACCEPTED3
9090extensible sdk test compatibility with sdkenhancementMedium+2.2 M3Francisco PedrazaACCEPTED1
 5       
Humberto Ibarra
4527create a Runtime performance test layer to enable runtime performance testsenhancementMedium+2.2 M2Humberto IbarraNEW3
5369Create test plan to do performance analysis of x32 runtimeenhancementMedium+2.2 M2Humberto IbarraNEW3
8938oe-selftest: refactor command line arguments so usage is simplerenhancementMedium+2.2 M2Humberto IbarraIN PROGRESS REVIEW3
9708oe-selftest --list-tests with options to control fields shownenhancementMedium+2.2 M2Humberto IbarraACCEPTED2
4144Runtime performance testingenhancementMedium+2.2 M3Humberto IbarraNEW2
5477Check for any performance degradations with gcc security flags enabledenhancementMedium+2.2 M3Humberto IbarraIN PROGRESS IMPLEMENTATION2
5478test build time performance degradations with gcc security flags enabledenhancementMedium+2.2 M3Humberto IbarraIN PROGRESS IMPLEMENTATION2
6296Add support for runtime performance tests to image_testsenhancementMedium+2.2 M3Humberto IbarraNEW2
 8       
Jianxun Zhang
6362Runtime machine configurationenhancementMedium+2.2 M3Jianxun ZhangIN PROGRESS REVIEWwork post 8761 10
9707Systemd-boot: Update documents for new EFI bootloaderenhancementMedium+2.2 M3Jianxun ZhangACCEPTED4
 2       
jingwang
8530runexported.py parameter support for: -m <machine arch>enhancementMedium+2.2 M3jingwangIN PROGRESS IMPLEMENTATION1
8531runexported.py parameter support for: -f <manifest>enhancementMedium+2.2 M3jingwangNEW
8533runexported.py parameter support for: -x <xunit>enhancementMedium+2.2 M3jingwangNEW
 3       
Jose Lamego
7654patchwork: ensure superseded patches are marked as suchenhancementMedium+2.2 M2Jose LamegoIN PROGRESS REVIEW2
8714Patchwork frontend page for incoming patch testingenhancementMedium+2.2 M2Jose LamegoNEWGUI design pending6
8715Update patchwork / build status page on patch test build completionenhancementMedium+2.2 M2Jose LamegoACCEPTED2
8716Build summary page for incoming patch testingenhancementMedium+2.2 M2Jose LamegoNEWGUI design pending4
8717patchwork: keep build page up-to-date with important patch status changesenhancementMedium+2.2 M2Jose LamegoNEW2
 5       
Jose Perez C
9706Systemd-boot: Create test harness in OEenhancementMedium+2.2 M2Jose Perez CIN PROGRESS REVIEW3
7376oe-selftest doesn't run lib/oe/tests/*enhancementMedium+2.2 M4Jose Perez CIN PROGRESS DESIGN3
 2       
Joshua Lock
8548Document best practises/style guide for selftest tests and update testsenhancementMedium+2.2 M3Joshua LockNEW2
8699offer a way to use sstate-object hashes as dependencies of builds/packagesenhancementMedium+2.2 M3Joshua LockACCEPTED4
9449[meta-swupd] Add libarchive backend to swupd-server to improve runtime of do_swupd_updateenhancementMedium+2.2 M3Joshua LockIN PROGRESS IMPLEMENTATION10
9538Review common security hardening flags and expand security_flags.incenhancementMedium+2.2 M3Joshua LockNEW10
 4       
Jussi Kukkonen
6707Add ptest for curlenhancementMedium+2.3Jussi KukkonenNEW3
 1       
Leonardo Sandoval Gonzalez
9244patchtest-oe: Create tests to validate recipes, classes or config filesenhancementMedium+2.2 M2Leonardo Sandoval GonzalezACCEPTED5
8433Add test for package postinstsenhancementMedium+2.2 M3Leonardo Sandoval GonzalezNEW4
8534need export manifest files to SDK package under /conf/test/ folders of every layerenhancementMedium+2.2 M3Leonardo Sandoval GonzalezIN PROGRESS REVIEW15
8493Automate manual BSP test casesenhancementMedium+2.3Leonardo Sandoval GonzalezNEW5
8505Add Bluetooth testing suiteenhancementMedium+2.3Leonardo Sandoval GonzalezNEW5
8506Add WiFi testing suiteenhancementMedium+2.3Leonardo Sandoval GonzalezNEW5
8507Add NFC testing suiteenhancementMedium+2.3Leonardo Sandoval GonzalezNEW5
 7       
Robert Yang
9391refactor syslinux.bbclass, grub-efi.bbclass and gummiboot.bbclassenhancementMedium+2.2 M2Robert YangNEW10
8318Avoid unnecessary package feed churn due to packages rebuildingenhancementMedium+2.2 M3Robert YangIN PROGRESS REVIEW20
 2       
Mariano Lopez
7515Add CVE testing toolenhancementMedium+2.2 M2Mariano LopezIN PROGRESS REVIEW10
8532runexported.py parameter support for: -a <tag>enhancementMedium+2.2 M2Mariano LopezIN PROGRESS REVIEW3
9766testimage: test import of tests from other layersenhancementMedium+2.2 M2Mariano LopezIN PROGRESS REVIEW1
8535export the test scripts under all layers' ./lib/oeqaenhancementMedium+2.2 M3Mariano LopezNEW15
 4       
Mark Hatle
9675Replacing/updating smartpm/createrepoenhancementMedium+2.3Mark HatleNEW
 1       
Markus Lehtonen
9338Support building optimised Python (with profile-opt make target)enhancementMedium+2.2 M3Markus LehtonenNEW7
9377Enable automated build performance testing in AutobuilderenhancementMedium+2.2 M3Markus LehtonenACCEPTED5
9624build-perf-test: store test results in GitenhancementMedium+2.2 M3Markus LehtonenNEW1
9625build-perf-test: re-organize test output dataenhancementMedium+2.2 M3Markus LehtonenNEW1
 4       
Michael Wood
8132Implement deleting custom imagesenhancementMedium+2.2 M3Michael WoodNEWGUI design available4
9387Extensible SDK: add image customisation functionalityenhancementMedium+2.2 M3Michael WoodNEW5
9519Consolidate used API into it's own viewenhancementMedium+2.2 M3Michael WoodIN PROGRESS IMPLEMENTATION10
 3       
Paul Eggleton
6437Document how to set up the Yocto Project for production workenhancementMedium+2.2 M3Paul EggletonACCEPTED2
7683Provide means of turning a recipe change into a bbappendenhancementMedium+2.2 M3Paul EggletonNEW4
8657extensible SDK: improve handling for sanity checksenhancementMedium+2.2 M3Paul EggletonNEW1
9679Add a small section on dependencies in the Writing a New Recipe sectionenhancementMedium+2.2 M3Paul EggletonACCEPTED
9751Extensible SDK: add mode to include toolchain by defaultenhancementMedium+2.2 M3Paul EggletonIN PROGRESS REVIEW
6432Document an example SDK usage workflowenhancementMedium+2.2 M4Paul EggletonACCEPTED2
7555make oe-init-build-env-memres default instead of oe-init-build-envenhancementMedium+2.3Paul EggletonNEW3
 7       
Chen Qi
8880Need better allarch multilib sanity or automated QA testsenhancementMedium+2.2 M3Chen QiACCEPTED5
9894Investigate porting smartpm, createrepo to python3enhancementMedium+2.2 M3Chen QiACCEPTED
 2       
Randy Witt
9004Produce container image providing extensible SDKenhancementMedium+2.2 M3Randy WittACCEPTED4
9502Add a way to build container images using oe-coreenhancementMedium+2.2 M3Randy WittIN PROGRESS IMPLEMENTATION3
9589Create a script for consuming a "build descriptor"enhancementMedium+2.2 M3Randy WittNEW5.34
 3       
Richard Purdie
9037Consider alternate methods for maintain Yocto releases after 1yrenhancementMedium+2.2 M2Richard PurdieNEW1
9737[PATCH] ui/knotty: give out start time of taskenhancementMedium+2.2 M2Richard PurdieNEW
9738[PATCH] fetcher: allow git+<protocol>: syntaxenhancementMedium+2.2 M2Richard PurdieNEW
6428Improve the ability to isolate changes that have caused a rebuildenhancementMedium+2.2 M3Richard PurdieNEW5
 4       
Ross Burton
6803Comprehensive large file supportenhancementMedium+2.2 M3Ross BurtonNEW5
8851Add bashism checks for shell script functionsenhancementMedium+2.2 M3Ross BurtonIN PROGRESS IMPLEMENTATION5
9261Can't distinguish between delayed and failed postinstenhancementMedium+2.2 M3Ross BurtonNEW3
 3       
Scott Rifenbark
9481Add example to "5.23. Debugging With the GNU Project Debugger (GDB) Remotely"enhancementMedium+2.2 M4Scott RifenbarkIN PROGRESS DESIGN29 June 2016: IN PROGRESS DESIGN2
 1       
Stephano Cetola
9342Vet subprocess callsenhancementMedium+2.2 M3Stephano CetolaACCEPTED2
9787create selftest for useradd-staticidsenhancementMedium+2.2 M3Stephano CetolaACCEPTED
 2       
Sujith H
9911Import a layer that points to a directory instead of a Git repositoryenhancementMedium+2.2 M3Sujith HACCEPTEDGUI design available
9912Build a layer that points to a directory instead of a Git repositoryenhancementMedium+2.2 M3Sujith HNEW
9913Switch imported layers between directories and Git repositoriesenhancementMedium+2.2 M3Sujith HNEWGUI design available
9925Support building non-Git layers with ToasterenhancementMedium+2.2 M3Sujith HNEW
 4       
Tim Orling
4209Extend our developer experience to enable system and app development on Windows or MacOSenhancementMedium+2.2Tim OrlingNEWThis is a placeholder bug for Eclipse for non Linux platform bug, the estimate will be reflected in the blocking bugs25
7820Replace Hob with Toaster in EclipseenhancementMedium+2.2Tim OrlingIN PROGRESS IMPLEMENTATION10
9907eclipse-poky should support the latest Neon 4.6 release of EclipseenhancementMedium+2.2 M3Tim OrlingIN PROGRESS IMPLEMENTATION3
9908eclipse-poky builds have a LOT of warningsenhancementMedium+2.2 M3Tim OrlingIN PROGRESS IMPLEMENTATION1
 4       
Toaster default assignee
6238delete projects/builds through the toaster UIenhancementMedium+2.2 M3Toaster default assigneeNEWGUI design available2
9915Show all layer revisions supported by Toaster, not just the ones compatible with the projectenhancementMedium+2.3Toaster default assigneeNEWGUI design pending
9895Provide UI to allow local layers to be published to layerindex.enhancementMedium+---Toaster default assigneeNEW
 3       
Bill Randle
8724Automate information collection for runtime errorsenhancementMedium+2.2 M3Bill RandleIN PROGRESS DESIGN410
9450Add automated runtime tests that use the musl libc rather than glibcenhancementMedium+2.2 M3Bill RandleNEW2
9460Provide a way to automate testing of meta-mingw and meta-darwin layers.enhancementMedium+2.2 M3Bill RandleNEW3
9727Add autobuilder support to build eSDK sstate objectsenhancementMedium+2.2 M3Bill RandleACCEPTED5
9940autobuilder will need an eclipse-poky recipe for the Neon branchenhancementMedium+2.2 M3Bill RandleNEW
 5       

Medium Bugs by Owner !(Future,1.7)

IDSummary (421 tasks) SeverityPMilestoneAssigneeStatusWhiteboardE
 0       
Armin Kuster
9601meta-qt5 Krogoth Branch Building Error During 'do_qa_staging'normalMedium2.1.1Armin KusterNEW
 1       
Alejandro del Castillo
8163opkg don't resume big upgrades (old issue #17)normalMedium1.0Alejandro del CastilloNEW
8165[libsolv] opkg_list_upgradable_cmd() does not work with an external solver enabled.normalMedium---Alejandro del CastilloNEW
 2       
Alejandro Hernandez
8613udev-extraconf: automount does not work with systemd >= 219normalMedium1.8.3Alejandro HernandezIN PROGRESS REVIEWCheck 2.0 also
9759python-2.7.9-r1 do_install failing (meta-intel [minnowboard])criticalMedium1.8.3Alejandro HernandezNEW
8730separate code generating python manifest file from manifest information and improve the manifest generationnormalMedium2.2 M3Alejandro HernandezNEW4
 3       
Alexander Kanavin
6972breaks build of software using cmake packages due to hardcoded pathsnormalMedium2.2Alexander KanavinNEW1
7142cmake.bbclass fails when rebuilding after MACHINE changesnormalMedium2.2Alexander KanavinNEW3
9486security_flags.inc has many exception packages compiled without -PIE security flagnormalMedium2.2Alexander KanavinIN PROGRESS REVIEW5
 3       
Aníbal Limón
8667populate_sdk task fails when Debian packaging used in FIDOnormalMedium1.8.3Aníbal LimónACCEPTED3
9349Jethro build fails for core-image-x11 with package_debnormalMedium2.0.3Aníbal LimónIN PROGRESS DESIGN2
9700Add layer and bitbake information to error reportsenhancementMedium2.2Aníbal LimónNEWGUI design pending5
8727fetcher: should not log errors but pass them for handlingnormalMedium2.2 M2Aníbal LimónNEW2
9602Run automated tests on alternative C librariesnormalMedium2.2 M2Aníbal LimónNEW2
7494AUH: Parallelize running bitbake inside AUH scriptenhancementMedium2.2 M3Aníbal LimónNEW5
7557distrodata/distro_check should use BPNenhancementMedium2.2 M3Aníbal LimónNEW2
7588devtool: improve devtool build outputenhancementMedium2.2 M3Aníbal LimónNEW5
8156lib/bb/fetch2/svn.py should support latest_versionstring()enhancementMedium2.2 M3Aníbal LimónNEW1
8735AUH: Use tinfoil instead of parse the recipe itselfenhancementMedium2.2 M3Aníbal LimónNEW5
 10       
Belen Barros Pena
7744Improve messaging in empty states when Toaster does not have any layer informationenhancementMedium2.2 M3Belen Barros PenaNEWGUI design pending3
8034typeahead search cneeds words to indicate it is constrained to the added layers.normalMedium2.2 M3Belen Barros PenaNEW2
9611Under Project->Bitbake variable, We disallow variables with a '/' in themnormalMedium2.2 M3Belen Barros PenaNEW
9839The "clear search" button on the – "Add | Remove packages table" - does not clearnormalMedium2.2 M3Belen Barros PenaNEW
9936The "Add layer" button in the import layer page is always disablednormalMedium2.2 M3Belen Barros PenaNEW
9832(Tasks executed) and (Tasks not executed) link in build summary dont query any task when clicking on themnormalMedium2.2 M4Belen Barros PenaNEW
6233Design model for project owner / userenhancementMedium2.3Belen Barros PenaACCEPTEDGUI design pending4
6701Provide an option to select layers from different branches within a Toaster projectenhancementMedium2.3Belen Barros PenaNEWGUI design pending7
9812Add hints to project configuration page that recipes may overwrite or modify settings during the buildnormalMedium2.3Belen Barros PenaNEW
 9       
Benjamin Esquivel
9921oe-selftest naming test guidelinesnormalMedium2.3Benjamin EsquivelNEW3
9956report tool: create a DB layout for storing the resultsenhancementMedium2.3Benjamin EsquivelNEW
9957report tool: create an input service that feed results to the DBenhancementMedium2.3Benjamin EsquivelNEW
9958report tool: a web interface for viewing test resultsenhancementMedium2.3Benjamin EsquivelNEWGUI design pending
 4       
Brendan Le Foll
9982npm.bbclass install function will package patches directorynormalMedium2.2Brendan Le FollNEW
 1       
brian avery
7972lsof needed by start/stop toaster script but not needed on system to run Yocto builds.normalMedium2.2brian averyNEW2
8189Variable history shows full paths to files inside the /bitbake directorynormalMedium2.2brian averyNEW2
9593Enable workspace folder to be changedenhancementMedium2.2brian averyNEW
9621ostro.layers not copied from conf to workspacenormalMedium2.2brian averyNEW
9570Need a simple way of configuring Zephyr development environment at start of docker sessionnormalMedium2.2 M2brian averyACCEPTED
 5       
Bruce Ashfield
9656NFS boot failed due No working init found kernel panic on qemunormalMedium1.8.3Bruce AshfieldNEW
7096Document how to use initramfs featuresenhancementMedium2.2Bruce AshfieldIN PROGRESS DESIGN2
96094.1.x: musb fails to compilenormalMedium2.2Bruce AshfieldWaitForUpstream
9805Signing keys not available when signing out-of-tree kernel modulesnormalMedium2.2Bruce AshfieldNEW
9854Kernel hangs on LTP cgroup testsnormalMedium2.2Bruce AshfieldNEW
6022kernel-dev: How do I know which features are available for KERNEL_FEATURES ?enhancementMedium2.2 M3Bruce AshfieldIN PROGRESS DESIGN COMPLETE2
6630linux-yocto: kernel-dev package does not include target arch scripts binariesenhancementMedium2.2 M3Bruce AshfieldIN PROGRESS IMPLEMENTATION3
7418Perf/kernel-devsrc racenormalMedium2.2 M3Bruce AshfieldNEEDINFOWaiting for 4.7 release3
7646KBUILD_DEFCONFIG does not work if config file is created as a result of patch to be appliednormalMedium2.2 M3Bruce AshfieldIN PROGRESS IMPLEMENTATION3
8289kernel_configme step should use "oldnoconfig" instead of "allnoconfig" when silently upgrading user defconfignormalMedium2.2 M3Bruce AshfieldIN PROGRESS IMPLEMENTATION4
8743configme --allnoconfig breaks defconfig generated with kconfig / make savedefconfignormalMedium2.2 M3Bruce AshfieldIN PROGRESS IMPLEMENTATION3
8970test_kernel_module fails with AssertionError: 137 != 0 : cd /usr/src/kernel && make scriptsnormalMedium2.2 M3Bruce AshfieldACCEPTED5
9125arm64 dmesg test fails show dmi Firmware registration failednormalMedium2.2 M3Bruce AshfieldACCEPTED2
6767kernel version mismatched on some BSPsminorMedium2.2 M4Bruce AshfieldIN PROGRESS IMPLEMENTATION2
9069perf: missing python modules for scripts in 'perf report'normalMedium2.2 M4Bruce AshfieldIN PROGRESS REVIEW3
9813Strange kernel image for qemumips and qemumips64 in deploy directorynormalMedium2.2 M4Bruce AshfieldACCEPTED
3420Audit *-standard.scc and move non-hardware items up into standard.sccenhancementMedium2.3Bruce AshfieldIN PROGRESS DESIGN6
 17       
California Sullivan
9202[Test Case 898] Piglit 3D testing NUC (6i5SYH) s getting stuck when running script.normalMedium2.2California SullivanWaitForUpstream3
9267test_parselogs (oeqa.runtime.parselogs.ParseLogsTest) failed on NUC 6i5SYH, firmware load for i915/skl_guc_ver4.bin failednormalMedium2.2California SullivanACCEPTED3
9406dmesg test_parseLogs failed corei7-64 on NUC error BAR 14 and 15normalMedium2.2California SullivanACCEPTED2
9525Make install prompt available on all consolesenhancementMedium2.2California SullivanNEW4
95874.1.x: gpio-pca953x.c fails to compile without CONFIG_ACPInormalMedium2.2California SullivanNEW
 5       
Daniel Istrate
8332Add a broken recipe for testing purposesenhancementMedium2.2Daniel IstrateNEW2
 1       
David Reyna
8037External link to recipe file links to non-existing page when recipe information comes from a buildnormalMedium2.2David ReynaIN PROGRESS IMPLEMENTATION5
 1       
dengke
8810Some strace ptests failnormalMedium2.2dengkeACCEPTED3
3388perf: enable man pages for basic 'help' functionalitynormalMedium2.2 M3dengkeACCEPTED2
6120perf top command does not work on QemuPPCnormalMedium2.2 M3dengkeACCEPTED5
 3       
Ed Bartosh
7973stopping toaster kills ALL django apps running on the machine.normalMedium2.2Ed BartoshACCEPTED2
8719Ensure bootable images can be supported by wic for all reference BSPsenhancementMedium2.2Ed BartoshIN PROGRESS DESIGN
8806Refactor localhostbecontrollernormalMedium2.2Ed BartoshNEW20
8886Toaster thinks do_shared_workdir is a shared state tasknormalMedium2.2Ed BartoshNEW3
8918Change the way we handle queued buildsnormalMedium2.2Ed BartoshNEW
9076The detection of the image type is incorrectly matching a wrong typenormalMedium2.2Ed BartoshIN PROGRESS REVIEW3
9518Rationalise the directory structure generated by ToasterenhancementMedium2.2Ed BartoshNEW
9346Rename COMPRESS_CMD_* to IMAGE_POSTPROCESS_*?enhancementMedium2.2 M3Ed BartoshIN PROGRESS REVIEW1
9852Use the eventreplay mechanism for testingenhancementMedium---Ed BartoshACCEPTED3
 9       
Plauchu Edwin
8200Add acl to default DISTRO_FEATURES?enhancementMedium2.2 M2Plauchu EdwinNEW1
8400rrs: add the cause of an unknown recipe versionenhancementMedium2.2 M2Plauchu EdwinNEW3
9081RRS should respect DEFAULT_PREFERENCE when multiple versions of the same recipe are availablenormalMedium2.2 M2Plauchu EdwinIN PROGRESS DESIGN2
9204Cleanup should be made after testing smartnormalMedium2.2 M2Plauchu EdwinNEW1
7909RRS: Track patches and Upstream-Status informationenhancementMedium2.2 M3Plauchu EdwinNEW5
8133RRS should handle upstream repositories without version tagsenhancementMedium2.2 M3Plauchu EdwinIN PROGRESS DESIGNGUI design available2
8943add a function hook that would process upstream and recipe versionsenhancementMedium2.2 M3Plauchu EdwinNEW2
 7       
Elliot Smith
6618Make the layer name searchable and show item page when search returns only one resultenhancementMedium2.2 M3Elliot SmithIN PROGRESS REVIEW2
8188The variable history is missing the layer namenormalMedium2.2 M3Elliot SmithNEW10
8190The 'set in file' filters in the BitBake variables table seem to return the wrong informationnormalMedium2.2 M3Elliot SmithNEW6
9395Cleanly support unicode throughout ToasterenhancementMedium2.2 M3Elliot SmithNEW15
9494Custom images created from the build history pages fail to buildnormalMedium2.2 M3Elliot SmithNEW5
9530Arrows in directory structure do not expand directoriesnormalMedium2.2 M3Elliot SmithNEW2
9833There can be a Task and Recipes table of 0 columns when deselecting them on the "Edit Columns" buttonnormalMedium2.2 M3Elliot SmithIN PROGRESS REVIEW2
9836Project builds table and Software Recipes: Sorting does not reset to default when hiding column that is currently being used as the sorting criterianormalMedium2.2 M3Elliot SmithIN PROGRESS REVIEW3
9837When trying to Download task log it returns Page not found (404)normalMedium2.2 M3Elliot SmithIN PROGRESS REVIEW3
9952Impossible to access task details page for tasks with outcome "covered"normalMedium2.2 M3Elliot SmithIN PROGRESS IMPLEMENTATION4
9485Fix typeaheads for Bootstrap 3normalMedium2.2 M4Elliot SmithNEW4
9630Show tasks currently running as part of progress bar updateenhancementMedium2.2 M4Elliot SmithACCEPTEDGUI design pending5
9969Display target:task correctly on build dashboard (and elsewhere)normalMedium2.2 M4Elliot SmithACCEPTEDGUI design available3
9760Make it easier to set up your own derivative layer indexenhancementMedium2.3Elliot SmithNEW10
9879Enable search for recipes that inherit a specific classenhancementMedium2.3Elliot SmithNEW
9916Show git clone progress in most recent builds areaenhancementMedium2.3Elliot SmithNEW6
9971Toaster does not report progress while setscene tasks are runningnormalMedium---Elliot SmithACCEPTED5
 17       
Francisco Pedraza
8146ptest - some test cases are failing for aclnormalMedium2.2Francisco PedrazaNEW2
8502Store BSPs Firmware and HW info for BSP test casesenhancementMedium2.2Francisco PedrazaNEW2
8504Identify and add if needed BSP test cases specific to meta-intelenhancementMedium2.2Francisco PedrazaNEW5
 3       
Hongxu Jia
8832pTest - bash tests fail for 2.1_M1.rc1normalMedium2.2 M2Hongxu JiaNEW
7018archiver missing tasks between do_unpack and do_patchnormalMedium2.2 M3Hongxu JiaIN PROGRESS REVIEW3
7149rpm: print which pkgname for warningenhancementMedium2.2 M3Hongxu JiaNEW5
7600syslinux: port extX support patches to syslinux communityenhancementMedium2.2 M3Hongxu JiaIN PROGRESS IMPLEMENTATION15
8446fix .pyc/.pyo buildpaths issueenhancementMedium2.2 M3Hongxu JiaNEW5
8784IMAGE_LINGUAS did not support multilib correctlynormalMedium2.2 M3Hongxu JiaACCEPTED
9169add fix_buildpaths.bbclass to fix build pathenhancementMedium2.2 M3Hongxu JiaNEW
9896groff_1.18.1.4 do_compile failurenormalMedium2.2 M3Hongxu JiaNEW
6420Detect and error when required packages are not producedenhancementMedium2.2 M4Hongxu JiaNEW5
 9       
Humberto Ibarra
9563yocto-kernel script should use argparse instead of optparse libraryenhancementMedium2.2 M2Humberto IbarraACCEPTED5
9564yocto-layer script should use argparse instead of optparse libraryenhancementMedium2.2 M2Humberto IbarraACCEPTED5
9635buildhistory-diff script should use argparse instead of optparse libraryenhancementMedium2.2 M2Humberto IbarraACCEPTED5
9636wic script should use argparse instead of optparse libraryenhancementMedium2.2 M2Humberto IbarraACCEPTED5
 4       
Jeff Osier-Mixon
9734yoctoproject.org themes/coloring obstruct the readingnormalMediumQ3Jeff Osier-MixonNEW
 1       
Jianxun Zhang
5351genericx86 auth.err getty[615]: tcgetattr: Input/outputnormalMedium2.2Jianxun ZhangNEW2
9886systemd-boot: Support construct direct-boot image with sd-boot in wic and wksenhancementMedium2.2 M2Jianxun ZhangIN PROGRESS REVIEW
 2       
jingwang
8483Compatible to run generic pyunit test cases by test runnerenhancementMedium2.2 M3jingwangIN PROGRESS DESIGN
 1       
Jose Lamego
7823Convert Eclipse projects to Yocto recipes with devtoolenhancementMedium2.2 M2Jose LamegoIN PROGRESS DESIGNGUI design available1
7824Add functionality to modify existing Yocto recipes with devtoolenhancementMedium2.2 M2Jose LamegoACCEPTED5
8873Create an appropriate Yocto Project Workspace from an existing Eclipse projectenhancementMedium2.2 M2Jose LamegoNEW5
8874Create a new Yocto recipe from an existing Eclipse project using devtoolnormalMedium2.2 M2Jose LamegoNEW5
9389oeqa: split configuration from the codeenhancementMedium2.2 M2Jose LamegoIN PROGRESS DESIGN2
9390oeqa: don't write anything to local.conf or bblayers.confenhancementMedium2.2 M2Jose LamegoNEW10
8162patchwork: clear out the superseded and already merged patchesenhancementMedium2.2 M3Jose LamegoNEW4
 7       
Jose Perez C
8961sudoku-savant does not get downloaded correctlynormalMedium2.0.3Jose Perez CNEW3
6370QA/oe-selftest: add test suite for recipe testingenhancementMedium2.2Jose Perez CIN PROGRESS REVIEW10
7526add test for checking if fontcache is created inside an imageenhancementMedium2.2Jose Perez CNEW1
8087eglibc patch bugnormalMedium2.2Jose Perez CNEW2
9724Create a YP 2.2 test plan for package upgradesnormalMedium2.2Jose Perez CNEW5
9903Add more test cases for Systemd-bootenhancementMedium2.2 M3Jose Perez CNEW
9949oe-selftest needs to verify bberror etcenhancementMedium2.3Jose Perez CNEW
 7       
Joshua Lock
7040Support for /usr merge (à la systemd and Fedora)enhancementMedium2.2Joshua LockIN PROGRESS DESIGN5
9115Added packages filter seems to show the wrong package listnormalMedium2.2Joshua LockACCEPTED4
9224[meta-swupd] Try to speed up update generation by parallelising calls to swupd_* programs where possibleenhancementMedium2.2Joshua LockNEW3
9297Toaster: Simplify building extensible SDKenhancementMedium2.2Joshua LockNEWGUI design pending5
9322[meta-swupd] Improve the algorithm for determining previous versionenhancementMedium2.2Joshua LockNEW1.5
9527Implement initial support for a stateless OSenhancementMedium2.2Joshua LockIN PROGRESS DESIGN10
9539Resolve string formatting issues in busyboxnormalMedium2.2Joshua LockNEW3
9540Resolve string formatting issues in console-toolsnormalMedium2.2Joshua LockNEW1.5
9541Resolve string formatting issues in cmakenormalMedium2.2Joshua LockNEW2
9542Resolve string formatting issues in expectnormalMedium2.2Joshua LockNEW1.5
9543Resolve string formatting issues in gccnormalMedium2.2Joshua LockNEW4
9544Resolve string formatting issues in gettextnormalMedium2.2Joshua LockNEW1.5
9545Resolve string formatting issues in kexec-toolsnormalMedium2.2Joshua LockNEW1.5
9725add docstrings to functions in lib/bb/utils.py that are used in meta- files.normalMedium2.2Joshua LockACCEPTED1
9790Design a solution for using a package manager to develop and transitioning to swupd for productionnormalMedium2.2Joshua LockNEW
9859setcap doesn't worknormalMedium2.2Joshua LockNEW
9948"-fstack-protector-strong" seems unnecessary in SECURITY_LDFLAGSnormalMedium2.2Joshua LockNEW
9188[meta-swupd] Remove hard-coded paths from swupd-clientnormalMedium2.2 M2Joshua LockWaitForUpstream1
9858Make xattrs in images work [meta]enhancementMedium2.2 M2Joshua LockNEW
9187[meta-swupd] implement generic versions of the update helper scripts in oe-swupd-helpersnormalMedium2.2 M3Joshua LockNEW3
9192[meta-swupd] Support virtual images generated from a virtual recipenormalMedium2.2 M3Joshua LockNEW5
9511Provide support for swupd manifest includesenhancementMedium2.2 M3Joshua LockNEW5
9189[meta-swupd] Creates a lot of duplicate filesenhancementMedium2.2 M4Joshua LockNEW1
9612functions used in recipes and recipe examples (like bb.utils.contains) not documented.normalMedium2.2 M4Joshua LockACCEPTEDWaiting on 9725 (7/8/16)5
 24       
Juro Bystricky
3898kernel menuconfig unusablenormalMedium2.2Juro BystrickyWaitForUpstream
6278runqemu without /etc/resolv.confenhancementMedium2.2Juro BystrickyNEW3
8074Graphic display using Virtual Box differs from VMwarenormalMedium2.2Juro BystrickyIN PROGRESS REVIEW1
9442Please add virtio console to qemux86-64.confenhancementMedium2.2 M3Juro BystrickyIN PROGRESS DESIGN2
 4       
Jussi Kukkonen
9650Eject icon is displayed as "file" on SATO sdk NUC when plugging USBminorMedium1.8.3Jussi KukkonenNEW
9473bind: CVE-2016-2088 (jethro)majorMedium2.0.3Jussi KukkonenNEW0.5
6077piglit depends on libx11enhancementMedium2.2Jussi KukkonenACCEPTED2
6378libfakekey patch to allow shift-ed version of symbol not already in keymapnormalMedium2.2Jussi KukkonenNEW1
8586multilib build includes 32bit connman without good reasonnormalMedium2.2Jussi KukkonenIN PROGRESS REVIEW1
8643GTK+3 depends on libepoxy which depends on eglnormalMedium2.2Jussi KukkonenACCEPTED3
9350As a developer, I want a global variable exist for choosing the default SSL/TLS provider.enhancementMedium2.2Jussi KukkonenNEW4
9849libdrm autodetects dependenciesnormalMedium2.2 M3Jussi KukkonenNEW
7054Need remote profiler (sysprof or eclipse?)normalMedium2.3Jussi KukkonenACCEPTED2
 9       
Christopher Larson
6372Feature request: recipe hook for source tree preparationenhancementMedium2.2Christopher LarsonNEW
7670Proposal: make TOPDIR or BUILDDIR available to the devshellenhancementMedium2.2Christopher LarsonIN PROGRESS REVIEW
7671Feature request: integrate task-level exports supportenhancementMedium2.2Christopher LarsonNEW
7958Implement shallow git clone functionalityenhancementMedium2.2Christopher LarsonIN PROGRESS REVIEW2
 4       
Kevin Hao
9176Default u-boot script is not able boot from eMMC on BeagleBone BlacknormalMedium2.2Kevin HaoNEW1
 1       
Leonardo Sandoval Gonzalez
6128Incorrect wildcard unpack behaviour in fetchernormalMedium2.2Leonardo Sandoval GonzalezNEW2
6129Local directories unpack to a different location than local filesnormalMedium2.2Leonardo Sandoval GonzalezNEW2
6926Create yocto-bsp testsuiteenhancementMedium2.2Leonardo Sandoval GonzalezNEW15
7202Test for linux-dummyenhancementMedium2.2Leonardo Sandoval GonzalezIN PROGRESS REVIEW1
9693oeqa/selftest/recipetool: runCmd's output is populated with previous outputminorMedium2.2Leonardo Sandoval GonzalezACCEPTED2
9308patchtest: improve signal handling when the process is interruptedenhancementMedium2.2 M2Leonardo Sandoval GonzalezACCEPTED1
7724useradd.bbclass users cannot be safely referred to by dependent recipes due to sstate-induced race with base-passwdmajorMedium2.2 M3Leonardo Sandoval GonzalezACCEPTEDTC needed7
8676devtool: extend oe-selftest testing for devtool upgradeenhancementMedium2.2 M3Leonardo Sandoval GonzalezACCEPTED2
8919Code coverage: add ability to create coverage-based test exclusion reportsenhancementMedium2.2 M3Leonardo Sandoval GonzalezNEW6
8921Code coverage: add ability to create missing 'coverage area' reportsenhancementMedium2.2 M3Leonardo Sandoval GonzalezNEW5
9927yocto-bsp: listing properties stdout and data send to -o option should be the samenormalMedium2.2 M3Leonardo Sandoval GonzalezNEW
9928yocto-bsp: logical if statements should be avoided in json return by list subcommandnormalMedium2.2 M3Leonardo Sandoval GonzalezNEW
3276PulseAudio isn't testedenhancementMedium2.3Leonardo Sandoval GonzalezNEW3
5399Sharing PR server between builders with different metadataenhancementMedium2.3Leonardo Sandoval GonzalezNEW9
8455Add tests to empty imageminorMedium2.3Leonardo Sandoval GonzalezNEW3
9070Add test that locales are workingenhancementMedium2.3Leonardo Sandoval GonzalezNEW1
9080Autobuilder/oe-selftest: Have a way to specify a which oe-self tests get run on a forced AB jobnormalMedium2.3Leonardo Sandoval GonzalezNEW2
9085Build QA Warnings: add a test for unlisted dependenciesnormalMedium2.3Leonardo Sandoval GonzalezNEW2
9129Enhance Test Suite scanning and executionenhancementMedium2.3Leonardo Sandoval GonzalezNEW4
9140Eclipse plugin testing enable work on other distrosenhancementMedium2.3Leonardo Sandoval GonzalezNEW3
9930o-selftest: add a coverage subcommand to handle coverage related tasksenhancementMedium2.3Leonardo Sandoval GonzalezNEW
9931oe-selftest: Increase organization of codeenhancementMedium2.3Leonardo Sandoval GonzalezNEW
9944patchtest-oe: check that patch was sent to the correct mailing listenhancementMedium2.3Leonardo Sandoval GonzalezNEW
9945patchtest-oe: check pull request series against git repositoryenhancementMedium2.3Leonardo Sandoval GonzalezNEW
9946patchtest: must be able to test the series on every branch specified on mbox summaryenhancementMedium2.3Leonardo Sandoval GonzalezNEW
9960patchtest-oe: implement 'selftest' validation patches for the test suiteenhancementMedium2.3Leonardo Sandoval GonzalezNEW
9979patchtest: provide a command line argument to list the discovered test casesenhancementMedium2.3Leonardo Sandoval GonzalezNEW
 27       
Libertad
8497Continuous Toaster exploratory testingenhancementMedium2.2LibertadNEW
9484Port QA UI tests to Toaster's Django+Selenium frameworknormalMedium2.2LibertadNEW25
9808Create selenium tests for project dashboard pagenormalMedium2.2LibertadNEW
 3       
Robert Yang
7459Implement the use of host USB devices on Linux for qemu machinesenhancementMedium2.2Robert YangNEW3
9404Smart will remove RECOMMENDS during a remove commandnormalMedium2.2 M2Robert YangNEW3
9408create-pull-request: auto push the branch if not presentenhancementMedium2.2 M2Robert YangNEW3
9409create-pull-request: add the ability to read env varenhancementMedium2.2 M2Robert YangNEW2
9410create-pull-request: automatically add the subject when there is only one patchenhancementMedium2.2 M2Robert YangNEW2
9495Can't boot efi image (iso or vmdk) in virtualboxnormalMedium2.2 M2Robert YangNEW5
4827runqemu shouldn't hard-code machine knowledgeenhancementMedium2.2 M3Robert YangIN PROGRESS IMPLEMENTATION15
7610[Multilib] Can't install 64bit packages to 32bit rootfsenhancementMedium2.2 M3Robert YangACCEPTED10
7984RPM backend does not honor package overrides for PACKAGE_ARCHnormalMedium2.2 M3Robert YangNEW5
8740LTP and LSB NG casesnormalMedium2.2 M3Robert YangIN PROGRESS REVIEW5
8967Need a way to cleanup DEPENDS and RDEPENDSenhancementMedium2.2 M3Robert YangNEW5
9048Failed to build iptables with extensible sdk on Fedora 23 i686normalMedium2.2 M3Robert YangACCEPTED5
9423devshell: export CONFIGUREOPTS to envenhancementMedium2.2 M3Robert YangNEW5
8592smart: make it can understand MLPREFIXenhancementMedium2.3Robert YangNEW10
 14       
Ming Liu
9233As a developer, I want initramfs bundled kernel could be installed into rootfsnormalMedium2.2Ming LiuIN PROGRESS REVIEW
 1       
Mariano Lopez
8650RRS: track ptest-enabled and potentially ptest-enabled statusenhancementMedium2.2 M2Mariano LopezACCEPTEDGUI design available3
9468Export Tests execution (Runexport.py) execution log needs improvementsenhancementMedium2.2 M2Mariano LopezNEW3
9770oe-selftest: test import of tests from other layersenhancementMedium2.2 M2Mariano LopezIN PROGRESS REVIEW2
9848testimage/testexport: support permissions and attributes for package installationenhancementMedium2.2 M2Mariano LopezIN PROGRESS DESIGN3
9294Error Reporting Tool: Add a 'solutions' relationship to the error entriesenhancementMedium2.2 M4Mariano LopezNEWGUI design pending3
 5       
Mark Hatle
8192python3.4.3 os.fork and os.waitpidminorMedium2.2Mark HatleNEW15
8779update-alternatives.bbclass automatic renaming doesn't happen in sysrootsnormalMedium2.2Mark HatleNEW
9208createrepo fails to correctly update the repodata, image generation then failsnormalMedium2.2Mark HatleNEW
 3       
Markus Lehtonen
9663do_populate_lic assumes that license basenames are uniquenormalMedium2.2Markus LehtonenNEW1
9782Add support for parallel gzip to package creationenhancementMedium2.2Markus LehtonenNEW
9827package.bbclass does not treat directory symlinks properly, leading to build failuresnormalMedium2.2Markus LehtonenIN PROGRESS IMPLEMENTATION
 3       
Maxin B. John
8380multiple pointer devices in qemunormalMedium2.2Maxin B. JohnACCEPTED2
8471ptest - some valgrind ptests fail on 2.0.rc1normalMedium2.2Maxin B. JohnACCEPTED2
9365Remove xtscal in preference of xinput-calibratorenhancementMedium2.2Maxin B. JohnACCEPTED
7436kbd build racenormalMedium2.2 M3Maxin B. JohnIN PROGRESS DESIGN1
9987sysprof has floating dependency on polkitnormalMedium2.2 M3Maxin B. JohnIN PROGRESS REVIEW
 5       
Michael Wood
9686"Compatible image recipes" view does not show proper label messagenormalMedium2.0.3Michael WoodNEW
7502Show image information if rootfs files are generatednormalMedium2.2Michael WoodNEW4
8051Importing layer fails silently if the layer name already existsnormalMedium2.2Michael WoodNEW2
8275Toaster: Suitable message and build box does not appear in build tab for a project with no buildsnormalMedium2.2Michael WoodNEW4
8456Add feature to add layers to Toaster from external sourceenhancementMedium2.2Michael WoodNEW
8953Toaster ignores the subdirectory when cloning imported layersnormalMedium2.2Michael WoodNEW
9582Replace toasterconf.json with Django fixturesenhancementMedium2.2Michael WoodNEW14
9586document and verify production setup for jenkins ci interactionnormalMedium2.2Michael WoodNEW
9641In the custom image recipe page, the last build information only shows successful buildsnormalMedium2.2Michael WoodNEW
9645The image recipe details does not show "Last build" informationnormalMedium2.2Michael WoodNEW
9651Error report web: Optimize searching timesenhancementMedium2.2Michael WoodNEW
9841Build button in image detail page does not start buildnormalMedium2.2Michael WoodIN PROGRESS REVIEW4
9846"Most built recipes" section does not show recipesnormalMedium2.2Michael WoodIN PROGRESS REVIEW4
9853Database refactoring to ease multiple configurationsnormalMedium2.2 M2Michael WoodIN PROGRESS IMPLEMENTATION10
9093Hide scary errors while importing recipe information from the layer indexnormalMedium2.2 M3Michael WoodIN PROGRESS REVIEW2
9097Remove validation messages when layers checkout directory and build directory are correctly setnormalMedium2.2 M3Michael WoodNEW4
9164The toaster-custom-images layer should not show like any other layer, and should not be removablenormalMedium2.2 M4Michael WoodNEWGUI design available4
 17       
Michael Halstead
9821create a configuration for a deployable autobuilder clusterenhancementMedium2.2Michael HalsteadNEW5
 1       
Otavio Salvador
8092Implementation of the function glXChooseFBConfig in the libGL.so does not match OpenGL documentationnormalMedium2.0.3Otavio SalvadorWaitForUpstream
 1       
Paul Eggleton
5057Conflict when building SDK for image containing dropbear and openssh-sftp-servernormalMedium2.2Paul EggletonACCEPTEDRelease Note4
6626Add an example for debugging software with the corresponding -dbg packagenormalMedium2.2Paul EggletonNEW1
6661devtool: add ability to submit changes for reviewenhancementMedium2.2Paul EggletonNEW10
7240Add declaration of image output file globs for ToasterenhancementMedium2.2Paul EggletonNEW1
7336buildhistory-diff reports recipe-wide changes per-subpackageenhancementMedium2.2Paul EggletonNEW1
7617devtool: detect need to re-run configureenhancementMedium2.2Paul EggletonNEW3
7636recipetool: basic spec file conversionenhancementMedium2.2Paul EggletonNEW
7852bitbake-layers layerindex-fetch doesn't respect branch (-b|--branch) optionnormalMedium2.2Paul EggletonIN PROGRESS DESIGN1
8278devtool: update compressed patches gracefullynormalMedium2.2Paul EggletonNEW0.5
8325devtool modify could handle patch failure more usefullyenhancementMedium2.2Paul EggletonNEW3
8582Error message not in log filenormalMedium2.2Paul EggletonNEW2
8703PATCHTOOL = git, triggers error user.name/user.email unsetnormalMedium2.2Paul EggletonIN PROGRESS IMPLEMENTATION0.5
8732Branch Support for BuildhistoryenhancementMedium2.2Paul EggletonNEW2
8840Failure to build 32 bit eSDK on a 64 bit hostenhancementMedium2.2Paul EggletonNEW4
9220buildhistory should track native recipesenhancementMedium2.2Paul EggletonNEW2
9360devtool: update-recipe ignores SRC_URI_appendnormalMedium2.2Paul EggletonNEW4
9479Extensible SDK breaks if python-dependent items added to TOOLCHAIN_HOST_TASKnormalMedium2.2Paul EggletonNEW2
9627devtool seems to mangle incorrectly the .bb file, when modifying the set of patches for a componentnormalMedium2.2Paul EggletonNEW
9638devtool changes the format of the SRC_URI unnecessarilynormalMedium2.2Paul EggletonNEW
9850Extensible SDK OE toolchain missing cross-gdbnormalMedium2.2Paul EggletonIN PROGRESS REVIEW
9882recipetool: specify which licenses are unknown when multiple are foundenhancementMedium2.2Paul EggletonIN PROGRESS REVIEW
9974Extensible SDK: reparse occurs on first devtool useminorMedium2.2Paul EggletonNEW
9986ETA reported for meta-swupd layer is off scale by 1 or 2 orders of magnitudenormalMedium2.2Paul EggletonIN PROGRESS REVIEW
8223bbwarn warnings during do_rootfs printed twiceminorMedium2.2 M3Paul EggletonIN PROGRESS IMPLEMENTATION1
9257extensible SDK: need an easy way of installing toolchainsenhancementMedium2.2 M3Paul EggletonIN PROGRESS REVIEW1
9753Document automatic layer priority calculationenhancementMedium2.2 M3Paul EggletonACCEPTED1
9972recipetool: setvar fails on empty bbappend filenormalMedium2.2 M3Paul EggletonIN PROGRESS REVIEW
7637devtool: add: interactive recipe creationenhancementMedium2.3Paul EggletonNEW5
 28       
Beth 'pidge' Flanagan
4183Reference material for how a user creates a build that meets GPL obligations given a reference BSP, standard rootfs/kernel...etc.enhancementMedium2.2 M4Beth 'pidge' FlanaganNEW2
 1       
Chen Qi
8939Lots of [host-user-contaminated] warningnormalMedium1.4.5Chen QiACCEPTED
5427Extend and tidy up layer sanity checkingenhancementMedium2.2Chen QiIN PROGRESS REVIEW5
6132Have persistent log data (/var/log)enhancementMedium2.2Chen QiIN PROGRESS REVIEW4
6700systemd's resolved conflicts with connmanenhancementMedium2.2Chen QiNEW2
7710devtool: deploy-target: interact with target packaging where availableenhancementMedium2.2Chen QiIN PROGRESS DESIGN10
6660Compare sstate packages within SDK publishing toolenhancementMedium2.2 M3Chen QiACCEPTED6
7800systemd.bbclass doesn't check for services in systemd/user/ directoryenhancementMedium2.2 M3Chen QiNEW3
9835Split container/vm related systemd services into a separate packageenhancementMedium2.2 M3Chen QiIN PROGRESS REVIEW
4420No init scripts in core-image-sato with systemd if 'sysvinit' is not in DISTRO_FEATURESenhancementMedium2.2 M4Chen QiIN PROGRESS IMPLEMENTATION10
6016CrossTap has issues on running scheduler script against qemuppcnormalMedium2.2 M4Chen QiNEW5
8812Some util-linux ptests failnormalMedium2.2 M4Chen QiACCEPTED2
8314warn when ALTERNATIVE_PRIORITY are the sameenhancementMedium2.3Chen QiNEW10
8834pTest - attr test fail ln -s fnormalMedium2.3Chen QiACCEPTED2
9053pTest - util-linux (NUC) failed tested on NUC 5425WYK for YP 2.1_M2.rc1normalMedium2.3Chen QiACCEPTED2
9055pTest - acl (NUC) failed tested on NUC 5425WYK for YP 2.1_M2.rc1normalMedium2.3Chen QiACCEPTED2
 15       
Khem Raj
8870uclibc fails to build occasionallynormalMedium2.2Khem RajNEW
9417Bring clang/llvm compiler infrastructure to OE-CoreenhancementMedium2.2Khem RajNEW
 2       
Randy Witt
8560xserver fails with xf86OpenConsole: Cannot open /dev/tty0 (No such file or directory)normalMedium2.2Randy WittNEW2
8789extensible SDK: command disable devtool subcommands based on capabilitiesenhancementMedium2.2Randy WittNEW2
8928extensible SDK - add a way to prepare the sdk for offline usageenhancementMedium2.2Randy WittNEW3
9173extensible sdk: Create a way that sstate will automatically be removed after setsceneenhancementMedium2.2Randy WittNEW1
9503Add a way to add docker metadata to container imagesenhancementMedium2.2Randy WittNEW3
9504knotty doesn't delete lines if the number of output lines is larger than then number of lines in the terminalnormalMedium2.2Randy WittNEW2
9595Extensible sdk: error early if tasks to be ran cannot be provided from sstatenormalMedium2.2Randy WittNEW
7552Generated SDK has "expect" headers in wrong locationnormalMedium2.2 M3Randy WittACCEPTED1
9922Need a webhook service for CROPS that allows us to kick off actions based on eventsnormalMedium2.2 M3Randy WittNEW
 9       
Randy MacLeod
7314Audit all recipes for proper CONFFILES assignmentenhancementMedium2.2Randy MacLeodNEW
 1       
Richard Purdie
5395Nativesdk postinstalls directory issues.normalMedium2.2Richard PurdieNEW5
7298packagegroups are not rebuilt when rdependency pkg name changesnormalMedium2.2Richard PurdieNEW5
7846devshell cannot be kept open across rebuildsenhancementMedium2.2Richard PurdieNEW1
7877Depending on the error found, inconsistent line reported.normalMedium2.2Richard PurdieNEW3
7879Depending on the name of a recipe, the build succeeds or fails.normalMedium2.2Richard PurdieNEW3
7960Feature Request: to enable poky to support building multilib native commandsenhancementMedium2.2Richard PurdieNEW5
8161Can't use "\" characters in SRC_URI entries - not even escapednormalMedium2.2Richard PurdieNEW2
8173Wrong dynamic loader because of missing -mfloat-abi=hard in LDFLAGS (in scons)normalMedium2.2Richard PurdieNEW2
8805Detect and warn people naming functions something_remove_somethingnormalMedium2.2Richard PurdieNEW1
8828pTest - lttng-tools tests fail for 2.1_M1.rc1normalMedium2.2Richard PurdieNEW3
9061git fetcher inconsistency for working with PREMIRRORS.normalMedium2.2Richard PurdieNEW5
9175Remove os.chdir from fetch/unpack logicenhancementMedium2.2Richard PurdieNEW5
9272BBCLASSEXTEND="cross" overrides do_install()normalMedium2.2Richard PurdieNEW1
9279Issue with PREFERRED_PROVIDER interaction with overridesnormalMedium2.2Richard PurdieNEW1
9762Add support for poisoning of variablesenhancementMedium2.2Richard PurdieNEW
9888uninative cannot find tarball when using "own-mirrors" and BB_NO_NETWORKnormalMedium2.2Richard PurdieNEW
8273openjade-native doesn't remove from sysroot correctlynormalMedium2.2 M3Richard PurdieIN PROGRESS DESIGN1
8554Support for self-contained "baremetal" CPU meta-layersenhancementMedium2.2 M3Richard PurdieIN PROGRESS REVIEW3
9865"inherit" invalid in .inc file when included in distro confignormalMedium2.2 M3Richard PurdieNEW
7950gcc-cross-canadian-i586 doesn't work PREFERRED_VERSIONnormalMedium2.2 M4Richard PurdieIN PROGRESS REVIEW2
3433Create Interactive bitbake commandline modeenhancementMedium2.3Richard PurdieNEW15
4143Support real-time logging when using bitbake interactivelyenhancementMedium2.3Richard PurdieNEW5
7985Variable typing support within BitBakeenhancementMedium2.3Richard PurdieNEW15
 23       
LiRongQing
7554Ownership issue in package contentsmajorMedium2.2LiRongQingACCEPTED
 1       
Ross Burton
9158Cannot build openjdk-8 on fido due to missing autotools patchnormalMedium1.8.3Ross BurtonNEW1
7010systemd-serialgetty cannot create a serial-getty@.service that is not enablednormalMedium2.2Ross BurtonNEWBackport to 1.7.31
8064ptest fails tracker bugnormalMedium2.2Ross BurtonNEW
8302sstate_create_package fails to chmod filenormalMedium2.2Ross BurtonNEW1
8430inaccurate 'du' usage in Image::_get_rootfs_sizeenhancementMedium2.2Ross BurtonACCEPTED1
8454archiver.bbclass does not create subfolder per licensenormalMedium2.2Ross BurtonNEW1
8593The head files of ncurses installing into sysroot seems different in multiple times compilationnormalMedium2.2Ross BurtonNEW2
8688busybox syslog not update-alternatives awarenormalMedium2.2Ross BurtonNEW2
9110Move some oe-pkgdata-util logic into lib/oeenhancementMedium2.2Ross BurtonNEW2
9119ptest fails tracker bug (Cont.)normalMedium2.2Ross BurtonNEW1
9171Consider limiting the scope of depchains to runtime depsnormalMedium2.2Ross BurtonNEW5
9207Need to fix prelink to iterate mulitlibsnormalMedium2.2Ross BurtonNEW4
9213Enable thumb for ARM buildsnormalMedium2.2Ross BurtonNEW1
9259The rpm database costs lots of disk space after install a packagenormalMedium2.2Ross BurtonNEW3
9288depexp does not show bitbake errorsnormalMedium2.2Ross BurtonNEW1
9880Support locale archivesenhancementMedium2.2Ross BurtonNEW
9883curl-native: invalid builtin ca-bundle path when restoring from sstatenormalMedium2.2Ross BurtonNEW
9889cvs is required to be installed on host to support cvs SRC_URInormalMedium2.2Ross BurtonNEW
7136Default PACKAGES value prevents packaging of prebuilt shared librariesnormalMedium2.2 M3Ross BurtonNEW1
6142we need general documentation on Systemd vs SysV related issuesenhancementMedium2.2 M4Ross BurtonACCEPTED1
3488Enable Mesa's llvmpipe?enhancementMedium2.3Ross BurtonACCEPTED2
5322Global DNS fallback mechanism not present in poky distroenhancementMedium2.3Ross BurtonACCEPTED3
 22       
Saul Wold
4389kernel: Remove "make scripts" requirement for module building from SDK/on targetenhancementMedium2.3Saul WoldACCEPTED5
5654Add EFI to qemux86 and qemux86-64enhancementMedium2.3Saul WoldWaitForUpstream5
9878feature request: secure boot layerenhancementMedium2.3Saul WoldNEW
 3       
Seebs
8447Host contamination in glibc-localesnormalMedium2.2SeebsACCEPTED1
 1       
Scott Rifenbark
9962Suggested additions to the --help output re. -v and -DenhancementMedium2.2Scott RifenbarkNEW
9899Add REMOVE_PKG_SUPPORT to variable referenceenhancementMedium2.2 M3Scott RifenbarkACCEPTED12 July 2016: IN PROGRESS REVIEW1
9988Suggested clarification of the STAGING_DIR_* glossary entriesenhancementMedium2.2 M3Scott RifenbarkIN PROGRESS REVIEW21 July 2016: IN PROGRESS REVIEW1
7546Streamline application development manualenhancementMedium2.2 M4Scott RifenbarkACCEPTED09 April 2015: ACCEPTED3
7718target:task syntax not mentioned in --helpminorMedium2.2 M4Scott RifenbarkIN PROGRESS REVIEW6 June 2016: IN PROGRESS REVIEW0.5
8596Document proper way of adding a userspace header for the kernelenhancementMedium2.2 M4Scott RifenbarkACCEPTED1
8631Fully document sysroot populationenhancementMedium2.2 M4Scott RifenbarkACCEPTED3
8909Mention standard fetcher options also in fetcher seaction (not only in SRC_URI in the glossary)enhancementMedium2.2 M4Scott RifenbarkNEEDINFO2
9001bootimg.bbclass does not ducument GRUB boot lodader supportnormalMedium2.2 M4Scott RifenbarkACCEPTED27 Jan 2016: NEEDINFO2
9553INHIBIT_PACKAGE_STRIP docs need to be expandednormalMedium2.2 M4Scott RifenbarkIN PROGRESS REVIEW6 June 2016: IN PROGRESS REVIEW1
9580Missing package dependency in quick start guide for FedoranormalMedium2.2 M4Scott RifenbarkIN PROGRESS REVIEW6 June 2016: ACCEPTED1
 11       
Tim Orling
9561[Mars] Minimum required Java version is 1.7 for Eclipse Mars (4.5)normalMedium2.1.1Tim OrlingIN PROGRESS REVIEW0.2
9649New Yocto Bitbake Commander Project: No error shown when invalid directory givennormalMedium2.1.1Tim OrlingNEW
9562[Neon] Minimum required Java version is 1.8 for Eclipse Neon (4.6)normalMedium2.2Tim OrlingIN PROGRESS IMPLEMENTATION0.2
9597swtbot initial implementation so that we can automate testing of the pluginenhancementMedium2.2Tim OrlingIN PROGRESS IMPLEMENTATION5
9615yocto-bsp: The design for the yocto-bsp wizard needs some workenhancementMedium2.2Tim OrlingNEW
9616yocto-bsp wizard sources the Build location folder every time the field loses focusnormalMedium2.2Tim OrlingNEW
9688powertop: "show pids in wakeups list" option fails with exit code 1normalMedium2.2Tim OrlingNEW
9697Yocto Project ADT Preferences : Failed to save values for new profilenormalMedium2.2Tim OrlingNEW1
9698Yocto Project ADT Preferences: Odd behavior of removal dialogs on Standard ProfileminorMedium2.2Tim OrlingNEW1
9703New eclipse project failing to reconfigure because of hyphens in the namenormalMedium2.2Tim OrlingNEW1
9838perf fails on eclipse, sending a weird command remotely to qemunormalMedium2.2Tim OrlingNEW
9840Bitbake Commander: populate button not working when creating new recipenormalMedium2.2Tim OrlingNEW
7819Support multi-image debuggingenhancementMedium2.3Tim OrlingNEW5
 13       
Toaster default assignee
9684"Edit Columns" Button on the Compatible layers view is missingnormalMedium2.0.3Toaster default assigneeNEW
9743builds: The search result of the content of the builds table is incorrectnormalMedium2.2Toaster default assigneeNEW
9418Support using existing OE setupsenhancementMedium2.3Toaster default assigneeNEW
9914For imported layers, remember the value of the last directory and the last Git repositoryenhancementMedium---Toaster default assigneeNEW
9924Prevent users from using HEAD as Git revision when importing layersenhancementMedium---Toaster default assigneeNEW
 5       
Todor Minchev
9590Cannot update Zephyr project configenhancementMedium2.2Todor MinchevNEW
9591Zephyr project configuration should allow kernel and app to be in different folder hierachiesenhancementMedium2.2Todor MinchevNEW
9799Ctrl-c does'nt stop the build for the ostro cli containernormalMedium2.2 M2Todor MinchevNEW
 3       
Tom Zanussi
9531Need a proper way to fix mismatched arch generated with bare-bone kernel recipenormalMedium2.2Tom ZanussiNEW
5520poky-tiny enhancementsenhancementMedium2.2 M3Tom ZanussiACCEPTEDOn Track for Initial Impl40
7477runqemu should support running poky tinyenhancementMedium2.2 M4Tom ZanussiNEEDINFO2
9451Document a cookbook procedure on how to change kernel versionnormalMedium2.2 M4Tom ZanussiNEEDINFONIR 7/82
 4       
Tracy Graydon
6683Produce a script to automate release preparation tasksmajorMedium2.2Tracy GraydonNEW3
8083Add n32 test case to autobuilder nightly-multilibenhancementMedium2.2 M2Tracy GraydonACCEPTED1
6287Release scripts for BSPs/images.enhancementMedium2.2 M3Tracy GraydonNEW5
7476Improve license manifest descriptionenhancementMedium2.2 M3Tracy GraydonNEW2
8158INCOMPATIBLE_LICENSES has unexpected results with GNU librariesnormalMedium2.2 M3Tracy GraydonNEW10
 5       
Tristan Van Berkom
9510gcc-cross-initial parallel make problem / build break (found on aarch64)normalMedium2.2 M3Tristan Van BerkomNEEDINFO2
 1       
Unassigned
9302Failed to start qemu with toolchain sysrootnormalMedium2.1.1UnassignedNEW
9362Failed to run and debug a project to qemux86 in EclipsenormalMedium2.1.1UnassignedNEW3
6234Implement model for project owner / userenhancementMedium2.3UnassignedNEW2
 3       
Vaduva Alexandru
7067Integrate 'grsecurity' package inside meta-cglenhancementMedium2.1Vaduva AlexandruNEW2
 1       
Bill Randle
6469Host system profiler tool.enhancementMedium2.2Bill RandleNEW10
8044Stop building lsb-qt3 imagesnormalMedium2.2Bill RandleNEW2
8760Autobuilder additional task log availabilityenhancementMedium2.2Bill RandleNEW2
9726Add support for autobuilder to create CROPS containersenhancementMedium2.2Bill RandleNEW10
9769Enable the capability to associate specific build step to specific worker in ABenhancementMedium2.2Bill RandleNEW5
7695Automated QA tests for the autobuilderenhancementMedium2.2 M2Bill RandleNEW5
8193add wiki reporting to public ABenhancementMedium2.2 M2Bill RandleNEW3
8841COPY_LIC_DIRS should use beginline and endline from LIC_FILES_CHKSUMenhancementMedium2.2 M2Bill RandleNEW1
9424systemd tmpfiles.d warnings (volatile, resolv.conf)minorMedium2.2 M2Bill RandleIN PROGRESS REVIEW1
9596Build "minimal" extensible SDK installers instead of "full" onesenhancementMedium2.2 M2Bill RandleNEW2
7568Create an image to run regular build tests for no-X11 caseenhancementMedium2.2 M3Bill RandleNEW3
7691Locking of branch/repoenhancementMedium2.2 M3Bill RandleNEW1
9018Extend existing AutoBuilder script to schedule buildsenhancementMedium2.2 M3Bill RandleACCEPTED3
9917autobuilder: Add ability to get worker informationnormalMedium2.2 M3Bill RandleNEW
9981Make Autobuilder workers get hostname dynamicallyenhancementMedium2.3Bill RandleNEW
 15       

Other High Bugs

IDSummary (21 tasks) SeverityPMilestoneAssigneeStatusWhiteboardE
9897[Krogoth] Failed to build pkgconfig-native on Fedora24normalHigh2.1.1Tim OrlingIN PROGRESS REVIEW2
4431Set up buildhistory-web for autobuilderenhancementHigh2.2 M2Michael HalsteadACCEPTED3
8648Automatic testing of incoming patchesenhancementHigh2.2 M2Leonardo Sandoval GonzalezIN PROGRESS REVIEWTesting in Progress10
8649Script to assemble patches for autobuilder testingenhancementHigh2.2 M2Leonardo Sandoval GonzalezIN PROGRESS IMPLEMENTATION15
9255Allow rootfs tasks to run in parallel with rpmenhancementHigh2.2 M2Stephano CetolaIN PROGRESS REVIEW0.5
9457patchtest: document deployment with isolation featuresenhancementHigh2.2 M2Leonardo Sandoval GonzalezNEW5
9961intel-quark: 4.4.14 does not compilenormalHigh2.2 M2Saul WoldNEWmeta-intel blocker
10020Handle oe-core layer version 9majorHigh2.2 M2Bill RandleNEW
5470bitbake-layers cannot be used with memory resident bitbake runningnormalHigh2.2 M3Paul EggletonIN PROGRESS IMPLEMENTATION5
5546Optimise away meta-oe X init mechanismenhancementHigh2.2 M3Maxin B. JohnACCEPTED2
7518Build multiple machines in the same bitbake invocationenhancementHigh2.2 M3Richard PurdieIN PROGRESS IMPLEMENTATION15
9131Prelink breaks fork IFUNCmajorHigh2.2 M3Mark HatleIN PROGRESS IMPLEMENTATION10
9298Autobuilder enable KVM on the cluster for x86, x86-64enhancementHigh2.2 M3Bill RandleNEW4.5
9588Create a method for describing builds and desired output. aka a build descriptorenhancementHigh2.2 M3Randy WittNEW5
9592Add a mechanism for creating build appliance as a container imageenhancementHigh2.2 M3Randy WittACCEPTED4
9904patchwork: show cover letter message in series created with pull requestenhancementHigh2.2 M3Jose LamegoNEW1
9929pseudo 1.8.1: potential performance regressionnormalHigh2.2 M3Joshua LockNEW
9941patchwork: ensure series are created for all submittersnormalHigh2.2 M3Jose LamegoNEW2
9954report tool: a communication mechanism for sending resultsenhancementHigh2.2 M3Benjamin EsquivelNEW
9975Analyse performance regression in 2.1majorHigh2.2 M3Ross BurtonNEW
5866Reproducible builds: identical binariesenhancementHigh2.3Juro BystrickyNEW5
 21       

Major or Critical

IDSummary (29 tasks) SeverityPMilestoneAssigneeStatusWhiteboardE
8946opkg install does not appear to fail on file overwritemajorUndecided0.4Alejandro del CastilloNEW
9990Yocto 1.7 for phycore-vybrid is unable to boot.criticalMedium+1.7.4Atul BansalNEW
9759python-2.7.9-r1 do_install failing (meta-intel [minnowboard])criticalMedium1.8.3Alejandro HernandezNEW
9473bind: CVE-2016-2088 (jethro)majorMedium2.0.3Jussi KukkonenNEW0.5
9847Intel Saddle Brook (Skylake-H) Krogoth image doesn't boot - hangs at Yocto screencriticalMedium+2.1.1Kartikey Rameshbhai ParmarNEW
6683Produce a script to automate release preparation tasksmajorMedium2.2Tracy GraydonNEW3
7554Ownership issue in package contentsmajorMedium2.2LiRongQingACCEPTED
9064do_unpack does not wipe old source treemajorMedium+2.2 M2Ross BurtonIN PROGRESS REVIEW1
9752ptest results do not include all the components testedmajorMedium+2.2 M2Plauchu EdwinNEW1
10020Handle oe-core layer version 9majorHigh2.2 M2Bill RandleNEW
9575Test SDK EXT failed on core-image-sato for MIPS architecturecriticalMedium+2.2 M3Robert YangNEW5
7724useradd.bbclass users cannot be safely referred to by dependent recipes due to sstate-induced race with base-passwdmajorMedium2.2 M3Leonardo Sandoval GonzalezACCEPTEDTC needed7
8078useradd.bbclass: useradd_preinst not run when rebuilding on second MACHINEmajorMedium+2.2 M3Maxin B. JohnACCEPTED3
9131Prelink breaks fork IFUNCmajorHigh2.2 M3Mark HatleIN PROGRESS IMPLEMENTATION10
9652boot and install from USB shows warning message "(sdx): Volume was not properly unmounted...Please run fsck."majorMedium+2.2 M3Jianxun ZhangACCEPTEDNeeds to be backported to 1.8.3 2
9959patchtest-oe: the check for 'signed-off-by' format is failing on unicode namesmajorMedium+2.2 M3Leonardo Sandoval GonzalezNEW
9975Analyse performance regression in 2.1majorHigh2.2 M3Ross BurtonNEW
9996Testimage is failing due missing "__init__.py" filemajorUndecided2.2 M3Mariano LopezIN PROGRESS REVIEW1
8576QemuRunner logging for qemu start failure does not log anything to the console in oe-selftestmajorMedium+2.2 M4Francisco PedrazaNEW2
8879opkg-utils is built when build lib32-imagemajorMedium+2.3Robert YangIN PROGRESS IMPLEMENTATION5
5331error play video via gstreamer with "mfw_isink"criticalMediumFutureOtavio SalvadorNEW
4155i.MX6: VPU plugins for GStreamer do not work with appsinkmajorMediumFutureOtavio SalvadorIN PROGRESS REVIEW
6806Smart failure when running bitbake over and overmajorMediumFutureRobert YangACCEPTED5
7945Toaster startup script assumes it's in a git repositorymajorMediumFutureToaster default assigneeNEW2
8391vncserver setup/tear down not concurrency safemajorMediumFuturebrian averyACCEPTED8
8947opkg conffile resolution cannot detect unmodified conffiles modified in upgraded packagemajorUndecided---Alejandro del CastilloNEW
9348Opkg requires root privileges for all operationsmajorUndecided---Alejandro del CastilloNEW
9993uninative loader: no error on checksum failuremajorUndecided---Paul EggletonNEW
10009ssh keys generated with invalid format core-image-sato-sdk-genericx86majorUndecided---Saul WoldNEW
 29       

NEEDINFO

IDSummary (12 tasks) AssigneeStatusSeverityPMilestoneWhiteboard
3953update compliance program formsJeff Osier-MixonNEEDINFOnormalMediumFuture
7418Perf/kernel-devsrc raceBruce AshfieldNEEDINFOnormalMedium2.2 M3Waiting for 4.7 release
7477runqemu should support running poky tinyTom ZanussiNEEDINFOenhancementMedium2.2 M4
8909Mention standard fetcher options also in fetcher seaction (not only in SRC_URI in the glossary)Scott RifenbarkNEEDINFOenhancementMedium2.2 M4
9300AFTER POWER ON, LED(D1)ON BUT LED(D2)flickerJohn 'Warthog9' HawleyNEEDINFOnormalMediumProduction Release
9392When running testimage test_syslog_startup_config failed getting test log string not found output grep: /var/log/test error messageFrancisco PedrazaNEEDINFOnormalUndecided---
9434Running testimage test_parselogs failed getting the following error message failed to retrieve link info, disabling eDP on Minnowboard Max 32 and 64California SullivanNEEDINFOnormalUndecided2.2
9451Document a cookbook procedure on how to change kernel versionTom ZanussiNEEDINFOnormalMedium2.2 M4NIR 7/8
9510gcc-cross-initial parallel make problem / build break (found on aarch64)Tristan Van BerkomNEEDINFOnormalMedium2.2 M3
9677Update bugzilla instance to 5.X or greaterMichael HalsteadNEEDINFOenhancementMediumFuture
9997oe-selftest: make available xmlrunner at the autobuilder workersMichael HalsteadNEEDINFOnormalUndecided2.2 M3
10002Suggested glossary entries for PATH and EXTRANATIVEPATHScott RifenbarkNEEDINFOnormalUndecided2.2 M3
 12      

Old Milestone

IDPStatusSeverityVersionProductSummary (674 tasks)  HardwareMilestone
8163MediumNEWnormalunspecifiedopkgopkg don't resume big upgrades (old issue #17) PC1.0
7641Medium+ACCEPTEDnormalunspecifiedOE-CoreCVE-2014-9365 python: failure to validate certificates in the HTTP client with TLS (PEP 476) All1.7.4
8028Medium+IN PROGRESS REVIEWnormal1.8OE-CoreGarbage in SDK manifest file PC1.7.4
9990Medium+NEWcritical1.7.4BSPsYocto 1.7 for phycore-vybrid is unable to boot. Other1.7.4
7814LowNEWnormal1.8BSPsWeston fails to build with core-image-weston on imx6qsabresd Other1.8.3
8613MediumIN PROGRESS REVIEWnormal1.8Runtimeudev-extraconf: automount does not work with systemd >= 219 All1.8.3
8667MediumACCEPTEDnormal1.8.2Package Management Issuespopulate_sdk task fails when Debian packaging used in FIDO PC1.8.3
9100LowNEWnormal1.8.2OE-Coreuclibc image fails to build PC1.8.3
9158MediumNEWnormal1.8.2OE-CoreCannot build openjdk-8 on fido due to missing autotools patch PC1.8.3
9650MediumNEWminor1.8.2Manual TestingEject icon is displayed as "file" on SATO sdk NUC when plugging USB[1]NUC1.8.3
9656MediumNEWnormal1.8.2BSPsNFS boot failed due No working init found kernel panic on qemu[2]PC1.8.3
9759MediumNEWcritical1.8.3OE-Corepython-2.7.9-r1 do_install failing (meta-intel [minnowboard]) PC1.8.3
8092MediumWaitForUpstreamnormal1.8BSPsImplementation of the function glXChooseFBConfig in the libGL.so does not match OpenGL documentation Other2.0.3
8961MediumNEWnormal2.0.1Automated Runtime Testingsudoku-savant does not get downloaded correctly[3]PC2.0.3
9349MediumIN PROGRESS DESIGNnormal2.0.1OE-CoreJethro build fails for core-image-x11 with package_deb All2.0.3
9473MediumNEWmajor2.0OE-Corebind: CVE-2016-2088 (jethro) All2.0.3
9684MediumNEWnormal2.0.2Toaster"Edit Columns" Button on the Compatible layers view is missing PC2.0.3
9686MediumNEWnormal2.0.2Toaster"Compatible image recipes" view does not show proper label message PC2.0.3
7067MediumNEWenhancement2.1LayersIntegrate 'grsecurity' package inside meta-cgl PC2.1
9302MediumNEWnormal2.1OE-CoreFailed to start qemu with toolchain sysroot PC2.1.1
9362MediumNEWnormal2.1OE-CoreFailed to run and debug a project to qemux86 in Eclipse PC2.1.1
9520Medium+IN PROGRESS DESIGNnormal2.1BSPstest_parselogs failed on udevd[342] inotify_add_watch /dev/loop when running test image[4]NUC2.1.1
9561MediumIN PROGRESS REVIEWnormal2.1Eclipse Plugin[Mars] Minimum required Java version is 1.7 for Eclipse Mars (4.5) PC2.1.1
9601MediumNEWnormal2.1Automated Build Testingmeta-qt5 Krogoth Branch Building Error During 'do_qa_staging' Other2.1.1
9649MediumNEWnormal2.2Eclipse PluginNew Yocto Bitbake Commander Project: No error shown when invalid directory given PC2.1.1
9847Medium+NEWcritical2.1System StartupIntel Saddle Brook (Skylake-H) Krogoth image doesn't boot - hangs at Yocto screen Other2.1.1
9897HighIN PROGRESS REVIEWnormal2.1.1OE-Core[Krogoth] Failed to build pkgconfig-native on Fedora24 PC2.1.1
824LowACCEPTEDenhancementunspecifiedMeta-yoctoUsability: Improve RRECOMMENDS warning messages for -dbg packages PC2.2
1018LowNEWnormal1.0Meta-yoctorunqemu script has bugs with the audio option PC2.2
1598LowACCEPTEDenhancementunspecifiedMeta-yoctoAdd remote layer support PC2.2
1989Medium+IN PROGRESS IMPLEMENTATIONminorunspecifiedBSPsDefault module selections need attention All2.2
3898MediumWaitForUpstreamnormal1.4Kernelkernel menuconfig unusable PC2.2
4209Medium+NEWenhancement1.5Eclipse PluginExtend our developer experience to enable system and app development on Windows or MacOS PC2.2
5057MediumACCEPTEDnormal1.4.1OE-CoreConflict when building SDK for image containing dropbear and openssh-sftp-server PC2.2
5351MediumNEWnormal1.5BSPsgenericx86 auth.err getty[615]: tcgetattr: Input/output PC2.2
5395MediumNEWnormal1.5BitBakeNativesdk postinstalls directory issues. PC2.2
5427MediumIN PROGRESS REVIEWenhancement1.6OE-CoreExtend and tidy up layer sanity checking All2.2
6077MediumACCEPTEDenhancement1.6OE-Corepiglit depends on libx11 All2.2
6128MediumNEWnormal1.6BitBakeIncorrect wildcard unpack behaviour in fetcher All2.2
6129MediumNEWnormal1.6BitBakeLocal directories unpack to a different location than local files All2.2
6132MediumIN PROGRESS REVIEWenhancement1.7OE-CoreHave persistent log data (/var/log) All2.2
6155LowNEWenhancement1.7OE-CoreMerge testimage-auto into testimage All2.2
6258LowACCEPTEDnormal1.5.1BitBakesvn fetch uses last changed revision instead of revision on a svn branch. All2.2
6278MediumNEWenhancement2.0OE-Corerunqemu without /etc/resolv.conf PC2.2
6370MediumIN PROGRESS REVIEWenhancement1.7Automated Build TestingQA/oe-selftest: add test suite for recipe testing PC2.2
6372MediumNEWenhancementunspecifiedOE-CoreFeature request: recipe hook for source tree preparation PC2.2
6378MediumNEWnormalunspecifiedMatchboxlibfakekey patch to allow shift-ed version of symbol not already in keymap All2.2
6469MediumNEWenhancement1.7Maintenance ToolsHost system profiler tool. PC2.2
6626MediumNEWnormalunspecifiedGeneral DocsAdd an example for debugging software with the corresponding -dbg package PC2.2
6661MediumNEWenhancement1.7OE-Coredevtool: add ability to submit changes for review All2.2
6683MediumNEWmajorunspecifiedOE-CoreProduce a script to automate release preparation tasks All2.2
6700MediumNEWenhancement1.7OE-Coresystemd's resolved conflicts with connman All2.2
6839LowNEWenhancement1.7OE-CoreHandle dev package with no main package more gracefully All2.2
6926MediumNEWenhancement1.8Meta-yoctoCreate yocto-bsp testsuite All2.2
6972MediumNEWnormal1.7OE-Corebreaks build of software using cmake packages due to hardcoded paths PC2.2
7010MediumNEWnormal1.7OE-Coresystemd-serialgetty cannot create a serial-getty@.service that is not enabled All2.2
7040MediumIN PROGRESS DESIGNenhancement1.7OE-CoreSupport for /usr merge (à la systemd and Fedora) PC2.2
7096MediumIN PROGRESS DESIGNenhancement1.8BSP GuideDocument how to use initramfs features All2.2
7142MediumNEWnormal1.8OE-Corecmake.bbclass fails when rebuilding after MACHINE changes PC2.2
7202MediumIN PROGRESS REVIEWenhancementunspecifiedAutomated Build TestingTest for linux-dummy All2.2
7240MediumNEWenhancement1.7OE-CoreAdd declaration of image output file globs for Toaster All2.2
7298MediumNEWnormal1.6.2OE-Corepackagegroups are not rebuilt when rdependency pkg name changes PC2.2
7314MediumNEWenhancement2.1OE-CoreAudit all recipes for proper CONFFILES assignment All2.2
7336MediumNEWenhancement1.8OE-Corebuildhistory-diff reports recipe-wide changes per-subpackage All2.2
7459MediumNEWenhancementunspecifiedOE-CoreImplement the use of host USB devices on Linux for qemu machines PC2.2
7502MediumNEWnormalunspecifiedToasterShow image information if rootfs files are generated PC2.2
7526MediumNEWenhancement1.9Automated Runtime Testingadd test for checking if fontcache is created inside an image PC2.2
7554MediumACCEPTEDmajor1.7OE-CoreOwnership issue in package contents All2.2
7617MediumNEWenhancement1.8OE-Coredevtool: detect need to re-run configure PC2.2
7636MediumNEWenhancement1.8OE-Corerecipetool: basic spec file conversion All2.2
7670MediumIN PROGRESS REVIEWenhancementunspecifiedOE-CoreProposal: make TOPDIR or BUILDDIR available to the devshell PC2.2
7671MediumNEWenhancementunspecifiedOE-CoreFeature request: integrate task-level exports support PC2.2
7710MediumIN PROGRESS DESIGNenhancement1.8OE-Coredevtool: deploy-target: interact with target packaging where available All2.2
7820Medium+IN PROGRESS IMPLEMENTATIONenhancement1.9Eclipse PluginReplace Hob with Toaster in Eclipse PC2.2
7846MediumNEWenhancementunspecifiedBitBakedevshell cannot be kept open across rebuilds PC2.2
7852MediumIN PROGRESS DESIGNnormalunspecifiedBitBakebitbake-layers layerindex-fetch doesn't respect branch (-b|--branch) option PC2.2
7877MediumNEWnormalunspecifiedBitBakeDepending on the error found, inconsistent line reported. PC2.2
7879MediumNEWnormalunspecifiedBitBakeDepending on the name of a recipe, the build succeeds or fails. PC2.2
7958MediumIN PROGRESS REVIEWenhancementunspecifiedBitBakeImplement shallow git clone functionality All2.2
7960MediumNEWenhancement1.9OE-CoreFeature Request: to enable poky to support building multilib native commands PC2.2
7972MediumNEWnormalunspecifiedToasterlsof needed by start/stop toaster script but not needed on system to run Yocto builds. PC2.2
7973MediumACCEPTEDnormalunspecifiedToasterstopping toaster kills ALL django apps running on the machine. PC2.2
7982LowNEWenhancementunspecifiedOE-CoreHave an option to exclude some packages from the SDK generation PC2.2
8037MediumIN PROGRESS IMPLEMENTATIONnormal1.8ToasterExternal link to recipe file links to non-existing page when recipe information comes from a build PC2.2
8044MediumNEWnormalunspecifiedAutoBuilderStop building lsb-qt3 images PC2.2
8051MediumNEWnormal1.8ToasterImporting layer fails silently if the layer name already exists PC2.2
8064MediumNEWnormal1.9Program Managementptest fails tracker bug PC2.2
8074MediumIN PROGRESS REVIEWnormalunspecifiedBuild ApplianceGraphic display using Virtual Box differs from VMware PC2.2
8087MediumNEWnormalunspecifiedAutomated Build Testingeglibc patch bug PC2.2
8146MediumNEWnormal1.8Automated Runtime Testingptest - some test cases are failing for acl PC2.2
8161MediumNEWnormalunspecifiedBitBakeCan't use "\" characters in SRC_URI entries - not even escaped PC2.2
8173MediumNEWnormal1.8.1OE-CoreWrong dynamic loader because of missing -mfloat-abi=hard in LDFLAGS (in scons) PC2.2
8189MediumNEWnormal1.8ToasterVariable history shows full paths to files inside the /bitbake directory PC2.2
8192MediumNEWminorunspecifiedOE-Corepython3.4.3 os.fork and os.waitpid Other2.2
8222LowNEWenhancement1.8OE-CoreElide dependency from -dev package on main package if there are no shared libraries in it PC2.2
8275MediumNEWnormal1.9ToasterToaster: Suitable message and build box does not appear in build tab for a project with no builds PC2.2
8278MediumNEWnormalunspecifiedOE-Coredevtool: update compressed patches gracefully PC2.2
8302MediumNEWnormal1.9OE-Coresstate_create_package fails to chmod file PC2.2
8325MediumNEWenhancement1.8OE-Coredevtool modify could handle patch failure more usefully PC2.2
8332MediumNEWenhancement2.1Automated Build TestingAdd a broken recipe for testing purposes PC2.2
8380MediumACCEPTEDnormalunspecifiedOE-Coremultiple pointer devices in qemu PC2.2
8430MediumACCEPTEDenhancement1.8OE-Coreinaccurate 'du' usage in Image::_get_rootfs_size PC2.2
8447MediumACCEPTEDnormal1.9OE-CoreHost contamination in glibc-locales All2.2
8454MediumNEWnormal1.9OE-Corearchiver.bbclass does not create subfolder per license All2.2
8456MediumNEWenhancement2.1ToasterAdd feature to add layers to Toaster from external source PC2.2
8471MediumACCEPTEDnormal1.9Automated Runtime Testingptest - some valgrind ptests fail on 2.0.rc1 NUC2.2
8497MediumNEWenhancement2.1Manual TestingContinuous Toaster exploratory testing PC2.2
8502MediumNEWenhancement2.1Automated Runtime TestingStore BSPs Firmware and HW info for BSP test cases PC2.2
8504MediumNEWenhancement2.1Test Plans/SuiteIdentify and add if needed BSP test cases specific to meta-intel PC2.2
8560MediumNEWnormalunspecifiedRuntimexserver fails with xf86OpenConsole: Cannot open /dev/tty0 (No such file or directory) PC2.2
8582MediumNEWnormal1.7.4OE-CoreError message not in log file PC2.2
8586MediumIN PROGRESS REVIEWnormalunspecifiedOE-Coremultilib build includes 32bit connman without good reason PC2.2
8593MediumNEWnormalunspecifiedOE-CoreThe head files of ncurses installing into sysroot seems different in multiple times compilation PC2.2
8606LowACCEPTEDenhancement2.1OE-CoreEvaluate using connman-ui instead of connman-gnome PC2.2
8612LowNEWenhancement1.8BitBakeAdd a locked sigs mode allowing locked task to rerun All2.2
8643MediumACCEPTEDnormal2.1OE-CoreGTK+3 depends on libepoxy which depends on egl PC2.2
8688MediumNEWnormal1.8.2OE-Corebusybox syslog not update-alternatives aware All2.2
8703MediumIN PROGRESS IMPLEMENTATIONnormalunspecifiedBitBakePATCHTOOL = git, triggers error user.name/user.email unset PC2.2
8719MediumIN PROGRESS DESIGNenhancement2.0OE-CoreEnsure bootable images can be supported by wic for all reference BSPs All2.2
8721LowNEWminor2.0ToasterWe are not validating machine input PC2.2
8732MediumNEWenhancementunspecifiedOE-CoreBranch Support for Buildhistory PC2.2
8760MediumNEWenhancementunspecifiedAutoBuilderAutobuilder additional task log availability PC2.2
8779MediumNEWnormalunspecifiedOE-Coreupdate-alternatives.bbclass automatic renaming doesn't happen in sysroots All2.2
8789MediumNEWenhancement2.0OE-Coreextensible SDK: command disable devtool subcommands based on capabilities All2.2
8805MediumNEWnormal2.0BitBakeDetect and warn people naming functions something_remove_something All2.2
8806MediumNEWnormalunspecifiedToasterRefactor localhostbecontroller PC2.2
8810MediumACCEPTEDnormal1.6.4Automated Runtime TestingSome strace ptests fail PC2.2
8828MediumNEWnormal2.1Automated Runtime TestingpTest - lttng-tools tests fail for 2.1_M1.rc1 NUC2.2
8840MediumNEWenhancement2.1OE-CoreFailure to build 32 bit eSDK on a 64 bit host PC2.2
8865LowNEWminor2.1ToasterThe project "updated" field shows the last time a project was saved, not its last activity PC2.2
8870MediumNEWnormal2.0OE-Coreuclibc fails to build occasionally PC2.2
8886MediumNEWnormal2.0ToasterToaster thinks do_shared_workdir is a shared state task PC2.2
8918MediumNEWnormal2.0ToasterChange the way we handle queued builds PC2.2
8928MediumNEWenhancement2.2OE-Coreextensible SDK - add a way to prepare the sdk for offline usage PC2.2
8953MediumNEWnormal2.0ToasterToaster ignores the subdirectory when cloning imported layers PC2.2
9061MediumNEWnormal2.2BitBakegit fetcher inconsistency for working with PREMIRRORS. PC2.2
9076MediumIN PROGRESS REVIEWnormalunspecifiedOE-CoreThe detection of the image type is incorrectly matching a wrong type PC2.2
9078LowNEWenhancement2.0OE-CoreWhen changing SDKIMAGE_FEATURES to "dev-pkgs", some -dbg packages are still installed All2.2
9110MediumNEWenhancement2.0OE-CoreMove some oe-pkgdata-util logic into lib/oe All2.2
9115MediumACCEPTEDnormal2.0ToasterAdded packages filter seems to show the wrong package list PC2.2
9119MediumNEWnormal2.0Program Managementptest fails tracker bug (Cont.) PC2.2
9171MediumNEWnormalunspecifiedOE-CoreConsider limiting the scope of depchains to runtime deps PC2.2
9173MediumNEWenhancement2.1OE-Coreextensible sdk: Create a way that sstate will automatically be removed after setscene PC2.2
9175MediumNEWenhancementunspecifiedBitBakeRemove os.chdir from fetch/unpack logic All2.2
9176MediumNEWnormalunspecifiedBSPsDefault u-boot script is not able boot from eMMC on BeagleBone Black BeagleBone2.2
9202MediumWaitForUpstreamnormal2.1BSPs[Test Case 898] Piglit 3D testing NUC (6i5SYH) s getting stuck when running script.[5]NUC2.2
9207MediumNEWnormal2.1OE-CoreNeed to fix prelink to iterate mulitlibs PC2.2
9208MediumNEWnormal2.1OE-Corecreaterepo fails to correctly update the repodata, image generation then fails PC2.2
9213MediumNEWnormalunspecifiedAutoBuilderEnable thumb for ARM builds PC2.2
9220MediumNEWenhancement2.0OE-Corebuildhistory should track native recipes All2.2
9224MediumNEWenhancement2.2Layers[meta-swupd] Try to speed up update generation by parallelising calls to swupd_* programs where possible PC2.2
9233MediumIN PROGRESS REVIEWnormal2.2OE-CoreAs a developer, I want initramfs bundled kernel could be installed into rootfs PC2.2
9259MediumNEWnormal2.1OE-CoreThe rpm database costs lots of disk space after install a package PC2.2
9267MediumACCEPTEDnormal2.1BSPstest_parselogs (oeqa.runtime.parselogs.ParseLogsTest) failed on NUC 6i5SYH, firmware load for i915/skl_guc_ver4.bin failed[6]NUC2.2
9272MediumNEWnormalunspecifiedOE-CoreBBCLASSEXTEND="cross" overrides do_install() PC2.2
9279MediumNEWnormalunspecifiedBitBakeIssue with PREFERRED_PROVIDER interaction with overrides PC2.2
9288MediumNEWnormalunspecifiedBitBakedepexp does not show bitbake errors All2.2
9297MediumNEWenhancementunspecifiedToasterToaster: Simplify building extensible SDK PC2.2
9322MediumNEWenhancement2.2Layers[meta-swupd] Improve the algorithm for determining previous version PC2.2
9350MediumNEWenhancement2.3OE-CoreAs a developer, I want a global variable exist for choosing the default SSL/TLS provider. PC2.2
9360MediumNEWnormal2.1OE-Coredevtool: update-recipe ignores SRC_URI_append PC2.2
9365MediumACCEPTEDenhancement2.2OE-CoreRemove xtscal in preference of xinput-calibrator PC2.2
9406MediumACCEPTEDnormal2.1BSPsdmesg test_parseLogs failed corei7-64 on NUC error BAR 14 and 15 NUC2.2
9417MediumNEWenhancementunspecifiedOE-CoreBring clang/llvm compiler infrastructure to OE-Core All2.2
9479MediumNEWnormal2.0OE-CoreExtensible SDK breaks if python-dependent items added to TOOLCHAIN_HOST_TASK PC2.2
9484MediumNEWnormal2.2ToasterPort QA UI tests to Toaster's Django+Selenium framework PC2.2
9486MediumIN PROGRESS REVIEWnormalunspecifiedSecurity - Recipe Upgradesecurity_flags.inc has many exception packages compiled without -PIE security flag PC2.2
9503MediumNEWenhancement2.1OE-CoreAdd a way to add docker metadata to container images PC2.2
9504MediumNEWnormal2.1BitBakeknotty doesn't delete lines if the number of output lines is larger than then number of lines in the terminal PC2.2
9518MediumNEWenhancementunspecifiedToasterRationalise the directory structure generated by Toaster PC2.2
9525MediumNEWenhancementunspecifiedInstallationMake install prompt available on all consoles PC2.2
9527MediumIN PROGRESS DESIGNenhancement2.2OE-CoreImplement initial support for a stateless OS PC2.2
9531MediumNEWnormal2.0BSPsNeed a proper way to fix mismatched arch generated with bare-bone kernel recipe PC2.2
9539MediumNEWnormal2.2OE-CoreResolve string formatting issues in busybox PC2.2
9540MediumNEWnormal2.2OE-CoreResolve string formatting issues in console-tools PC2.2
9541MediumNEWnormal2.2OE-CoreResolve string formatting issues in cmake PC2.2
9542MediumNEWnormal2.2OE-CoreResolve string formatting issues in expect PC2.2
9543MediumNEWnormal2.2OE-CoreResolve string formatting issues in gcc PC2.2
9544MediumNEWnormal2.2OE-CoreResolve string formatting issues in gettext PC2.2
9545MediumNEWnormal2.2OE-CoreResolve string formatting issues in kexec-tools PC2.2
9562MediumIN PROGRESS IMPLEMENTATIONnormal2.2Eclipse Plugin[Neon] Minimum required Java version is 1.8 for Eclipse Neon (4.6) PC2.2
9582MediumNEWenhancementunspecifiedToasterReplace toasterconf.json with Django fixtures PC2.2
9586MediumNEWnormal2.2Toasterdocument and verify production setup for jenkins ci interaction PC2.2
9587MediumNEWnormal2.1Kernel4.1.x: gpio-pca953x.c fails to compile without CONFIG_ACPI Other2.2
9590MediumNEWenhancement2.1CROPSCannot update Zephyr project config PC2.2
9591MediumNEWenhancement2.1CROPSZephyr project configuration should allow kernel and app to be in different folder hierachies PC2.2
9593MediumNEWenhancement2.1CROPSEnable workspace folder to be changed PC2.2
9595MediumNEWnormal2.1OE-CoreExtensible sdk: error early if tasks to be ran cannot be provided from sstate PC2.2
9597MediumIN PROGRESS IMPLEMENTATIONenhancement2.2CROPSswtbot initial implementation so that we can automate testing of the plugin PC2.2
9609MediumWaitForUpstreamnormal2.1Kernel4.1.x: musb fails to compile BeagleBone2.2
9615MediumNEWenhancement2.2Eclipse Pluginyocto-bsp: The design for the yocto-bsp wizard needs some work PC2.2
9616MediumNEWnormal2.2Eclipse Pluginyocto-bsp wizard sources the Build location folder every time the field loses focus PC2.2
9621MediumNEWnormal2.2CROPSostro.layers not copied from conf to workspace PC2.2
9627MediumNEWnormalunspecifiedOE-Coredevtool seems to mangle incorrectly the .bb file, when modifying the set of patches for a component PC2.2
9638MediumNEWnormalunspecifiedOE-Coredevtool changes the format of the SRC_URI unnecessarily PC2.2
9641MediumNEWnormalunspecifiedToasterIn the custom image recipe page, the last build information only shows successful builds PC2.2
9645MediumNEWnormalunspecifiedToasterThe image recipe details does not show "Last build" information PC2.2
9651MediumNEWenhancement2.2Maintenance ToolsError report web: Optimize searching times PC2.2
9657LowNEWnormalunspecifiedToasterSaving an added variable seems to save all other added variables PC2.2
9663MediumNEWnormalunspecifiedOE-Coredo_populate_lic assumes that license basenames are unique PC2.2
9688MediumNEWnormal1.8.2Eclipse Pluginpowertop: "show pids in wakeups list" option fails with exit code 1 PC2.2
9693MediumACCEPTEDminor2.1Automated Build Testingoeqa/selftest/recipetool: runCmd's output is populated with previous output PC2.2
9697MediumNEWnormal2.1Eclipse PluginYocto Project ADT Preferences : Failed to save values for new profile PC2.2
9698MediumNEWminor2.1Eclipse PluginYocto Project ADT Preferences: Odd behavior of removal dialogs on Standard Profile PC2.2
9700MediumNEWenhancementunspecifiedMaintenance ToolsAdd layer and bitbake information to error reports PC2.2
9703MediumNEWnormal1.8.2Eclipse PluginNew eclipse project failing to reconfigure because of hyphens in the name PC2.2
9724MediumNEWnormalunspecifiedTest Plans/SuiteCreate a YP 2.2 test plan for package upgrades PC2.2
9725MediumACCEPTEDnormal2.2BitBakeadd docstrings to functions in lib/bb/utils.py that are used in meta- files. PC2.2
9726MediumNEWenhancement2.2AutoBuilderAdd support for autobuilder to create CROPS containers PC2.2
9743MediumNEWnormal2.2Toasterbuilds: The search result of the content of the builds table is incorrect PC2.2
9762MediumNEWenhancementunspecifiedBitBakeAdd support for poisoning of variables PC2.2
9769MediumNEWenhancement2.2AutoBuilderEnable the capability to associate specific build step to specific worker in AB PC2.2
9781LowACCEPTEDnormal2.1OE-CoreBroken binutils build for arm uclibc Other2.2
9782MediumNEWenhancementunspecifiedBitBakeAdd support for parallel gzip to package creation PC2.2
9790MediumNEWnormal2.2LayersDesign a solution for using a package manager to develop and transitioning to swupd for production PC2.2
9805MediumNEWnormal2.1OE-CoreSigning keys not available when signing out-of-tree kernel modules PC2.2
9808MediumNEWnormalunspecifiedToasterCreate selenium tests for project dashboard page PC2.2
9821MediumNEWenhancementunspecifiedAutoBuildercreate a configuration for a deployable autobuilder cluster PC2.2
9827MediumIN PROGRESS IMPLEMENTATIONnormal2.0Meta-yoctopackage.bbclass does not treat directory symlinks properly, leading to build failures Other2.2
9838MediumNEWnormal2.2Eclipse Pluginperf fails on eclipse, sending a weird command remotely to qemu PC2.2
9840MediumNEWnormal2.2Eclipse PluginBitbake Commander: populate button not working when creating new recipe PC2.2
9841MediumIN PROGRESS REVIEWnormal2.2ToasterBuild button in image detail page does not start build PC2.2
9846MediumIN PROGRESS REVIEWnormal2.2Toaster"Most built recipes" section does not show recipes PC2.2
9850MediumIN PROGRESS REVIEWnormalunspecifiedeSDKExtensible SDK OE toolchain missing cross-gdb PC2.2
9854MediumNEWnormal2.0KernelKernel hangs on LTP cgroup tests PC2.2
9859MediumNEWnormalunspecifiedPseudosetcap doesn't work PC2.2
9880MediumNEWenhancement2.1OE-CoreSupport locale archives All2.2
9882MediumIN PROGRESS REVIEWenhancement2.0OE-Corerecipetool: specify which licenses are unknown when multiple are found PC2.2
9883MediumNEWnormal2.1OE-Corecurl-native: invalid builtin ca-bundle path when restoring from sstate PC2.2
9888MediumNEWnormal2.1BitBakeuninative cannot find tarball when using "own-mirrors" and BB_NO_NETWORK PC2.2
9889MediumNEWnormal2.1OE-Corecvs is required to be installed on host to support cvs SRC_URI PC2.2
9948MediumNEWnormalunspecifiedOE-Core"-fstack-protector-strong" seems unnecessary in SECURITY_LDFLAGS All2.2
9962MediumNEWenhancement2.3BitBakeSuggested additions to the --help output re. -v and -D PC2.2
9974MediumNEWminorunspecifiedeSDKExtensible SDK: reparse occurs on first devtool use PC2.2
9982MediumNEWnormal2.1OE-Corenpm.bbclass install function will package patches directory PC2.2
9986MediumIN PROGRESS REVIEWnormalunspecifiedBitBakeETA reported for meta-swupd layer is off scale by 1 or 2 orders of magnitude PC2.2
9425Medium+REOPENEDnormal2.1ToasterCustom image cannot be downloaded until after it is built PC2.2 M1
3343LowACCEPTEDenhancement1.4OE-Coreperf script: install audit-libs-python to get syscall name for syscall-displaying scripts PC2.2 M2
4431HighACCEPTEDenhancementunspecifiedAutoBuilderSet up buildhistory-web for autobuilder All2.2 M2
4527Medium+NEWenhancement1.5Automated Runtime Testingcreate a Runtime performance test layer to enable runtime performance tests PC2.2 M2
5369Medium+NEWenhancement1.6Test Plans/SuiteCreate test plan to do performance analysis of x32 runtime PC2.2 M2
7515Medium+IN PROGRESS REVIEWenhancementunspecifiedMaintenance ToolsAdd CVE testing tool All2.2 M2
7654Medium+IN PROGRESS REVIEWenhancementunspecifiedMaintenance Toolspatchwork: ensure superseded patches are marked as such All2.2 M2
7695MediumNEWenhancementunspecifiedAutoBuilderAutomated QA tests for the autobuilder PC2.2 M2
7823MediumIN PROGRESS DESIGNenhancement1.9Eclipse PluginConvert Eclipse projects to Yocto recipes with devtool PC2.2 M2
7824MediumACCEPTEDenhancement1.9Eclipse PluginAdd functionality to modify existing Yocto recipes with devtool PC2.2 M2
8083MediumACCEPTEDenhancementunspecifiedAutoBuilderAdd n32 test case to autobuilder nightly-multilib PC2.2 M2
8142Medium+ACCEPTEDnormal1.9Automated Build Testingavahi daemon fails to start on systemd while testing core-image-sato PC2.2 M2
8193MediumNEWenhancement1.9AutoBuilderadd wiki reporting to public AB PC2.2 M2
8200MediumNEWenhancement1.9OE-CoreAdd acl to default DISTRO_FEATURES? PC2.2 M2
8383Medium+ACCEPTEDnormal2.0OE-Coresmart runtime test failure PC2.2 M2
8400MediumNEWenhancementunspecifiedMaintenance Toolsrrs: add the cause of an unknown recipe version All2.2 M2
8480Medium+NEWenhancement2.1Automated Runtime TestingExtendable structure for test controller to support kinds of image flash methods and communication methods with DUT PC2.2 M2
8525Medium+ACCEPTEDnormal2.0Automated Runtime Testingselftest needs to control distro configuration PC2.2 M2
8532Medium+IN PROGRESS REVIEWenhancement2.1Automated Runtime Testingrunexported.py parameter support for: -a <tag> PC2.2 M2
8648HighIN PROGRESS REVIEWenhancementunspecifiedMaintenance ToolsAutomatic testing of incoming patches All2.2 M2
8649HighIN PROGRESS IMPLEMENTATIONenhancementunspecifiedMaintenance ToolsScript to assemble patches for autobuilder testing All2.2 M2
8650MediumACCEPTEDenhancementunspecifiedMaintenance ToolsRRS: track ptest-enabled and potentially ptest-enabled status PC2.2 M2
8714Medium+NEWenhancementunspecifiedMaintenance ToolsPatchwork frontend page for incoming patch testing All2.2 M2
8715Medium+ACCEPTEDenhancementunspecifiedAutoBuilderUpdate patchwork / build status page on patch test build completion PC2.2 M2
8716Medium+NEWenhancementunspecifiedMaintenance ToolsBuild summary page for incoming patch testing All2.2 M2
8717Medium+NEWenhancementunspecifiedMaintenance Toolspatchwork: keep build page up-to-date with important patch status changes All2.2 M2
8727MediumNEWnormalunspecifiedBitBakefetcher: should not log errors but pass them for handling PC2.2 M2
8771Medium+IN PROGRESS DESIGNnormal2.0Automated Runtime Testingtest_smart_channel_add (oeqa.runtime.smart.SmartRepoTest) failed in Autobuilder PC2.2 M2
8832MediumNEWnormal2.1Automated Runtime TestingpTest - bash tests fail for 2.1_M1.rc1 NUC2.2 M2
8841MediumNEWenhancement2.0OE-CoreCOPY_LIC_DIRS should use beginline and endline from LIC_FILES_CHKSUM All2.2 M2
8873MediumNEWenhancement2.0Eclipse PluginCreate an appropriate Yocto Project Workspace from an existing Eclipse project PC2.2 M2
8874MediumNEWnormal2.0Eclipse PluginCreate a new Yocto recipe from an existing Eclipse project using devtool PC2.2 M2
8938Medium+IN PROGRESS REVIEWenhancement2.0Automated Build Testingoe-selftest: refactor command line arguments so usage is simpler PC2.2 M2
8962Medium+NEWenhancement2.1Maintenance ToolsAUH: Add support for meta-intel PC2.2 M2
8988Medium+NEWnormal2.0.1Automated Runtime Testingtest_rpm_query_nonroot (oeqa.runtime.rpm.RpmInstallRemoveTest) - Failed to create new user[7]NUC2.2 M2
9037Medium+NEWenhancementunspecifiedOE-CoreConsider alternate methods for maintain Yocto releases after 1yr PC2.2 M2
9064Medium+IN PROGRESS REVIEWmajor2.0BitBakedo_unpack does not wipe old source tree All2.2 M2
9081MediumIN PROGRESS DESIGNnormalunspecifiedMaintenance ToolsRRS should respect DEFAULT_PREFERENCE when multiple versions of the same recipe are available PC2.2 M2
9105Medium+IN PROGRESS REVIEWnormal2.0Eclipse Plugin[MARS] Cannot install eclipse-poky plugin PC2.2 M2
9188MediumWaitForUpstreamnormal2.1Layers[meta-swupd] Remove hard-coded paths from swupd-client PC2.2 M2
9204MediumNEWnormal2.1Automated Runtime TestingCleanup should be made after testing smart PC2.2 M2
9244Medium+ACCEPTEDenhancement2.2Maintenance Toolspatchtest-oe: Create tests to validate recipes, classes or config files PC2.2 M2
9255HighIN PROGRESS REVIEWenhancementunspecifiedBitBakeAllow rootfs tasks to run in parallel with rpm All2.2 M2
9299Medium+IN PROGRESS REVIEWenhancement2.1OE-CoreEnable Tracing boot and process times in testing images PC2.2 M2
9308MediumACCEPTEDenhancement2.2Maintenance Toolspatchtest: improve signal handling when the process is interrupted PC2.2 M2
9351Medium+IN PROGRESS REVIEWnormalunspecifiedBitBakeIssues using bitbake with externalsrc and git PC2.2 M2
9389MediumIN PROGRESS DESIGNenhancement2.2OE-Coreoeqa: split configuration from the code PC2.2 M2
9390MediumNEWenhancement2.2OE-Coreoeqa: don't write anything to local.conf or bblayers.conf PC2.2 M2
9391Medium+NEWenhancement2.2OE-Corerefactor syslinux.bbclass, grub-efi.bbclass and gummiboot.bbclass PC2.2 M2
9404MediumNEWnormal1.5.5Package Management IssuesSmart will remove RECOMMENDS during a remove command All2.2 M2
9408MediumNEWenhancement2.2OE-Corecreate-pull-request: auto push the branch if not present PC2.2 M2
9409MediumNEWenhancement2.2OE-Corecreate-pull-request: add the ability to read env var PC2.2 M2
9410MediumNEWenhancement2.2OE-Corecreate-pull-request: automatically add the subject when there is only one patch PC2.2 M2
9424MediumIN PROGRESS REVIEWminor2.1OE-Coresystemd tmpfiles.d warnings (volatile, resolv.conf) PC2.2 M2
9457HighNEWenhancement2.1Maintenance Toolspatchtest: document deployment with isolation features PC2.2 M2
9468MediumNEWenhancementunspecifiedAutomated Runtime TestingExport Tests execution (Runexport.py) execution log needs improvements Other2.2 M2
9474Medium+IN PROGRESS REVIEWnormalunspecifiedOE-Coreepiphany doesn't work on ARM Beagleboard2.2 M2
9495MediumNEWnormal2.2OE-CoreCan't boot efi image (iso or vmdk) in virtualbox PC2.2 M2
9513Medium+ACCEPTEDnormal2.1OE-CoreFailed to install sdk_ext for i686 PC2.2 M2
9555Medium+IN PROGRESS IMPLEMENTATIONnormalunspecifiedToasterCreate Toaster Docker container PC2.2 M2
9563MediumACCEPTEDenhancement2.2OE-Coreyocto-kernel script should use argparse instead of optparse library PC2.2 M2
9564MediumACCEPTEDenhancement2.2OE-Coreyocto-layer script should use argparse instead of optparse library PC2.2 M2
9570MediumACCEPTEDnormal2.1CROPSNeed a simple way of configuring Zephyr development environment at start of docker session PC2.2 M2
9596MediumNEWenhancement2.1AutoBuilderBuild "minimal" extensible SDK installers instead of "full" ones PC2.2 M2
9602MediumNEWnormal2.1Maintenance ToolsRun automated tests on alternative C libraries All2.2 M2
9635MediumACCEPTEDenhancement2.2OE-Corebuildhistory-diff script should use argparse instead of optparse library PC2.2 M2
9636MediumACCEPTEDenhancement2.2OE-Corewic script should use argparse instead of optparse library PC2.2 M2
9660Medium+ACCEPTEDnormal2.2Test Plans/SuiteCreate a YP-2.2 test plan for SWUpd PC2.2 M2
9678Medium+IN PROGRESS DESIGNenhancement2.2AutoBuilderInclude automated test execution and reporting in Autobuilder PC2.2 M2
9682Medium+IN PROGRESS REVIEWenhancement2.2Automated Build Testingenable xml output in OeTest class for report consumers PC2.2 M2
9706Medium+IN PROGRESS REVIEWenhancement2.0BSPsSystemd-boot: Create test harness in OE PC2.2 M2
9708Medium+ACCEPTEDenhancementunspecifiedAutomated Build Testingoe-selftest --list-tests with options to control fields shown PC2.2 M2
9737Medium+NEWenhancementunspecifiedBitBake[PATCH] ui/knotty: give out start time of task PC2.2 M2
9738Medium+NEWenhancementunspecifiedBitBake[PATCH] fetcher: allow git+<protocol>: syntax PC2.2 M2
9752Medium+NEWmajor2.2Automated Build Testingptest results do not include all the components tested PC2.2 M2
9763Medium+ACCEPTEDnormalunspecifiedOE-Coretar --exclude option is position-sensitive PC2.2 M2
9764Medium+IN PROGRESS REVIEWnormal2.2Automated Build Testingtestimage: test installation of packages in the DUT without package manager PC2.2 M2
9765Medium+IN PROGRESS IMPLEMENTATIONnormalunspecifiedAutomated Runtime Testingtestexport: Test SDK generation and installation for exported tests. PC2.2 M2
9766Medium+IN PROGRESS REVIEWenhancementunspecifiedAutomated Runtime Testingtestimage: test import of tests from other layers PC2.2 M2
9770MediumIN PROGRESS REVIEWenhancementunspecifiedAutomated Build Testingoe-selftest: test import of tests from other layers PC2.2 M2
9774Medium+IN PROGRESS REVIEWnormal2.1Automated Runtime Testingsystemd-boot: Add new test target as what the existing gummiboot does PC2.2 M2
9799MediumNEWnormal2.2CROPSCtrl-c does'nt stop the build for the ostro cli container PC2.2 M2
9809Medium+IN PROGRESS REVIEWnormal2.2OE-CoreList python/bitbake libraries that are not being tested by oe-selftest PC2.2 M2
9828Medium+NEWnormal2.2Matchbox[Beaglebone] mouse doesn't work when system startup PC2.2 M2
9848MediumIN PROGRESS DESIGNenhancement2.2Automated Runtime Testingtestimage/testexport: support permissions and attributes for package installation PC2.2 M2
9851Medium+IN PROGRESS REVIEWnormal2.2OE-Corepiglit fails to build on qemux86* PC2.2 M2
9853MediumIN PROGRESS IMPLEMENTATIONnormal2.3ToasterDatabase refactoring to ease multiple configurations PC2.2 M2
9858MediumNEWenhancement2.1OE-CoreMake xattrs in images work [meta] PC2.2 M2
9867Medium+ACCEPTEDnormal2.2OE-Coreyocto-bsp: listing values for some properties throws exception PC2.2 M2
9871Medium+IN PROGRESS REVIEWenhancement2.1Maintenance Toolspatchtest-oe: make sure description is present on patches PC2.2 M2
9874Medium+ACCEPTEDenhancement2.1Maintenance Toolspatchtest-oe: check that patches are removed if these are removed from the SRC_URI PC2.2 M2
9875Medium+IN PROGRESS DESIGNenhancement2.1Maintenance Toolspatchtest-oe: in case upstream link change (SRC_URI), check that checksums flags also indicated this change PC2.2 M2
9886MediumIN PROGRESS REVIEWenhancement2.2BSPssystemd-boot: Support construct direct-boot image with sd-boot in wic and wks PC2.2 M2
9961HighNEWnormalunspecifiedBSPsintel-quark: 4.4.14 does not compile PC2.2 M2
10020HighNEWmajor2.0AutoBuilderHandle oe-core layer version 9 All2.2 M2
3043LowNEWenhancement1.3OE-Corerunqemu: Investigate and implement (if possible) a local firewall sanity check PC2.2 M3
3388MediumACCEPTEDnormal1.4OE-Coreperf: enable man pages for basic 'help' functionality PC2.2 M3
4144Medium+NEWenhancementunspecifiedOE-CoreRuntime performance testing All2.2 M3
4528Medium+ACCEPTEDenhancement1.5Test Plans/Suiteboot time should be tracked for systemd and SysVinit PC2.2 M3
4827MediumIN PROGRESS IMPLEMENTATIONenhancement1.5OE-Corerunqemu shouldn't hard-code machine knowledge All2.2 M3
5319Medium+NEWnormal2.1Automated Runtime TestingNeed a test to verify firstboot postinst script order PC2.2 M3
5470HighIN PROGRESS IMPLEMENTATIONnormalunspecifiedBitBakebitbake-layers cannot be used with memory resident bitbake running PC2.2 M3
5477Medium+IN PROGRESS IMPLEMENTATIONenhancement1.6Test Plans/SuiteCheck for any performance degradations with gcc security flags enabled PC2.2 M3
5478Medium+IN PROGRESS IMPLEMENTATIONenhancement1.6Test Plans/Suitetest build time performance degradations with gcc security flags enabled PC2.2 M3
5520MediumACCEPTEDenhancement1.6Meta-yoctopoky-tiny enhancements PC2.2 M3
5546HighACCEPTEDenhancement1.6OE-CoreOptimise away meta-oe X init mechanism All2.2 M3
5574LowIN PROGRESS IMPLEMENTATIONenhancement1.6OE-CoreAdd kernel configuration check mechanism All2.2 M3
6022MediumIN PROGRESS DESIGN COMPLETEenhancementunspecifiedKernel Developmentkernel-dev: How do I know which features are available for KERNEL_FEATURES ? PC2.2 M3
6120MediumACCEPTEDnormal1.6Runtimeperf top command does not work on QemuPPC PC2.2 M3
6238Medium+NEWenhancement1.9Toasterdelete projects/builds through the toaster UI PC2.2 M3
6287MediumNEWenhancementunspecifiedOE-CoreRelease scripts for BSPs/images. PC2.2 M3
6296Medium+NEWenhancement1.7OE-CoreAdd support for runtime performance tests to image_tests PC2.2 M3
6359Medium+ACCEPTEDenhancement1.7KernelInclude QA tests for kernel-dev manual tasks PC2.2 M3
6362Medium+IN PROGRESS REVIEWenhancement1.8BSPsRuntime machine configuration PC2.2 M3
6428Medium+NEWenhancement1.7BitBakeImprove the ability to isolate changes that have caused a rebuild All2.2 M3
6437Medium+ACCEPTEDenhancement1.7General DocsDocument how to set up the Yocto Project for production work PC2.2 M3
6618MediumIN PROGRESS REVIEWenhancementunspecifiedMaintenance ToolsMake the layer name searchable and show item page when search returns only one result All2.2 M3
6630MediumIN PROGRESS IMPLEMENTATIONenhancement1.7Kernellinux-yocto: kernel-dev package does not include target arch scripts binaries All2.2 M3
6660MediumACCEPTEDenhancement1.7OE-CoreCompare sstate packages within SDK publishing tool All2.2 M3
6803Medium+NEWenhancement1.7OE-CoreComprehensive large file support All2.2 M3
7018MediumIN PROGRESS REVIEWnormal1.8OE-Corearchiver missing tasks between do_unpack and do_patch PC2.2 M3
7136MediumNEWnormal1.6.1BitBakeDefault PACKAGES value prevents packaging of prebuilt shared libraries PC2.2 M3
7149MediumNEWenhancement1.8OE-Corerpm: print which pkgname for warning PC2.2 M3
7174LowACCEPTEDnormalunspecifiedMaintenance ToolsAUH can't tell when MACHINE is set with = in local.conf and thus multi-machine build won't work All2.2 M3
7436MediumIN PROGRESS DESIGNnormal1.8OE-Corekbd build race All2.2 M3
7476MediumNEWenhancement1.8Development ManualImprove license manifest description All2.2 M3
7494MediumNEWenhancement1.9Maintenance ToolsAUH: Parallelize running bitbake inside AUH script PC2.2 M3
7506LowACCEPTEDminorunspecifiedSystem Startupudev-cache possibly incompatible with meta-selinux All2.2 M3
7518HighIN PROGRESS IMPLEMENTATIONenhancementunspecifiedOE-CoreBuild multiple machines in the same bitbake invocation All2.2 M3
7552MediumACCEPTEDnormal1.8OE-CoreGenerated SDK has "expect" headers in wrong location PC2.2 M3
7557MediumNEWenhancementunspecifiedOE-Coredistrodata/distro_check should use BPN PC2.2 M3
7568MediumNEWenhancementunspecifiedAutoBuilderCreate an image to run regular build tests for no-X11 case All2.2 M3
7588MediumNEWenhancement1.8OE-Coredevtool: improve devtool build output All2.2 M3
7600MediumIN PROGRESS IMPLEMENTATIONenhancement1.9OE-Coresyslinux: port extX support patches to syslinux community PC2.2 M3
7610MediumACCEPTEDenhancement1.8OE-Core[Multilib] Can't install 64bit packages to 32bit rootfs PC2.2 M3
7646MediumIN PROGRESS IMPLEMENTATIONnormal1.8KernelKBUILD_DEFCONFIG does not work if config file is created as a result of patch to be applied Galileo2.2 M3
7683Medium+NEWenhancement1.8OE-CoreProvide means of turning a recipe change into a bbappend All2.2 M3
7691MediumNEWenhancementunspecifiedAutoBuilderLocking of branch/repo PC2.2 M3
7701LowNEWenhancement1.9AutoBuildernightly-autobuilder target PC2.2 M3
7724MediumACCEPTEDmajor1.7OE-Coreuseradd.bbclass users cannot be safely referred to by dependent recipes due to sstate-induced race with base-passwd All2.2 M3
7744MediumNEWenhancement1.8ToasterImprove messaging in empty states when Toaster does not have any layer information PC2.2 M3
7800MediumNEWenhancementunspecifiedOE-Coresystemd.bbclass doesn't check for services in systemd/user/ directory PC2.2 M3
7909MediumNEWenhancement1.9Maintenance ToolsRRS: Track patches and Upstream-Status information PC2.2 M3
7968LowNEWnormal1.9Toasterempty page states for no information in the database PC2.2 M3
7984MediumNEWnormal1.8OE-CoreRPM backend does not honor package overrides for PACKAGE_ARCH PC2.2 M3
8034MediumNEWnormal1.9Toastertypeahead search cneeds words to indicate it is constrained to the added layers. PC2.2 M3
8078Medium+ACCEPTEDmajor1.8OE-Coreuseradd.bbclass: useradd_preinst not run when rebuilding on second MACHINE All2.2 M3
8132Medium+NEWenhancement1.8ToasterImplement deleting custom images PC2.2 M3
8133MediumIN PROGRESS DESIGNenhancementunspecifiedMaintenance ToolsRRS should handle upstream repositories without version tags PC2.2 M3
8156MediumNEWenhancementunspecifiedBitBakelib/bb/fetch2/svn.py should support latest_versionstring() PC2.2 M3
8158MediumNEWnormalunspecifiedOE-CoreINCOMPATIBLE_LICENSES has unexpected results with GNU libraries PC2.2 M3
8162MediumNEWenhancementunspecifiedMaintenance Toolspatchwork: clear out the superseded and already merged patches All2.2 M3
8179Medium+IN PROGRESS IMPLEMENTATIONenhancement1.9Kernel DevelopmentIt should be possible to disable kernel features using config fragments PC2.2 M3
8188MediumNEWnormal1.8ToasterThe variable history is missing the layer name PC2.2 M3
8190MediumNEWnormal1.8ToasterThe 'set in file' filters in the BitBake variables table seem to return the wrong information PC2.2 M3
8191LowIN PROGRESS IMPLEMENTATIONenhancementunspecifiedOE-Coreapply kernel config fragments to arbitrary kernels All2.2 M3
8210Medium+NEWnormalunspecifiedAutoBuilderShould be able to restart a crashed vnc server PC2.2 M3
8223MediumIN PROGRESS IMPLEMENTATIONminor1.8OE-Corebbwarn warnings during do_rootfs printed twice PC2.2 M3
8273MediumIN PROGRESS DESIGNnormal1.9OE-Coreopenjade-native doesn't remove from sysroot correctly All2.2 M3
8289MediumIN PROGRESS IMPLEMENTATIONnormal1.8.1Kernelkernel_configme step should use "oldnoconfig" instead of "allnoconfig" when silently upgrading user defconfig All2.2 M3
8318Medium+IN PROGRESS REVIEWenhancement1.8OE-CoreAvoid unnecessary package feed churn due to packages rebuilding All2.2 M3
8433Medium+NEWenhancement2.2Automated Runtime TestingAdd test for package postinsts All2.2 M3
8440Medium+IN PROGRESS REVIEWnormal1.8ToasterToaster has some issues when showing builds that fail at the build request stage PC2.2 M3
8443Medium+IN PROGRESS REVIEWnormal1.8ToasterBuilds that failed at the build request stage need a custom dashboard PC2.2 M3
8446MediumNEWenhancement2.1OE-Corefix .pyc/.pyo buildpaths issue PC2.2 M3
8483MediumIN PROGRESS DESIGNenhancement2.1Automated Runtime TestingCompatible to run generic pyunit test cases by test runner PC2.2 M3
8530Medium+IN PROGRESS IMPLEMENTATIONenhancement2.1Automated Runtime Testingrunexported.py parameter support for: -m <machine arch> PC2.2 M3
8531Medium+NEWenhancement2.1Automated Runtime Testingrunexported.py parameter support for: -f <manifest> PC2.2 M3
8533Medium+NEWenhancement2.1Automated Runtime Testingrunexported.py parameter support for: -x <xunit> PC2.2 M3
8534Medium+IN PROGRESS REVIEWenhancement2.1Automated Runtime Testingneed export manifest files to SDK package under /conf/test/ folders of every layer PC2.2 M3
8535Medium+NEWenhancement2.1Automated Runtime Testingexport the test scripts under all layers' ./lib/oeqa PC2.2 M3
8548Medium+NEWenhancement2.1Automated Runtime TestingDocument best practises/style guide for selftest tests and update tests All2.2 M3
8554MediumIN PROGRESS REVIEWenhancement2.1BitBakeSupport for self-contained "baremetal" CPU meta-layers All2.2 M3
8570Medium+NEWnormalunspecifiedOE-Coreproblems with gdk-pixbuf and pango loading on multilib PC2.2 M3
8584Medium+IN PROGRESS IMPLEMENTATIONenhancement2.0OE-CoreEnable building API documentation All2.2 M3
8642Medium+IN PROGRESS REVIEWnormal2.1OE-CoreThe "32" is a broken symlink in aarch64's mutilib SDK PC2.2 M3
8657Medium+NEWenhancement2.0OE-Coreextensible SDK: improve handling for sanity checks PC2.2 M3
8673Medium+ACCEPTEDnormal2.0OE-Coredistutils3 packages installed via an egg file cannot be imported by the python3 interpreter PC2.2 M3
8676MediumACCEPTEDenhancement2.0OE-Coredevtool: extend oe-selftest testing for devtool upgrade All2.2 M3
8699Medium+ACCEPTEDenhancementunspecifiedBitBakeoffer a way to use sstate-object hashes as dependencies of builds/packages All2.2 M3
8724Medium+IN PROGRESS DESIGNenhancement2.1Automated Runtime TestingAutomate information collection for runtime errors PC2.2 M3
8730MediumNEWnormal2.0OE-Coreseparate code generating python manifest file from manifest information and improve the manifest generation All2.2 M3
8735MediumNEWenhancement2.1Maintenance ToolsAUH: Use tinfoil instead of parse the recipe itself PC2.2 M3
8740MediumIN PROGRESS REVIEWnormal2.0RuntimeLTP and LSB NG cases PC2.2 M3
8743MediumIN PROGRESS IMPLEMENTATIONnormal2.0Kernelconfigme --allnoconfig breaks defconfig generated with kconfig / make savedefconfig PC2.2 M3
8784MediumACCEPTEDnormal2.2OE-CoreIMAGE_LINGUAS did not support multilib correctly PC2.2 M3
8851Medium+IN PROGRESS IMPLEMENTATIONenhancement2.0OE-CoreAdd bashism checks for shell script functions All2.2 M3
8880Medium+ACCEPTEDenhancement2.1OE-CoreNeed better allarch multilib sanity or automated QA tests PC2.2 M3
8884Medium+NEWnormal2.0BitBakeLocked signature warning is shown even if package can be fetched from SSTATE_MIRRORS PC2.2 M3
8919MediumNEWenhancementunspecifiedMaintenance ToolsCode coverage: add ability to create coverage-based test exclusion reports All2.2 M3
8921MediumNEWenhancementunspecifiedMaintenance ToolsCode coverage: add ability to create missing 'coverage area' reports PC2.2 M3
8943MediumNEWenhancementunspecifiedMaintenance Toolsadd a function hook that would process upstream and recipe versions PC2.2 M3
8967MediumNEWenhancement2.1OE-CoreNeed a way to cleanup DEPENDS and RDEPENDS PC2.2 M3
8970MediumACCEPTEDnormal2.0OE-Coretest_kernel_module fails with AssertionError: 137 != 0 : cd /usr/src/kernel && make scripts PC2.2 M3
9004Medium+ACCEPTEDenhancement2.1OE-CoreProduce container image providing extensible SDK PC2.2 M3
9018MediumACCEPTEDenhancementunspecifiedAutoBuilderExtend existing AutoBuilder script to schedule builds All2.2 M3
9038Medium+NEWnormal2.0OE-Coreextensible sdk - generates empty manifests/needs file with what is installed All2.2 M3
9048MediumACCEPTEDnormal2.1OE-CoreFailed to build iptables with extensible sdk on Fedora 23 i686 PC2.2 M3
9083Medium+IN PROGRESS REVIEWnormal2.1OE-CoreExtensible SDK: SDK installation ERROR: Unexpected tasks left over to be executed PC2.2 M3
9088Medium+ACCEPTEDenhancement2.1Automated Runtime TestingExtensible SDK add tests for devtool PC2.2 M3
9090Medium+ACCEPTEDenhancement2.1Automated Runtime Testingextensible sdk test compatibility with sdk PC2.2 M3
9093MediumIN PROGRESS REVIEWnormal2.0ToasterHide scary errors while importing recipe information from the layer index PC2.2 M3
9097MediumNEWnormal2.0ToasterRemove validation messages when layers checkout directory and build directory are correctly set PC2.2 M3
9104Medium+NEWnormalunspecifiedOE-Coreffmpeg libraries are missing -dbg packaging All2.2 M3
9125MediumACCEPTEDnormal2.0OE-Corearm64 dmesg test fails show dmi Firmware registration failed[8]PC2.2 M3
9131HighIN PROGRESS IMPLEMENTATIONmajor2.1OE-CorePrelink breaks fork IFUNC All2.2 M3
9132Medium+IN PROGRESS IMPLEMENTATIONenhancement2.1Automated Runtime TestingToaster automated testing inclusion at the Autobuilder PC2.2 M3
9133Medium+NEWnormal2.1Automated Runtime TestingEclipse plugin testing integrate into AB PC2.2 M3
9169MediumNEWenhancement2.2OE-Coreadd fix_buildpaths.bbclass to fix build path PC2.2 M3
9187MediumNEWnormalunspecifiedLayers[meta-swupd] implement generic versions of the update helper scripts in oe-swupd-helpers PC2.2 M3
9192MediumNEWnormal2.1Layers[meta-swupd] Support virtual images generated from a virtual recipe PC2.2 M3
9209LowACCEPTEDnormal2.0ToasterThe unique name validation for custom images happens across projects PC2.2 M3
9257MediumIN PROGRESS REVIEWenhancement2.1OE-Coreextensible SDK: need an easy way of installing toolchains PC2.2 M3
9261Medium+NEWenhancement2.1OE-CoreCan't distinguish between delayed and failed postinst All2.2 M3
9277LowNEWenhancementunspecifiedAutomated Build TestingImprove archiver testing PC2.2 M3
9281Medium+ACCEPTEDnormalunspecifiedOE-CoreChanging SDK_OS hits warnings unless you wipe tmp PC2.2 M3
9285Medium+WaitForUpstreamnormal2.1OE-CoreFailed to build gobject-introspection for qemumips64 on i686 hosts PC2.2 M3
9287Medium+NEWnormal2.1OE-CoreFailed to build nativesdk-glibc for qemumips and qemumips64 on Fedora 23 i686 PC2.2 M3
9298HighNEWenhancement2.1AutoBuilderAutobuilder enable KVM on the cluster for x86, x86-64 PC2.2 M3
9338Medium+NEWenhancement2.2OE-CoreSupport building optimised Python (with profile-opt make target) PC2.2 M3
9342Medium+ACCEPTEDenhancement2.1OE-CoreVet subprocess calls All2.2 M3
9346MediumIN PROGRESS REVIEWenhancement2.1OE-CoreRename COMPRESS_CMD_* to IMAGE_POSTPROCESS_*? All2.2 M3
9369Medium+IN PROGRESS DESIGNnormal2.2OE-CoreExtensible SDK: oe-selftest test does not test that update actually works PC2.2 M3
9377Medium+ACCEPTEDenhancementunspecifiedAutomated Build TestingEnable automated build performance testing in Autobuilder PC2.2 M3
9383Medium+NEWenhancement2.1OE-CoreMove to LSB 5 All2.2 M3
9387Medium+NEWenhancement2.0OE-CoreExtensible SDK: add image customisation functionality All2.2 M3
9395MediumNEWenhancement2.2ToasterCleanly support unicode throughout Toaster PC2.2 M3
9423MediumNEWenhancement2.2OE-Coredevshell: export CONFIGUREOPTS to env PC2.2 M3
9440Medium+NEWnormal2.3OE-CoreSERIAL_CONSOLES_CHECK doesn't work if kernel console name and device node name differ Other2.2 M3
9442MediumIN PROGRESS DESIGNenhancement2.3OE-CorePlease add virtio console to qemux86-64.conf PC2.2 M3
9447LowNEWnormal2.1ToasterTest bitbake variables - IMAGE_FSTYPES allows you to choose type "tartar.gz" PC2.2 M3
9449Medium+IN PROGRESS IMPLEMENTATIONenhancement2.2Layers[meta-swupd] Add libarchive backend to swupd-server to improve runtime of do_swupd_update PC2.2 M3
9450Medium+NEWenhancement2.2Automated Runtime TestingAdd automated runtime tests that use the musl libc rather than glibc All2.2 M3
9455Medium+IN PROGRESS IMPLEMENTATIONnormalunspecifiedToasterWhen I try to make a new project toaster cries "Fields missing: projectversion" PC2.2 M3
9460Medium+NEWenhancement2.2AutoBuilderProvide a way to automate testing of meta-mingw and meta-darwin layers. PC2.2 M3
9463LowNEWenhancement2.2OE-CoreAn easier way to debug package install (do_rootfs, do_populate_sdk) PC2.2 M3
9466Medium+IN PROGRESS IMPLEMENTATIONenhancement2.2Kernelenhance kernel configuration audit to include reasons for missing configs, and required config checking PC2.2 M3
9475Medium+IN PROGRESS REVIEWnormalunspecifiedToasterdb locking - Nothing happens when you click the "Create custom image" button PC2.2 M3
9491Medium+IN PROGRESS IMPLEMENTATIONnormal2.0OE-CoreEnable explicit removal of support packages when not needed PC2.2 M3
9494MediumNEWnormalunspecifiedToasterCustom images created from the build history pages fail to build PC2.2 M3
9499Medium+IN PROGRESS REVIEWnormal2.0OE-Corelicense.bbclass find_license_files does not process LICENSE_pn variables correctly PC2.2 M3
9502Medium+IN PROGRESS IMPLEMENTATIONenhancement2.1OE-CoreAdd a way to build container images using oe-core PC2.2 M3
9511MediumNEWenhancement2.2LayersProvide support for swupd manifest includes PC2.2 M3
9519Medium+IN PROGRESS IMPLEMENTATIONenhancementunspecifiedToasterConsolidate used API into it's own view PC2.2 M3
9530MediumNEWnormalunspecifiedToasterArrows in directory structure do not expand directories PC2.2 M3
9537Medium+NEWenhancement2.0OE-Corerecipetool: support node.js code outside of npm PC2.2 M3
9538Medium+NEWenhancement2.2OE-CoreReview common security hardening flags and expand security_flags.inc PC2.2 M3
9554Medium+NEWnormal2.1Development ManualAdd section for on-target debugging All2.2 M3
9575Medium+NEWcritical2.2Automated Build TestingTest SDK EXT failed on core-image-sato for MIPS architecture PC2.2 M3
9577Medium+NEWnormal2.2Automated Build Testinggen-lockedsig-cache fails when populating sdk ext on PPC architecture PC2.2 M3
9588HighNEWenhancement2.2OE-CoreCreate a method for describing builds and desired output. aka a build descriptor PC2.2 M3
9589Medium+NEWenhancement2.2OE-CoreCreate a script for consuming a "build descriptor" PC2.2 M3
9592HighACCEPTEDenhancement2.2Build ApplianceAdd a mechanism for creating build appliance as a container image PC2.2 M3
9611MediumNEWnormal2.0ToasterUnder Project->Bitbake variable, We disallow variables with a '/' in them PC2.2 M3
9617Medium+IN PROGRESS DESIGNnormal2.2ToasterCreate Toaster Docker production container PC2.2 M3
9624Medium+NEWenhancement2.2Automated Build Testingbuild-perf-test: store test results in Git PC2.2 M3
9625Medium+NEWenhancement2.2Automated Build Testingbuild-perf-test: re-organize test output data PC2.2 M3
9626Medium+IN PROGRESS REVIEWnormal2.3OE-CoreERROR: core-image-sato-1.0-r0 do_testsdkext: Couldn't install the SDK EXT: PC2.2 M3
9631Medium+IN PROGRESS REVIEWenhancement2.2Toasteradd state Transitions to progress bar as well as build progress. PC2.2 M3
9639Medium+NEWnormal2.1OE-Corecmake-native autodetects libidn-native PC2.2 M3
9652Medium+ACCEPTEDmajor1.8.2BSPsboot and install from USB shows warning message "(sdx): Volume was not properly unmounted...Please run fsck."[9]PC2.2 M3
9662Medium+NEWnormalunspecifiedOE-Corepatchdir fails silently if no trailing slash is present PC2.2 M3
9679Medium+ACCEPTEDenhancement2.1Development ManualAdd a small section on dependencies in the Writing a New Recipe section PC2.2 M3
9689Medium+NEWnormal2.2Automated Runtime TestingAdd support for automatic runtime testing in DUT (master bug) PC2.2 M3
      500   
Warnings were generated during the execution of function
  1. Parameter columns=id,summary,to,status,severity,priority,milestone, whiteboard is invalid using regex /^[\w,_+-~]*$/
  2. Report truncated - count greater than max allowed 501 > 500

Old Queries

Personal tools