Beagleboard-ltp

From Yocto Project
Jump to: navigation, search

Contents

1.6 M5 RC1 20140326 build

total: 32

LTP cases status owner error msg lsb comment bugzilla
getrusage03 NAB n/a getrusage03_child 1 TBROK  : malloc failed at getrusage03_child.c:154: errno=ENOMEM(12): Cannot allocate memory n/a Not enough memory. MPC8315e-rdb have 128M memory. n/a
fanotify01 NAB n/a fanotify01 1 TCONF  : fanotify is not configured in this kernel. n/a n/a
fanotify02 NAB n/a fanotify02 1 TCONF  : fanotify is not configured in this kernel. n/a n/a
fanotify04 NAB n/a fanotify04 1 TCONF  : fanotify is not configured in this kernel. n/a n/a
readahead02 NAB n/a readahead02 0 TWARN  : using less cache than expected n/a The system doesn't have /proc/pid/io, unable to determine read bytes during test n/a
setpgid03 n/a setpgid03 2 TFAIL  : setpgid FAILED, expect EACCES got 1 n/a n/a
setregid02 LTP n/a setregid02 1 TBROK  : getgrnam("nobody") failed: errno=???(0): Success n/a n/a
setregid02_16 LTP n/a setregid02_16 1 TBROK  : getgrnam("nobody") failed: errno=???(0): Success n/a n/a
syslog01 qemux86 n/a n/a n/a n/a n/a
syslog02 qemux86 n/a n/a n/a n/a n/a
syslog03 qemux86 n/a n/a n/a n/a n/a
syslog04 qemux86 n/a n/a n/a n/a n/a
syslog05 qemux86 n/a n/a n/a n/a n/a
syslog06 qemux86 n/a n/a n/a n/a n/a
syslog07 qemux86 n/a n/a n/a n/a n/a
syslog08 qemux86 n/a n/a n/a n/a n/a
syslog09 qemux86 n/a n/a n/a n/a n/a
syslog10 qemux86 n/a n/a n/a n/a n/a
mtest06_2 NAB n/a main(): mmap(): Cannot allocate memory n/a Not enough memory. Mpc8315e-rdb have 128M memory. n/a
thp02 NAB n/a thp02 1 TBROK  : cannot find "Hugepagesize:" in /proc/meminfo n/a PPC doesn't support it n/a
thp03 NAB n/a thp03 1 TBROK  : cannot find "Hugepagesize:" in /proc/meminfo n/a PPC doesn't support it n/a
su01 qemux86 n/a n/a n/a n/a n/a
cron02 qemux86 n/a n/a n/a n/a n/a
cron_deny01 qemux86 n/a n/a n/a n/a n/a
cron_allow01 qemux86 n/a n/a n/a n/a n/a
cron_dirs_checks01 qemux86 n/a n/a n/a n/a n/a
file qemux86 n/a n/a n/a n/a n/a
cron qemux86 n/a n/a n/a n/a n/a
logrotate qemux86 n/a n/a n/a n/a n/a
cpio qemux86 n/a n/a n/a n/a n/a
unzip01 qemux86 n/a n/a n/a n/a n/a
gzip01 qemux86 n/a n/a n/a n/a n/a


1.6 M4 RC1 20140312 build

total: 33

LTP cases status owner error msg lsb comment bugzilla
ftruncate04 NAB n/a mount: can't find /dev/root in /etc/fstab ftruncate04.sh : ERROR : mounting /dev/root remount,mand failed n/a Different method for mounting root n/a
ftruncate04_64 NAB n/a mount: can't find /dev/root in /etc/fstab ftruncate04.sh : ERROR : mounting /dev/root remount,mand failed n/a Different method for mounting root n/a
getrusage03 NAB n/a getrusage03_child 1 TBROK  : malloc failed at getrusage03_child.c:154: errno=ENOMEM(12): Cannot allocate memory n/a Not enough memory. MPC8315e-rdb have 128M memory. n/a
fanotify01 NAB n/a fanotify01 1 TCONF  : fanotify is not configured in this kernel. n/a n/a
fanotify02 NAB n/a fanotify02 1 TCONF  : fanotify is not configured in this kernel. n/a n/a
fanotify04 NAB n/a fanotify04 1 TCONF  : fanotify is not configured in this kernel. n/a n/a
readahead02 NAB n/a readahead02 0 TWARN  : using less cache than expected n/a The system doesn't have /proc/pid/io, unable to determine read bytes during test n/a
setregid02 LTP n/a setregid02 1 TBROK  : getgrnam("nobody") failed: errno=???(0): Success n/a n/a
setregid02_16 LTP n/a setregid02_16 1 TBROK  : getgrnam("nobody") failed: errno=???(0): Success n/a n/a
syslog01 qemux86 n/a n/a n/a n/a n/a
syslog02 qemux86 n/a n/a n/a n/a n/a
syslog03 qemux86 n/a n/a n/a n/a n/a
syslog04 qemux86 n/a n/a n/a n/a n/a
syslog05 qemux86 n/a n/a n/a n/a n/a
syslog06 qemux86 n/a n/a n/a n/a n/a
syslog07 qemux86 n/a n/a n/a n/a n/a
syslog08 qemux86 n/a n/a n/a n/a n/a
syslog09 qemux86 n/a n/a n/a n/a n/a
syslog10 qemux86 n/a n/a n/a n/a n/a
mtest06_2 NAB n/a main(): mmap(): Cannot allocate memory n/a Not enough memory. Mpc8315e-rdb have 128M memory. n/a
thp02 NAB n/a thp02 1 TBROK  : cannot find "Hugepagesize:" in /proc/meminfo n/a PPC doesn't support it n/a
thp03 NAB n/a thp03 1 TBROK  : cannot find "Hugepagesize:" in /proc/meminfo n/a PPC doesn't support it n/a
su01 qemux86 n/a n/a n/a n/a n/a
cron02 qemux86 n/a n/a n/a n/a n/a
cron_deny01 qemux86 n/a n/a n/a n/a n/a
cron_allow01 qemux86 n/a n/a n/a n/a n/a
cron_dirs_checks01 qemux86 n/a n/a n/a n/a n/a
file qemux86 n/a n/a n/a n/a n/a
cron qemux86 n/a n/a n/a n/a n/a
logrotate qemux86 n/a n/a n/a n/a n/a
cpio qemux86 n/a n/a n/a n/a n/a
unzip01 qemux86 n/a n/a n/a n/a n/a
gzip01 qemux86 n/a n/a n/a n/a n/a

1.6 M3 RC2 20140218 build

total: 34

LTP cases status owner error msg lsb comment bugzilla
ftruncate04 NAB n/a mount: can't find /dev/root in /etc/fstab ftruncate04.sh : ERROR : mounting /dev/root remount,mand failed n/a Different method for mounting root n/a
ftruncate04_64 NAB n/a mount: can't find /dev/root in /etc/fstab ftruncate04.sh : ERROR : mounting /dev/root remount,mand failed n/a Different method for mounting root n/a
getrusage03 NAB n/a getrusage03_child 1 TBROK  : malloc failed at getrusage03_child.c:154: errno=ENOMEM(12): Cannot allocate memory n/a Not enough memory. MPC8315e-rdb have 128M memory. n/a
fanotify01 NAB n/a fanotify01 1 TCONF  : fanotify is not configured in this kernel. n/a n/a
fanotify02 NAB n/a fanotify02 1 TCONF  : fanotify is not configured in this kernel. n/a n/a
fanotify04 NAB n/a fanotify04 1 TCONF  : fanotify is not configured in this kernel. n/a n/a
readahead02 NAB n/a readahead02 0 TWARN  : using less cache than expected n/a The system doesn't have /proc/pid/io, unable to determine read bytes during test n/a
setpgid03 LTP n/a setpgid03 2 TFAIL  : setpgid FAILED, expect EACCES got 1 n/a Already fixed in upstream n/a
setregid02 LTP n/a setregid02 1 TBROK  : getgrnam("nobody") failed: errno=???(0): Success n/a n/a
setregid02_16 LTP n/a setregid02_16 1 TBROK  : getgrnam("nobody") failed: errno=???(0): Success n/a n/a
syslog01 qemux86 n/a n/a n/a n/a n/a
syslog02 qemux86 n/a n/a n/a n/a n/a
syslog03 qemux86 n/a n/a n/a n/a n/a
syslog04 qemux86 n/a n/a n/a n/a n/a
syslog05 qemux86 n/a n/a n/a n/a n/a
syslog06 qemux86 n/a n/a n/a n/a n/a
syslog07 qemux86 n/a n/a n/a n/a n/a
syslog08 qemux86 n/a n/a n/a n/a n/a
syslog09 qemux86 n/a n/a n/a n/a n/a
syslog10 qemux86 n/a n/a n/a n/a n/a
mtest06_2 NAB n/a main(): mmap(): Cannot allocate memory n/a Not enough memory. Mpc8315e-rdb have 128M memory. n/a
thp02 NAB n/a thp02 1 TBROK  : cannot find "Hugepagesize:" in /proc/meminfo n/a PPC doesn't support it n/a
thp03 NAB n/a thp03 1 TBROK  : cannot find "Hugepagesize:" in /proc/meminfo n/a PPC doesn't support it n/a
su01 qemux86 n/a n/a n/a n/a n/a
cron02 qemux86 n/a n/a n/a n/a n/a
cron_deny01 qemux86 n/a n/a n/a n/a n/a
cron_allow01 qemux86 n/a n/a n/a n/a n/a
cron_dirs_checks01 qemux86 n/a n/a n/a n/a n/a
file qemux86 n/a n/a n/a n/a n/a
cron qemux86 n/a n/a n/a n/a n/a
logrotate qemux86 n/a n/a n/a n/a n/a
cpio qemux86 n/a n/a n/a n/a n/a
unzip01 qemux86 n/a n/a n/a n/a n/a
gzip01 qemux86 n/a n/a n/a n/a n/a

1.6 M3 RC1 20140213 build

total: 34

LTP cases status owner error msg lsb comment bugzilla
ftruncate04 NAB n/a mount: can't find /dev/root in /etc/fstab ftruncate04.sh : ERROR : mounting /dev/root remount,mand failed n/a Different method for mounting root n/a
ftruncate04_64 NAB n/a mount: can't find /dev/root in /etc/fstab ftruncate04.sh : ERROR : mounting /dev/root remount,mand failed n/a Different method for mounting root n/a
getrusage03 NAB n/a getrusage03_child 1 TBROK  : malloc failed at getrusage03_child.c:154: errno=ENOMEM(12): Cannot allocate memory n/a Not enough memory. MPC8315e-rdb have 128M memory. n/a
fanotify01 NAB n/a fanotify01 1 TCONF  : fanotify is not configured in this kernel. n/a n/a
fanotify02 NAB n/a fanotify02 1 TCONF  : fanotify is not configured in this kernel. n/a n/a
fanotify04 NAB n/a fanotify04 1 TCONF  : fanotify is not configured in this kernel. n/a n/a
readahead02 NAB n/a readahead02 0 TWARN  : using less cache than expected n/a The system doesn't have /proc/pid/io, unable to determine read bytes during test n/a
setpgid03 LTP n/a setpgid03 2 TFAIL  : setpgid FAILED, expect EACCES got 1 n/a Already fixed in upstream n/a
setregid02 LTP n/a setregid02 1 TBROK  : getgrnam("nobody") failed: errno=???(0): Success n/a n/a
setregid02_16 LTP n/a setregid02_16 1 TBROK  : getgrnam("nobody") failed: errno=???(0): Success n/a n/a
syslog01 qemux86 n/a n/a n/a n/a n/a
syslog02 qemux86 n/a n/a n/a n/a n/a
syslog03 qemux86 n/a n/a n/a n/a n/a
syslog04 qemux86 n/a n/a n/a n/a n/a
syslog05 qemux86 n/a n/a n/a n/a n/a
syslog06 qemux86 n/a n/a n/a n/a n/a
syslog07 qemux86 n/a n/a n/a n/a n/a
syslog08 qemux86 n/a n/a n/a n/a n/a
syslog09 qemux86 n/a n/a n/a n/a n/a
syslog10 qemux86 n/a n/a n/a n/a n/a
mtest06_2 NAB n/a main(): mmap(): Cannot allocate memory n/a Not enough memory. Mpc8315e-rdb have 128M memory. n/a
thp02 NAB n/a thp02 1 TBROK  : cannot find "Hugepagesize:" in /proc/meminfo n/a PPC doesn't support it n/a
thp03 NAB n/a thp03 1 TBROK  : cannot find "Hugepagesize:" in /proc/meminfo n/a PPC doesn't support it n/a
su01 qemux86 n/a n/a n/a n/a n/a
cron02 qemux86 n/a n/a n/a n/a n/a
cron_deny01 qemux86 n/a n/a n/a n/a n/a
cron_allow01 qemux86 n/a n/a n/a n/a n/a
cron_dirs_checks01 qemux86 n/a n/a n/a n/a n/a
file qemux86 n/a n/a n/a n/a n/a
cron qemux86 n/a n/a n/a n/a n/a
logrotate qemux86 n/a n/a n/a n/a n/a
cpio qemux86 n/a n/a n/a n/a n/a
unzip01 qemux86 n/a n/a n/a n/a n/a
gzip01 qemux86 n/a n/a n/a n/a n/a

1.6 M2 RC1 20140114 build

total: 29

LTP cases status owner error msg lsb comment bugzilla
max_map_count n/a max_map_count 5 TFAIL  : 16386 map entries in total, but expected 16384 entries n/a n/a
ftruncate04 NAB n/a mount: can't find /dev/root in /etc/fstab ftruncate04.sh : ERROR : mounting /dev/root remount,mand failed n/a Different method for mounting root n/a
ftruncate04_64 NAB n/a mount: can't find /dev/root in /etc/fstab ftruncate04.sh : ERROR : mounting /dev/root remount,mand failed n/a Different method for mounting root n/a
getrusage03 NAB n/a getrusage03_child 1 TBROK  : malloc failed at getrusage03_child.c:154: errno=ENOMEM(12): Cannot allocate memory n/a Not enough memory. MPC8315e-rdb have 128M memory. n/a
readahead02 NAB n/a readahead02 0 TWARN  : using less cache than expected n/a The system doesn't have /proc/pid/io, unable to determine read bytes during test n/a
syslog01 qemux86 n/a n/a n/a n/a n/a
syslog02 qemux86 n/a n/a n/a n/a n/a
syslog03 qemux86 n/a n/a n/a n/a n/a
syslog04 qemux86 n/a n/a n/a n/a n/a
syslog05 qemux86 n/a n/a n/a n/a n/a
syslog06 qemux86 n/a n/a n/a n/a n/a
syslog07 qemux86 n/a n/a n/a n/a n/a
syslog08 qemux86 n/a n/a n/a n/a n/a
syslog09 qemux86 n/a n/a n/a n/a n/a
syslog10 qemux86 n/a n/a n/a n/a n/a
mtest06_2 NAB n/a main(): mmap(): Cannot allocate memory n/a Not enough memory. Mpc8315e-rdb have 128M memory. n/a
thp02 NAB n/a thp02 1 TBROK  : cannot find "Hugepagesize:" in /proc/meminfo n/a PPC doesn't support it n/a
thp03 NAB n/a thp03 1 TBROK  : cannot find "Hugepagesize:" in /proc/meminfo n/a PPC doesn't support it n/a
su01 qemux86 n/a n/a n/a n/a n/a
cron02 qemux86 n/a n/a n/a n/a n/a
cron_deny01 qemux86 n/a n/a n/a n/a n/a
cron_allow01 qemux86 n/a n/a n/a n/a n/a
cron_dirs_checks01 qemux86 n/a n/a n/a n/a n/a
file qemux86 n/a n/a n/a n/a n/a
cron qemux86 n/a n/a n/a n/a n/a
logrotate qemux86 n/a n/a n/a n/a n/a
cpio qemux86 n/a n/a n/a n/a n/a
unzip01 qemux86 n/a n/a n/a n/a n/a
gzip01 qemux86 n/a n/a n/a n/a n/a

1.4.1 RC1 20130612 build

total: 23

LTP cases status owner error msg lsb comment bugzilla
setpgid03 LTP n/a setpgid03 2 TFAIL  : setpgid FAILED, expect EACCES got 1 n/a The lack of sync mechanism between father and child process cause this issue. When father process exec first, setpgid will reture "EPERM" which is not expected by the test case n/a
acl_test01 NAB n/a Can not mount ext3 file system with acl and user_xattr options n/a Kernel doesn't support n/a
aio02 NAB n/a io_fsync write: Invalid argument n/a io_fsync() calls the syscall io_submit(). When doing IO_CMD_FSYNC and IO_CMD_FDSYNC, Linux kernel will involve the filesystem's aio_fsync and aio_fdsync operations, and if the filesystem doesn't implement these two operations, it will return -EINVAL. In general, this CMD is not implemented in Linux kernel. n/a
thp02 NAB n/a thp02 1 TBROK  : cannot find "Hugepagesize:" in /proc/meminfo n/a ARM doesn't support this. n/a
max_map_count NAB n/a max_map_count 0 TINFO  : set max_map_count to 64

max_map_count 1 TFAIL  : 65 map entries in total, but expected 64 entries

n/a Test case fails because the difference of system implement n/a
getrusage03 NAB n/a getrusage03_child 1 TBROK  : malloc failed at getrusage03_child.c:154: errno=ENOMEM(12): Cannot allocate memory n/a Not enough memory. Beagleboard have 256M memory. n/a
getrusage04 LTP n/a getrusage04 1 TFAIL  : stime increased > 2000us: delta = 7812us n/a This is a LTP bug. On a slow system (ARMv5, 33MHz), even factor_nr is set to 10, the test still get failed. n/a
sysctl03 qemux86 n/a n/a n/a n/a n/a
syslog01 qemux86 n/a n/a n/a n/a n/a
syslog02 qemux86 n/a n/a n/a n/a n/a
mtest06_2 NAB n/a main(): mmap(): Cannot allocate memory n/a Not enough memory. Beagleboard has 256M memory. n/a
ksm05 LTP n/a ksm05 1 TBROK  : open: errno=ENOENT(2): No such file or directory n/a It is a LTP bug. KSM configuration is not enabled, this test should skip. n/a
su01 qemux86 n/a n/a n/a n/a n/a
cron02 qemux86 n/a n/a n/a n/a n/a
cron_deny01 qemux86 n/a n/a n/a n/a n/a
cron_allow01 qemux86 n/a n/a n/a n/a n/a
cron_dirs_checks01 qemux86 n/a n/a n/a n/a n/a
file qemux86 n/a n/a n/a n/a n/a
cron qemux86 n/a n/a n/a n/a n/a
logrotate qemux86 n/a n/a n/a n/a n/a
cpio qemux86 n/a n/a n/a n/a n/a
unzip01 qemux86 n/a n/a n/a n/a n/a
gzip01 qemux86 n/a n/a n/a n/a n/a

1.5 20130604 build

total: 28

LTP cases status owner error msg lsb comment bugzilla
ftruncate04 NAB n/a mount: can't find /dev/root in /etc/fstab ftruncate04.sh : ERROR : mounting /dev/root remount,mand failed n/a Different method for mounting root n/a
ftruncate04_64 NAB n/a mount: can't find /dev/root in /etc/fstab ftruncate04.sh : ERROR : mounting /dev/root remount,mand failed n/a Different method for mounting root n/a
readahead02 NAB n/a readahead02 0 TWARN  : using less cache than expected n/a The system doesn't have /proc/pid/io, unable to determine read bytes during test n/a
waitid02 LTP n/a waitid02 6 TFAIL  : Fail6 ... -1 is returned: TEST_ERRNO=ECHILD(10): No child processes n/a Missing wait for last child in the code. Fixed in upstream n/a
setpgid03 LTP n/a setpgid03 2 TFAIL  : setpgid FAILED, expect EACCES got 1 n/a The lack of sync mechanism between father and child process cause this issue. When father process exec first, setpgid will reture "EPERM" which is not expected by the test case n/a
acl_test01 NAB n/a Can not mount ext3 file system with acl and user_xattr options n/a Kernel doesn't support n/a
aio02 NAB n/a io_fsync write: Invalid argument n/a io_fsync() calls the syscall io_submit(). When doing IO_CMD_FSYNC and IO_CMD_FDSYNC, Linux kernel will involve the filesystem's aio_fsync and aio_fdsync operations, and if the filesystem doesn't implement these two operations, it will return -EINVAL. In general, this CMD is not implemented in Linux kernel. n/a
thp02 NAB n/a thp02 1 TBROK  : cannot find "Hugepagesize:" in /proc/meminfo n/a ARM doesn't support this. n/a
thp03 NAB n/a thp03 1 TBROK  : cannot find "Hugepagesize:" in /proc/meminfo n/a PPC doesn't support it n/a
max_map_count NAB n/a max_map_count 0 TINFO  : set max_map_count to 64

max_map_count 1 TFAIL  : 65 map entries in total, but expected 64 entries

n/a Test case fails because the difference of system implement n/a
getrusage03 NAB n/a getrusage03_child 1 TBROK  : malloc failed at getrusage03_child.c:154: errno=ENOMEM(12): Cannot allocate memory n/a Not enough memory. Beagleboard have 256M memory. n/a
getrusage04 LTP n/a getrusage04 1 TFAIL  : stime increased > 2000us: delta = 7812us n/a This is a LTP bug. On a slow system (ARMv5, 33MHz), even factor_nr is set to 10, the test still get failed. n/a
sysctl03 qemux86 n/a n/a n/a n/a n/a
syslog01 qemux86 n/a n/a n/a n/a n/a
syslog02 qemux86 n/a n/a n/a n/a n/a
mtest06_2 NAB n/a main(): mmap(): Cannot allocate memory n/a Not enough memory. Beagleboard has 256M memory. n/a
ksm05 LTP n/a ksm05 1 TBROK  : open: errno=ENOENT(2): No such file or directory n/a It is a LTP bug. KSM configuration is not enabled, this test should skip. n/a
su01 qemux86 n/a n/a n/a n/a n/a
cron02 qemux86 n/a n/a n/a n/a n/a
cron_deny01 qemux86 n/a n/a n/a n/a n/a
cron_allow01 qemux86 n/a n/a n/a n/a n/a
cron_dirs_checks01 qemux86 n/a n/a n/a n/a n/a
file qemux86 n/a n/a n/a n/a n/a
cron qemux86 n/a n/a n/a n/a n/a
logrotate qemux86 n/a n/a n/a n/a n/a
cpio qemux86 n/a n/a n/a n/a n/a
unzip01 qemux86 n/a n/a n/a n/a n/a
gzip01 qemux86 n/a n/a n/a n/a n/a

1.3.2 20130516 build

total: 23

LTP cases status owner error msg lsb comment bugzilla
setpgid03 LTP n/a setpgid03 2 TFAIL  : setpgid FAILED, expect EACCES got 1 n/a The lack of sync mechanism between father and child process cause this issue. When father process exec first, setpgid will reture "EPERM" which is not expected by the test case n/a
acl_test01 NAB n/a Can not mount ext3 file system with acl and user_xattr options n/a Kernel doesn't support n/a
aio02 NAB n/a io_fsync write: Invalid argument n/a io_fsync() calls the syscall io_submit(). When doing IO_CMD_FSYNC and IO_CMD_FDSYNC, Linux kernel will involve the filesystem's aio_fsync and aio_fdsync operations, and if the filesystem doesn't implement these two operations, it will return -EINVAL. In general, this CMD is not implemented in Linux kernel. n/a
thp02 NAB n/a thp02 1 TBROK  : cannot find "Hugepagesize:" in /proc/meminfo n/a ARM doesn't support this. n/a
max_map_count NAB n/a max_map_count 0 TINFO  : set max_map_count to 64

max_map_count 1 TFAIL  : 65 map entries in total, but expected 64 entries

n/a Test case fails because the difference of system implement n/a
getrusage03 NAB n/a getrusage03_child 1 TBROK  : malloc failed at getrusage03_child.c:154: errno=ENOMEM(12): Cannot allocate memory n/a Not enough memory. Beagleboard have 256M memory. n/a
getrusage04 LTP n/a getrusage04 1 TFAIL  : stime increased > 2000us: delta = 7812us n/a This is a LTP bug. On a slow system (ARMv5, 33MHz), even factor_nr is set to 10, the test still get failed. n/a
sysctl03 qemux86 n/a n/a n/a n/a n/a
syslog01 qemux86 n/a n/a n/a n/a n/a
syslog02 qemux86 n/a n/a n/a n/a n/a
mtest06_2 NAB n/a main(): mmap(): Cannot allocate memory n/a Not enough memory. Beagleboard has 256M memory. n/a
ksm05 LTP n/a ksm05 1 TBROK  : open: errno=ENOENT(2): No such file or directory n/a It is a LTP bug. KSM configuration is not enabled, this test should skip. n/a
ar01 LTP n/a FAIL - ar could not complete the archive ; killed by SIGHUP n/a n/a
su01 qemux86 n/a n/a n/a n/a n/a
cron02 qemux86 n/a n/a n/a n/a n/a
cron_deny01 qemux86 n/a n/a n/a n/a n/a
cron_allow01 qemux86 n/a n/a n/a n/a n/a
cron_dirs_checks01 qemux86 n/a n/a n/a n/a n/a
file qemux86 n/a n/a n/a n/a n/a
cron qemux86 n/a n/a n/a n/a n/a
logrotate qemux86 n/a n/a n/a n/a n/a
cpio qemux86 n/a n/a n/a n/a n/a
unzip01 qemux86 n/a n/a n/a n/a n/a

1.4 M6 RC2 20130418 build

total: 23

LTP cases status owner error msg lsb comment bugzilla
shmat01 LTP n/a shmat01 1 TFAIL  : shmat call failed: TEST_ERRNO=EINVAL(22): Invalid argument n/a It is a LTP bug. Need pick suitable base_addr before each testcase. n/a
acl_test01 NAB n/a Can not mount ext3 file system with acl and user_xattr options n/a Kernel doesn't support n/a
aio02 NAB n/a io_fsync write: Invalid argument n/a io_fsync() calls the syscall io_submit(). When doing IO_CMD_FSYNC and IO_CMD_FDSYNC, Linux kernel will involve the filesystem's aio_fsync and aio_fdsync operations, and if the filesystem doesn't implement these two operations, it will return -EINVAL. In general, this CMD is not implemented in Linux kernel. n/a
thp02 NAB n/a thp02 1 TBROK  : cannot find "Hugepagesize:" in /proc/meminfo n/a ARM doesn't support this. n/a
max_map_count NAB n/a max_map_count 0 TINFO  : set max_map_count to 64

max_map_count 1 TFAIL  : 65 map entries in total, but expected 64 entries

n/a Test case fails because the difference of system implement n/a
getrusage03 NAB n/a getrusage03_child 1 TBROK  : malloc failed at getrusage03_child.c:154: errno=ENOMEM(12): Cannot allocate memory n/a Not enough memory. Beagleboard have 256M memory. n/a
getrusage04 LTP n/a getrusage04 1 TFAIL  : stime increased > 2000us: delta = 7812us n/a This is a LTP bug. On a slow system (ARMv5, 33MHz), even factor_nr is set to 10, the test still get failed. n/a
sysctl03 qemux86 n/a n/a n/a n/a n/a
syslog01 qemux86 n/a n/a n/a n/a n/a
syslog02 qemux86 n/a n/a n/a n/a n/a
mtest06_2 NAB n/a main(): mmap(): Cannot allocate memory n/a Not enough memory. Beagleboard has 256M memory. n/a
ksm05 LTP n/a ksm05 1 TBROK  : open: errno=ENOENT(2): No such file or directory n/a It is a LTP bug. KSM configuration is not enabled, this test should skip. n/a
su01 qemux86 n/a n/a n/a n/a n/a
cron02 qemux86 n/a n/a n/a n/a n/a
cron_deny01 qemux86 n/a n/a n/a n/a n/a
cron_allow01 qemux86 n/a n/a n/a n/a n/a
cron_dirs_checks01 qemux86 n/a n/a n/a n/a n/a
file qemux86 n/a n/a n/a n/a n/a
cron qemux86 n/a n/a n/a n/a n/a
logrotate qemux86 n/a n/a n/a n/a n/a
cpio qemux86 n/a n/a n/a n/a n/a
unzip01 qemux86 n/a n/a n/a n/a n/a
gzip01 qemux86 n/a n/a n/a n/a n/a

1.4 M5 RC3 20130403 build

total: 24

LTP cases status owner error msg lsb comment bugzilla
setpgid03 LTP n/a setpgid03 2 TFAIL  : setpgid FAILED, expect EACCES got 1 n/a It is a LTP bug. Need add sync mechanism to insure the 'setpgid' get invoked in the right. n/a
shmat01 LTP n/a shmat01 1 TFAIL  : shmat call failed: TEST_ERRNO=EINVAL(22): Invalid argument n/a It is a LTP bug. Need pick suitable base_addr before each testcase. n/a
acl_test01 NAB n/a Can not mount ext3 file system with acl and user_xattr options n/a Kernel doesn't support n/a
aio02 NAB n/a io_fsync write: Invalid argument n/a io_fsync() calls the syscall io_submit(). When doing IO_CMD_FSYNC and IO_CMD_FDSYNC, Linux kernel will involve the filesystem's aio_fsync and aio_fdsync operations, and if the filesystem doesn't implement these two operations, it will return -EINVAL. In general, this CMD is not implemented in Linux kernel. n/a
thp02 NAB n/a thp02 1 TBROK  : cannot find "Hugepagesize:" in /proc/meminfo n/a ARM doesn't support this. n/a
max_map_count NAB n/a max_map_count 0 TINFO  : set max_map_count to 64

max_map_count 1 TFAIL  : 65 map entries in total, but expected 64 entries

n/a Test case fails because the difference of system implement n/a
getrusage03 NAB n/a getrusage03_child 1 TBROK  : malloc failed at getrusage03_child.c:154: errno=ENOMEM(12): Cannot allocate memory n/a Not enough memory. Beagleboard have 256M memory. n/a
getrusage04 LTP n/a getrusage04 1 TFAIL  : stime increased > 2000us: delta = 7812us n/a This is a LTP bug. On a slow system (ARMv5, 33MHz), even factor_nr is set to 10, the test still get failed. n/a
sysctl03 qemux86 n/a n/a n/a n/a n/a
syslog01 qemux86 n/a n/a n/a n/a n/a
syslog02 qemux86 n/a n/a n/a n/a n/a
mtest06_2 NAB n/a main(): mmap(): Cannot allocate memory n/a Not enough memory. Beagleboard has 256M memory. n/a
ksm05 LTP n/a ksm05 1 TBROK  : open: errno=ENOENT(2): No such file or directory n/a It is a LTP bug. KSM configuration is not enabled, this test should skip. n/a
su01 qemux86 n/a n/a n/a n/a n/a
cron02 qemux86 n/a n/a n/a n/a n/a
cron_deny01 qemux86 n/a n/a n/a n/a n/a
cron_allow01 qemux86 n/a n/a n/a n/a n/a
cron_dirs_checks01 qemux86 n/a n/a n/a n/a n/a
file qemux86 n/a n/a n/a n/a n/a
cron qemux86 n/a n/a n/a n/a n/a
logrotate qemux86 n/a n/a n/a n/a n/a
cpio qemux86 n/a n/a n/a n/a n/a
unzip01 qemux86 n/a n/a n/a n/a n/a
gzip01 qemux86 n/a n/a n/a n/a n/a

1.4 M5 RC2 20130327 build

total: 24 (100%)

LTP cases status owner error msg lsb comment bugzilla
setpgid03 NAB n/a setpgid03 2 TFAIL  : setpgid FAILED, expect EACCES got 1 n/a It is a LTP bug. Need add sync mechanism to insure the 'setpgid' get invoked in the right. n/a
shmat01 NAB n/a shmat01 1 TFAIL  : shmat call failed: TEST_ERRNO=EINVAL(22): Invalid argument n/a It is a LTP bug. Need pick suitable base_addr before each testcase. n/a
acl_test01 NAB n/a Can not mount ext3 file system with acl and user_xattr options n/a Kernel doesn't support n/a
aio02 NAB n/a io_fsync write: Invalid argument n/a io_fsync write: Invalid argument n/a
thp02 NAB n/a thp02 1 TBROK  : cannot find "Hugepagesize:" in /proc/meminfo n/a ARM doesn't support this. n/a
max_map_count NAB n/a max_map_count 0 TINFO  : set max_map_count to 64

max_map_count 1 TFAIL  : 65 map entries in total, but expected 64 entries

n/a Test case fails because the difference of system implement n/a
getrusage03 NAB n/a getrusage03_child 1 TBROK  : malloc failed at getrusage03_child.c:154: errno=ENOMEM(12): Cannot allocate memory n/a Not enough memory. Beagleboard have 256M memory. n/a
getrusage04 LTP n/a getrusage04 1 TFAIL  : stime increased > 2000us: delta = 7812us n/a This is a LTP bug. n/a
sysctl03 qemux86 n/a n/a n/a n/a n/a
syslog01 qemux86 n/a n/a n/a n/a n/a
syslog02 qemux86 n/a n/a n/a n/a n/a
mtest06_2 NAB n/a main(): mmap(): Cannot allocate memory n/a Not enough memory. Beagleboard has 256M memory. n/a
ksm05 LTP n/a ksm05 1 TBROK  : open: errno=ENOENT(2): No such file or directory n/a It is a LTP bug. n/a
su01 qemux86 n/a n/a n/a n/a n/a
cron02 qemux86 n/a n/a n/a n/a n/a
cron_deny01 qemux86 n/a n/a n/a n/a n/a
cron_allow01 qemux86 n/a n/a n/a n/a n/a
cron_dirs_checks01 qemux86 n/a n/a n/a n/a n/a
file qemux86 n/a n/a n/a n/a n/a
cron qemux86 n/a n/a n/a n/a n/a
logrotate qemux86 n/a n/a n/a n/a n/a
cpio qemux86 n/a n/a n/a n/a n/a
unzip01 qemux86 n/a n/a n/a n/a n/a
gzip01 qemux86 n/a n/a n/a n/a n/a

1.4 M4 RC1 20130220 build

total: 22 (100%)

LTP cases status owner error msg lsb comment bugzilla
acl_test01 NAB n/a Can not mount ext3 file system with acl and user_xattr options n/a Kernel doesn't support n/a
aio02 NAB n/a io_fsync write: Invalid argument n/a io_fsync write: Invalid argument n/a
thp02 NAB n/a thp02 1 TBROK  : cannot find "Hugepagesize:" in /proc/meminfo n/a ARM doesn't support this. n/a
max_map_count NAB n/a max_map_count 0 TINFO  : set max_map_count to 64

max_map_count 1 TFAIL  : 65 map entries in total, but expected 64 entries

n/a Test case fails because the difference of system implement n/a
getrusage03 NAB n/a getrusage03_child 1 TBROK  : malloc failed at getrusage03_child.c:154: errno=ENOMEM(12): Cannot allocate memory n/a Not enough memory. Beagleboard have 256M memory. n/a
getrusage04 LTP n/a getrusage04 1 TFAIL  : stime increased > 2000us: delta = 7812us n/a This is a LTP bug. n/a
sysctl03 qemux86 n/a n/a n/a n/a n/a
syslog01 qemux86 n/a n/a n/a n/a n/a
syslog02 qemux86 n/a n/a n/a n/a n/a
mtest06_2 NAB n/a main(): mmap(): Cannot allocate memory n/a Not enough memory. Beagleboard has 256M memory. n/a
ksm05 LTP n/a ksm05 1 TBROK  : open: errno=ENOENT(2): No such file or directory n/a It is a LTP bug. n/a
su01 qemux86 n/a n/a n/a n/a n/a
cron02 qemux86 n/a n/a n/a n/a n/a
cron_deny01 qemux86 n/a n/a n/a n/a n/a
cron_allow01 qemux86 n/a n/a n/a n/a n/a
cron_dirs_checks01 qemux86 n/a n/a n/a n/a n/a
file qemux86 n/a n/a n/a n/a n/a
cron qemux86 n/a n/a n/a n/a n/a
logrotate qemux86 n/a n/a n/a n/a n/a
cpio qemux86 n/a n/a n/a n/a n/a
unzip01 qemux86 n/a n/a n/a n/a n/a
gzip01 qemux86 n/a n/a n/a n/a n/a

1.4 M3 RC2 20130131 build

total: 24 (100%)

LTP cases status owner error msg lsb comment bugzilla
setpgid03 NEW n/a setpgid03 2 TFAIL  : setpgid FAILED, expect EACCES got 1 n/a n/a
acl_test01 NAB n/a Can not mount ext3 file system with acl and user_xattr options n/a Kernel doesn't support n/a
ar01 NEW n/a FAIL - ar could not complete the archive ; killed by SIGHUP n/a n/a
aio02 NAB n/a io_fsync write: Invalid argument n/a io_fsync write: Invalid argument n/a
thp02 NAB n/a thp02 1 TBROK  : cannot find "Hugepagesize:" in /proc/meminfo n/a ARM doesn't support this. n/a
max_map_count NAB n/a max_map_count 0 TINFO  : set max_map_count to 64

max_map_count 1 TFAIL  : 65 map entries in total, but expected 64 entries

n/a Test case fails because the difference of system implement n/a
getrusage03 NAB n/a getrusage03_child 1 TBROK  : malloc failed at getrusage03_child.c:154: errno=ENOMEM(12): Cannot allocate memory n/a Not enough memory. Beagleboard have 256M memory. n/a
getrusage04 LTP n/a getrusage04 1 TFAIL  : stime increased > 2000us: delta = 7812us n/a This is a LTP bug. n/a
sysctl03 qemux86 n/a n/a n/a n/a n/a
syslog01 qemux86 n/a n/a n/a n/a n/a
syslog02 qemux86 n/a n/a n/a n/a n/a
mtest06_2 NAB n/a main(): mmap(): Cannot allocate memory n/a Not enough memory. Beagleboard has 256M memory. n/a
ksm05 LTP n/a ksm05 1 TBROK  : open: errno=ENOENT(2): No such file or directory n/a It is a LTP bug. n/a
su01 qemux86 n/a n/a n/a n/a n/a
cron02 qemux86 n/a n/a n/a n/a n/a
cron_deny01 qemux86 n/a n/a n/a n/a n/a
cron_allow01 qemux86 n/a n/a n/a n/a n/a
cron_dirs_checks01 qemux86 n/a n/a n/a n/a n/a
file qemux86 n/a n/a n/a n/a n/a
cron qemux86 n/a n/a n/a n/a n/a
logrotate qemux86 n/a n/a n/a n/a n/a
cpio qemux86 n/a n/a n/a n/a n/a
unzip01 qemux86 n/a n/a n/a n/a n/a
gzip01 qemux86 n/a n/a n/a n/a n/a

1.4 M3 RC1 20130122 build

total: 22 (100%)

LTP cases status owner error msg lsb comment bugzilla
acl_test01 NAB n/a Can not mount ext3 file system with acl and user_xattr options n/a Kernel doesn't support n/a
ar01 NEW n/a FAIL - ar could not complete the archive ; killed by SIGHUP n/a n/a
aio02 NAB n/a io_fsync write: Invalid argument n/a io_fsync write: Invalid argument n/a
thp02 NAB n/a thp02 1 TBROK  : cannot find "Hugepagesize:" in /proc/meminfo n/a ARM doesn't support this. n/a
max_map_count NAB n/a max_map_count 0 TINFO  : set max_map_count to 64

max_map_count 1 TFAIL  : 65 map entries in total, but expected 64 entries

n/a Test case fails because the difference of system implement n/a
getrusage03 NAB n/a getrusage03_child 1 TBROK  : malloc failed at getrusage03_child.c:154: errno=ENOMEM(12): Cannot allocate memory n/a Not enough memory. Beagleboard have 256M memory. n/a
getrusage04 LTP n/a getrusage04 1 TFAIL  : stime increased > 2000us: delta = 7812us n/a This is a LTP bug. n/a
sysctl03 qemux86 n/a n/a n/a n/a n/a
syslog01 qemux86 n/a n/a n/a n/a n/a
syslog02 qemux86 n/a n/a n/a n/a n/a
mtest06_2 NAB n/a main(): mmap(): Cannot allocate memory n/a Not enough memory. Beagleboard has 256M memory. n/a
ksm05 LTP n/a ksm05 1 TBROK  : open: errno=ENOENT(2): No such file or directory n/a It is a LTP bug. n/a
su01 qemux86 n/a n/a n/a n/a n/a
cron02 qemux86 n/a n/a n/a n/a n/a
cron_deny01 qemux86 n/a n/a n/a n/a n/a
cron_allow01 qemux86 n/a n/a n/a n/a n/a
cron_dirs_checks01 qemux86 n/a n/a n/a n/a n/a
file qemux86 n/a n/a n/a n/a n/a
cron qemux86 n/a n/a n/a n/a n/a
logrotate qemux86 n/a n/a n/a n/a n/a
cpio qemux86 n/a n/a n/a n/a n/a
unzip01 qemux86 n/a n/a n/a n/a n/a

1.4 M1 RC1 20121128 build

total: 22 (100%)

LTP cases status owner error msg lsb comment bugzilla
acl_test01 NAB n/a Can not mount ext3 file system with acl and user_xattr options n/a Kernel doesn't support n/a
shmat01 NEW n/a shmat01 1 TFAIL  : shmat call failed: TEST_ERRNO=EINVAL(22): Invalid argument n/a n/a
aio02 NAB n/a io_fsync write: Invalid argument n/a io_fsync write: Invalid argument n/a
thp02 NAB n/a thp02 1 TBROK  : cannot find "Hugepagesize:" in /proc/meminfo n/a ARM doesn't support this. n/a
max_map_count NAB n/a max_map_count 0 TINFO  : set max_map_count to 64

max_map_count 1 TFAIL  : 65 map entries in total, but expected 64 entries

n/a Test case fails because the difference of system implement n/a
getrusage03 NAB n/a getrusage03_child 1 TBROK  : malloc failed at getrusage03_child.c:154: errno=ENOMEM(12): Cannot allocate memory n/a Not enough memory. Beagleboard have 256M memory. n/a
getrusage04 LTP n/a getrusage04 1 TFAIL  : stime increased > 2000us: delta = 7812us n/a This is a LTP bug. n/a
sysctl03 qemux86 n/a n/a n/a n/a n/a
syslog01 qemux86 n/a n/a n/a n/a n/a
syslog02 qemux86 n/a n/a n/a n/a n/a
mtest06_2 NAB n/a main(): mmap(): Cannot allocate memory n/a Not enough memory. Beagleboard has 256M memory. n/a
ksm05 LTP n/a ksm05 1 TBROK  : open: errno=ENOENT(2): No such file or directory n/a It is a LTP bug. n/a
su01 qemux86 n/a n/a n/a n/a n/a
cron02 qemux86 n/a n/a n/a n/a n/a
cron_deny01 qemux86 n/a n/a n/a n/a n/a
cron_allow01 qemux86 n/a n/a n/a n/a n/a
cron_dirs_checks01 qemux86 n/a n/a n/a n/a n/a
file qemux86 n/a n/a n/a n/a n/a
cron qemux86 n/a n/a n/a n/a n/a
logrotate qemux86 n/a n/a n/a n/a n/a
cpio qemux86 n/a n/a n/a n/a n/a
unzip01 qemux86 n/a n/a n/a n/a n/a

1.2.2 20121018 build

total: 23 (100%)

LTP cases status owner error msg lsb comment bugzilla
process_vm_readv01 NAB n/a process_vm_readv 29 TFAIL  : unexpected failure - expected = 14 : Bad address, actual: TEST_ERRNO=???(38): Function not implemented n/a Kernel doesn't support n/a
process_vm_writev01 NAB n/a process_vm_writev 29 TFAIL  : unexpected failure - expected = 14 : Bad address, actual: TEST_ERRNO=???(38): Function not implemented n/a Kernel doesn't support n/a
getcontext01 NAB n/a getcontext01 1 TFAIL  : getcontext failed: TEST_ERRNO=???(38): Function not implemented n/a Kernel doesn't support n/a
mem02 LTP n/a mem02 1 TFAIL  : free did not dealloc memory n/a It is a LTP bug and fixed in upstream n/a
aio02 NAB n/a io_fsync write: Invalid argument n/a io_fsync write: Invalid argument n/a
thp02 NAB n/a thp02 1 TBROK  : cannot find "Hugepagesize:" in /proc/meminfo n/a ARM doesn't support this. n/a
getrusage03 NAB n/a getrusage03_child 1 TBROK  : malloc failed at getrusage03_child.c:154: errno=ENOMEM(12): Cannot allocate memory n/a Not enough memory. Beagleboard have 256M memory. n/a
getrusage04 LTP n/a getrusage04 1 TFAIL  : stime increased > 2000us: delta = 7812us n/a This is a LTP bug. n/a
sysctl03 qemux86 n/a n/a n/a n/a n/a
syslog01 qemux86 n/a n/a n/a n/a n/a
syslog02 qemux86 n/a n/a n/a n/a n/a
mtest06_2 NAB n/a main(): mmap(): Cannot allocate memory n/a Not enough memory. Beagleboard has 256M memory. n/a
ksm05 LTP n/a ksm05 1 TBROK  : open: errno=ENOENT(2): No such file or directory n/a It is a LTP bug. n/a
su01 qemux86 n/a n/a n/a n/a n/a
cron02 qemux86 n/a n/a n/a n/a n/a
cron_deny01 qemux86 n/a n/a n/a n/a n/a
cron_allow01 qemux86 n/a n/a n/a n/a n/a
cron_dirs_checks01 qemux86 n/a n/a n/a n/a n/a
file qemux86 n/a n/a n/a n/a n/a
cron qemux86 n/a n/a n/a n/a n/a
logrotate qemux86 n/a n/a n/a n/a n/a
cpio qemux86 n/a n/a n/a n/a n/a
unzip01 qemux86 n/a n/a n/a n/a n/a

1.3 M5 RC4 20121010 build

total: 22 (100%)

LTP cases status owner error msg lsb comment bugzilla
acl_test01 NAB n/a Can not mount ext3 file system with acl and user_xattr options n/a Kernel doesn't support n/a
ar NAB n/a FAIL - ar could not create the archive ; killed by SIGQUIT n/a n/a
aio02 NAB n/a io_fsync write: Invalid argument n/a io_fsync write: Invalid argument n/a
thp02 NAB n/a thp02 1 TBROK  : cannot find "Hugepagesize:" in /proc/meminfo n/a ARM doesn't support this. n/a
max_map_count NAB n/a max_map_count 0 TINFO  : set max_map_count to 64

max_map_count 1 TFAIL  : 65 map entries in total, but expected 64 entries

n/a Test case fails because the difference of system implement n/a
getrusage03 NAB n/a getrusage03_child 1 TBROK  : malloc failed at getrusage03_child.c:154: errno=ENOMEM(12): Cannot allocate memory n/a Not enough memory. Beagleboard have 256M memory. n/a
getrusage04 LTP n/a getrusage04 1 TFAIL  : stime increased > 2000us: delta = 7812us n/a This is a LTP bug. n/a
sysctl03 qemux86 n/a n/a n/a n/a n/a
syslog01 qemux86 n/a n/a n/a n/a n/a
syslog02 qemux86 n/a n/a n/a n/a n/a
mtest06_2 NAB n/a main(): mmap(): Cannot allocate memory n/a Not enough memory. Beagleboard has 256M memory. n/a
ksm05 LTP n/a ksm05 1 TBROK  : open: errno=ENOENT(2): No such file or directory n/a It is a LTP bug. n/a
su01 qemux86 n/a n/a n/a n/a n/a
cron02 qemux86 n/a n/a n/a n/a n/a
cron_deny01 qemux86 n/a n/a n/a n/a n/a
cron_allow01 qemux86 n/a n/a n/a n/a n/a
cron_dirs_checks01 qemux86 n/a n/a n/a n/a n/a
file qemux86 n/a n/a n/a n/a n/a
cron qemux86 n/a n/a n/a n/a n/a
logrotate qemux86 n/a n/a n/a n/a n/a
cpio qemux86 n/a n/a n/a n/a n/a
unzip01 qemux86 n/a n/a n/a n/a n/a

1.3 M5 RC3 20121003 build

total: 22 (100%)

LTP cases status owner error msg lsb comment bugzilla
acl_test01 NAB n/a Can not mount ext3 file system with acl and user_xattr options n/a Kernel doesn't support n/a
ar NEW n/a FAIL - ar could not create the archive ; killed by SIGQUIT n/a It's related with bug 3186 n/a
aio02 NAB n/a io_fsync write: Invalid argument n/a io_fsync write: Invalid argument n/a
thp02 NAB n/a thp02 1 TBROK  : cannot find "Hugepagesize:" in /proc/meminfo n/a ARM doesn't support this. n/a
max_map_count NAB n/a max_map_count 0 TINFO  : set max_map_count to 64

max_map_count 1 TFAIL  : 65 map entries in total, but expected 64 entries

n/a Test case fails because the difference of system implement n/a
getrusage03 NAB n/a getrusage03_child 1 TBROK  : malloc failed at getrusage03_child.c:154: errno=ENOMEM(12): Cannot allocate memory n/a Not enough memory. Beagleboard have 256M memory. n/a
getrusage04 LTP n/a getrusage04 1 TFAIL  : stime increased > 2000us: delta = 7812us n/a This is a LTP bug. n/a
sysctl03 qemux86 n/a n/a n/a n/a n/a
syslog01 qemux86 n/a n/a n/a n/a n/a
syslog02 qemux86 n/a n/a n/a n/a n/a
mtest06_2 NAB n/a main(): mmap(): Cannot allocate memory n/a Not enough memory. Beagleboard has 256M memory. n/a
ksm05 LTP n/a ksm05 1 TBROK  : open: errno=ENOENT(2): No such file or directory n/a It is a LTP bug. n/a
su01 qemux86 n/a n/a n/a n/a n/a
cron02 qemux86 n/a n/a n/a n/a n/a
cron_deny01 qemux86 n/a n/a n/a n/a n/a
cron_allow01 qemux86 n/a n/a n/a n/a n/a
cron_dirs_checks01 qemux86 n/a n/a n/a n/a n/a
file qemux86 n/a n/a n/a n/a n/a
cron qemux86 n/a n/a n/a n/a n/a
logrotate qemux86 n/a n/a n/a n/a n/a
cpio qemux86 n/a n/a n/a n/a n/a
unzip01 qemux86 n/a n/a n/a n/a n/a

1.3 M5 RC2 20120926 build

total: 22 (100%)

LTP cases status owner error msg lsb comment bugzilla
acl_test01 NAB n/a Can not mount ext3 file system with acl and user_xattr options n/a Kernel doesn't support n/a
setpgid03 LTP n/a setpgid03 2 TFAIL  : setpgid FAILED, expect EACCES got 1 n/a The lack of sync mechanism between father and child process cause this issue. When father process exec first, setpgid will reture "EPERM" which is not expected by the test case n/a
aio02 NAB n/a io_fsync write: Invalid argument n/a io_fsync write: Invalid argument n/a
thp02 NAB n/a thp02 1 TBROK  : cannot find "Hugepagesize:" in /proc/meminfo n/a ARM doesn't support this. n/a
max_map_count NAB n/a max_map_count 0 TINFO  : set max_map_count to 64

max_map_count 1 TFAIL  : 65 map entries in total, but expected 64 entries

n/a Test case fails because the difference of system implement n/a
getrusage03 NAB n/a getrusage03_child 1 TBROK  : malloc failed at getrusage03_child.c:154: errno=ENOMEM(12): Cannot allocate memory n/a Not enough memory. Beagleboard have 256M memory. n/a
getrusage04 LTP n/a getrusage04 1 TFAIL  : stime increased > 2000us: delta = 7812us n/a This is a LTP bug. n/a
sysctl03 qemux86 n/a n/a n/a n/a n/a
syslog01 qemux86 n/a n/a n/a n/a n/a
syslog02 qemux86 n/a n/a n/a n/a n/a
mtest06_2 NAB n/a main(): mmap(): Cannot allocate memory n/a Not enough memory. Beagleboard has 256M memory. n/a
ksm05 LTP n/a ksm05 1 TBROK  : open: errno=ENOENT(2): No such file or directory n/a It is a LTP bug. n/a
su01 qemux86 n/a n/a n/a n/a n/a
cron02 qemux86 n/a n/a n/a n/a n/a
cron_deny01 qemux86 n/a n/a n/a n/a n/a
cron_allow01 qemux86 n/a n/a n/a n/a n/a
cron_dirs_checks01 qemux86 n/a n/a n/a n/a n/a
file qemux86 n/a n/a n/a n/a n/a
cron qemux86 n/a n/a n/a n/a n/a
logrotate qemux86 n/a n/a n/a n/a n/a
cpio qemux86 n/a n/a n/a n/a n/a
unzip01 qemux86 n/a n/a n/a n/a n/a

1.3 M4 RC3 20120916 build

total: 23 (100%)

LTP cases status owner error msg lsb comment bugzilla
get_robust_list01 LTP n/a get_robust_list01 4 TFAIL  : get_robust_list succeeded unexpectedly n/a It is a LTP bug. Wait for upstream n/a
aio02 NAB n/a io_fsync write: Invalid argument n/a io_fsync write: Invalid argument n/a
thp02 NAB n/a thp02 1 TBROK  : cannot find "Hugepagesize:" in /proc/meminfo n/a ARM doesn't support this. n/a
max_map_count NAB n/a max_map_count 0 TINFO  : set max_map_count to 64

max_map_count 1 TFAIL  : 65 map entries in total, but expected 64 entries

n/a Test case fails because the difference of system implement n/a
getrusage03 NAB n/a getrusage03_child 1 TBROK  : malloc failed at getrusage03_child.c:154: errno=ENOMEM(12): Cannot allocate memory n/a Not enough memory. Beagleboard have 256M memory. n/a
getrusage04 LTP n/a getrusage04 1 TFAIL  : stime increased > 2000us: delta = 7812us n/a This is a LTP bug. n/a
sysctl03 qemux86 n/a n/a n/a n/a n/a
syslog01 qemux86 n/a n/a n/a n/a n/a
syslog02 qemux86 n/a n/a n/a n/a n/a
mtest06 qemux86 n/a n/a
mtest06_2 NAB n/a main(): mmap(): Cannot allocate memory n/a Not enough memory. Beagleboard has 256M memory. n/a
ksm05 LTP n/a ksm05 1 TBROK  : open: errno=ENOENT(2): No such file or directory n/a It is a LTP bug. n/a
vma01 LTP n/a vma01 1 TBROK  : no matched s = 0x40072000 found.

vma01 2 TBROK  : Remaining cases broken vma01 1 TBROK  : unexpected VMA found. vma01 2 TBROK  : Remaining cases broken

n/a Test case issue. This case assume that child vma pointer is less than parent vma pointer [bug1924]
su01 qemux86 n/a n/a n/a n/a n/a
cron02 qemux86 n/a n/a n/a n/a n/a
cron_deny01 qemux86 n/a n/a n/a n/a n/a
cron_allow01 qemux86 n/a n/a n/a n/a n/a
cron_dirs_checks01 qemux86 n/a n/a n/a n/a n/a
file qemux86 n/a n/a n/a n/a n/a
cron qemux86 n/a n/a n/a n/a n/a
logrotate qemux86 n/a n/a n/a n/a n/a
cpio qemux86 n/a n/a n/a n/a n/a
unzip01 qemux86 n/a n/a n/a n/a n/a

1.3 M3 RC2 20120814 build

total: 23 (100%)

LTP cases status owner error msg lsb comment bugzilla
get_robust_list01 LTP n/a get_robust_list01 4 TFAIL  : get_robust_list succeeded unexpectedly n/a It is a LTP bug. Wait for upstream n/a
aio02 NAB n/a io_fsync write: Invalid argument n/a io_fsync write: Invalid argument n/a
thp02 NAB n/a thp02 1 TBROK  : cannot find "Hugepagesize:" in /proc/meminfo n/a ARM doesn't support this. n/a
max_map_count NAB n/a max_map_count 0 TINFO  : set max_map_count to 64

max_map_count 1 TFAIL  : 65 map entries in total, but expected 64 entries

n/a Test case fails because the difference of system implement n/a
getrusage03 NAB n/a getrusage03_child 1 TBROK  : malloc failed at getrusage03_child.c:154: errno=ENOMEM(12): Cannot allocate memory n/a Not enough memory. Beagleboard have 256M memory. n/a
getrusage04 LTP n/a getrusage04 1 TFAIL  : stime increased > 2000us: delta = 7812us n/a This is a LTP bug. n/a
sysctl03 qemux86 n/a n/a n/a n/a n/a
syslog01 qemux86 n/a n/a n/a n/a n/a
syslog02 qemux86 n/a n/a n/a n/a n/a
mtest06 qemux86 n/a n/a
mtest06_2 NAB n/a main(): mmap(): Cannot allocate memory n/a Not enough memory. Beagleboard has 256M memory. n/a
ksm05 LTP n/a ksm05 1 TBROK  : open: errno=ENOENT(2): No such file or directory n/a It is a LTP bug. n/a
vma01 LTP n/a vma01 1 TBROK  : no matched s = 0x40072000 found.

vma01 2 TBROK  : Remaining cases broken vma01 1 TBROK  : unexpected VMA found. vma01 2 TBROK  : Remaining cases broken

n/a Test case issue. This case assume that child vma pointer is less than parent vma pointer [bug1924]
su01 qemux86 n/a n/a n/a n/a n/a
cron02 qemux86 n/a n/a n/a n/a n/a
cron_deny01 qemux86 n/a n/a n/a n/a n/a
cron_allow01 qemux86 n/a n/a n/a n/a n/a
cron_dirs_checks01 qemux86 n/a n/a n/a n/a n/a
file qemux86 n/a n/a n/a n/a n/a
cron qemux86 n/a n/a n/a n/a n/a
logrotate qemux86 n/a n/a n/a n/a n/a
cpio qemux86 n/a n/a n/a n/a n/a
unzip01 qemux86 n/a n/a n/a n/a n/a

1.3 20120801 build

total: 24 (100%)

LTP cases status owner error msg lsb comment bugzilla
get_robust_list01 LTP n/a get_robust_list01 4 TFAIL  : get_robust_list succeeded unexpectedly n/a It is a LTP bug. Wait for upstream n/a
aio02 NAB n/a io_fsync write: Invalid argument n/a io_fsync write: Invalid argument n/a
thp02 NAB n/a thp02 1 TBROK  : cannot find "Hugepagesize:" in /proc/meminfo n/a ARM doesn't support this. n/a
max_map_count NAB n/a max_map_count 0 TINFO  : set max_map_count to 64

max_map_count 1 TFAIL  : 65 map entries in total, but expected 64 entries

n/a Test case fails because the difference of system implement n/a
getrusage03 NAB n/a getrusage03_child 1 TBROK  : malloc failed at getrusage03_child.c:154: errno=ENOMEM(12): Cannot allocate memory n/a Not enough memory. Beagleboard have 256M memory. n/a
getrusage04 LTP n/a getrusage04 1 TFAIL  : stime increased > 2000us: delta = 7812us n/a This is a LTP bug. n/a
sysctl03 qemux86 n/a n/a n/a n/a n/a
syslog01 qemux86 n/a n/a n/a n/a n/a
syslog02 qemux86 n/a n/a n/a n/a n/a
mem02 LTP n/a mem02 2 TFAIL  : free did not dealloc memory n/a It is a LTP bug and fixed in upstream
mtest06 qemux86 n/a mmap1 caught unexpected signal - 11 --- exiting n/a
mtest06_2 NAB n/a main(): mmap(): Cannot allocate memory n/a Not enough memory. Beagleboard have 256M memory. n/a
ksm05 LTP n/a ksm05 1 TBROK  : open: errno=ENOENT(2): No such file or directory n/a It is a LTP bug. n/a
vma01 LTP n/a vma01 1 TBROK  : no matched s = 0x40072000 found.

vma01 2 TBROK  : Remaining cases broken vma01 1 TBROK  : unexpected VMA found. vma01 2 TBROK  : Remaining cases broken

n/a Test case issue. This case assume that child vma pointer is less than parent vma pointer [bug1924]
su01 qemux86 n/a n/a n/a n/a n/a
cron02 qemux86 n/a n/a n/a n/a n/a
cron_deny01 qemux86 n/a n/a n/a n/a n/a
cron_allow01 qemux86 n/a n/a n/a n/a n/a
cron_dirs_checks01 qemux86 n/a n/a n/a n/a n/a
file qemux86 n/a n/a n/a n/a n/a
cron qemux86 n/a n/a n/a n/a n/a
logrotate qemux86 n/a n/a n/a n/a n/a
cpio qemux86 n/a n/a n/a n/a n/a
unzip01 qemux86 n/a n/a n/a n/a n/a

1.3 M2 RC1 20120712 build

total: 26 (100%)

LTP cases status owner error msg lsb comment bugzilla
get_robust_list01 LTP n/a get_robust_list01 4 TFAIL  : get_robust_list succeeded unexpectedly n/a It is a LTP bug. Wait for upstream n/a
aio02 NAB n/a io_fsync write: Invalid argument n/a io_fsync write: Invalid argument n/a
thp02 NAB n/a thp02 1 TBROK  : cannot find "Hugepagesize:" in /proc/meminfo n/a n/a
max_map_count NAB n/a max_map_count 0 TINFO  : set max_map_count to 64

max_map_count 1 TFAIL  : 65 map entries in total, but expected 64 entries

n/a n/a
getcontext01 NAB n/a getcontext01 1 TFAIL  : getcontext failed: TEST_ERRNO=???(38): Function not implemented n/a libc doesn't implement getcontext for ARM, so this result is expected n/a
getrusage03 NAB n/a getrusage03_child 1 TBROK  : malloc failed at getrusage03_child.c:154: errno=ENOMEM(12): Cannot allocate memory n/a Not enough memory. Beagleboard have 256M memory. n/a
getrusage04 LTP n/a getrusage04 1 TFAIL  : stime increased > 2000us: delta = 7812us n/a This is a LTP bug. n/a
sysctl03 qemux86 n/a n/a n/a n/a n/a
syslog01 qemux86 n/a n/a n/a n/a n/a
syslog02 qemux86 n/a n/a n/a n/a n/a
mem02 n/a mem02 2 TFAIL  : free did not dealloc memory n/a
mtest06 qemux86 n/a mmap1 caught unexpected signal - 11 --- exiting n/a
mtest06_2 NAB n/a main(): mmap(): Cannot allocate memory n/a Not enough memory. Beagleboard have 256M memory. n/a
ksm05 LTP n/a ksm05 1 TBROK  : open: errno=ENOENT(2): No such file or directory n/a It is a LTP bug. n/a
vma01 LTP n/a vma01 1 TBROK  : no matched s = 0x40072000 found.

vma01 2 TBROK  : Remaining cases broken vma01 1 TBROK  : unexpected VMA found. vma01 2 TBROK  : Remaining cases broken

n/a [bug1924]
su01 qemux86 n/a n/a n/a n/a n/a
cron02 qemux86 n/a n/a n/a n/a n/a
cron_deny01 qemux86 n/a n/a n/a n/a n/a
cron_allow01 qemux86 n/a n/a n/a n/a n/a
cron_dirs_checks01 qemux86 n/a n/a n/a n/a n/a
ld LTP n/a Assertion 1 ..................

-) Assertion 2 .................. 1,4c1,3 < gcc: error: x.obj: No such file or directory < gcc: error: y.obj: No such file or directory < gcc: fatal error: no input files < compilation terminated. --- > gcc: x.obj: No such file or directory > gcc: y.obj: No such file or directory > gcc: No input files FAIL - ld failed to give expected error msg

n/a This is a LTP bug [bug1162]
file qemux86 n/a n/a n/a n/a n/a
cron qemux86 n/a n/a n/a n/a n/a
logrotate qemux86 n/a n/a n/a n/a n/a
cpio qemux86 n/a n/a n/a n/a n/a
unzip01 qemux86 n/a n/a n/a n/a n/a

1.1.2 20120630 build

total: 41 (100%)

LTP cases status owner error msg lsb comment bugzilla
getrusage03 NAB n/a getrusage03_child 1 TBROK  : malloc failed at getrusage03_child.c:154: errno=ENOMEM(12): Cannot allocate memory n/a Not enough memory. Beagleboard have 256M memory. n/a
getrusage04 LTP n/a getrusage04 1 TFAIL  : stime increased > 2000us: delta = 7812us n/a This is a LTP bug. n/a
thp02 NAB n/a thp02 1 TBROK  : cannot find "Hugepagesize:" in /proc/meminfo n/a n/a
max_map_count NAB n/a max_map_count 0 TINFO  : set max_map_count to 64

max_map_count 1 TFAIL  : 65 map entries in total, but expected 64 entries

n/a n/a
ksm05 LTP n/a ksm05 1 TBROK  : open: errno=ENOENT(2): No such file or directory n/a It is a LTP bug. n/a
vma01 LTP n/a vma01 1 TBROK  : no matched s = 0x40072000 found.

vma01 2 TBROK  : Remaining cases broken vma01 1 TBROK  : unexpected VMA found. vma01 2 TBROK  : Remaining cases broken

n/a [bug1924]
vma03 LTP n/a vma03 1 TFAIL  : mremap succeeded unexpectedly. n/a [bug1924]
setxattr01 n/a setxattr01 2 TFAIL  : unexpected behavior - expected errno 61 - Got: TEST_ERRNO=???(0): Success n/a No xattr support in fs or fs mounted without user_xattr option n/a
setxattr02 n/a setxattr02 3 TFAIL  : unexpected behavior - expected errno 17 - Got: TEST_ERRNO=???(0): Success n/a No xattr support in fs or fs mounted without user_xattr option n/a
gf02 growfiles(gf02): 31425 growfiles.c/2144: 1 tlibio.c/1675 aio_write, aio_error = 1 Operation not permitted; random method 0200002

growfiles(gf02): 31425 growfiles.c/1679: 1 Hit max errors value of 1 gf02 1 TFAIL  : Test failed

n/a [bug1138]
gf05 growfiles(gf05): 31429 growfiles.c/2144: 1 tlibio.c/1675 aio_write, aio_error = 1 Operation not permitted; random method 0200002

growfiles(gf05): 31429 growfiles.c/1679: 1 Hit max errors value of 1 gf05 1 TFAIL  : Test failed

n/a [bug1138]
gf07 growfiles(gf07): 31432 growfiles.c/2144: 1 tlibio.c/1675 aio_write, aio_error = 1 Operation not permitted; random method 0200002

growfiles(gf07): 31432 growfiles.c/1679: 1 Hit max errors value of 1 gf07 1 TFAIL  : Test failed

n/a [bug1138]
gf09 growfiles(gf09): 31435 growfiles.c/2144: 1 tlibio.c/1675 aio_write, aio_error = 1 Operation not permitted; random method 0200002

growfiles(gf09): 31435 growfiles.c/1679: 1 Hit max errors value of 1 gf09 1 TFAIL  : Test failed

n/a [bug1138]
gf19 growfiles(gf19): 31452 growfiles.c/2144: 1 tlibio.c/1675 aio_write, aio_error = 1 Operation not permitted; random method 0200002

growfiles(gf19): 31452 growfiles.c/1679: 1 Hit max errors value of 1 gf19 1 TFAIL  : Test failed

n/a [bug1138]
ld LTP Assertion 1 ..................

-) Assertion 2 .................. 1,4c1,3 < gcc: error: x.obj: No such file or directory < gcc: error: y.obj: No such file or directory < gcc: fatal error: no input files < compilation terminated. --- > gcc: x.obj: No such file or directory > gcc: y.obj: No such file or directory > gcc: No input files FAIL - ld failed to give expected error msg

n/a This is a LTP bug [bug1162]
getcontext01 NAB n/a getcontext - Sanity test : Fail errno=38 : Function not implemented n/a libc doesn't implement getcontext for ARM, so this result is expected n/a
quota_remount_test01 blacksand n/a /opt/ltp/testcases/bin/quota_remount_test01.sh: line 81: mkfs.ext3: command not found n/a n/a n/a
sysctl03 qemux86 n/a n/a n/a n/a n/a
syslog01 qemux86 n/a n/a n/a n/a n/a
syslog02 qemux86 n/a n/a n/a n/a n/a
syslog03 qemux86 n/a n/a n/a n/a n/a
syslog04 qemux86 n/a n/a n/a n/a n/a
syslog05 qemux86 n/a n/a n/a n/a n/a
syslog06 n/a n/a n/a n/a n/a
syslog07 qemux86 n/a n/a n/a n/a n/a
syslog08 qemux86 n/a n/a n/a n/a n/a
syslog09 qemux86 n/a n/a n/a n/a n/a
syslog10 qemux86 n/a n/a n/a n/a n/a
mtest06 qemux86 n/a mmap1 caught unexpected signal - 11 --- exiting n/a
mtest06_2 blacksand n/a n/a n/a n/a n/a
su01 qemux86 n/a n/a n/a n/a n/a
cron02 qemux86 n/a n/a n/a n/a n/a
cron_deny01 qemux86 n/a n/a n/a n/a n/a
cron_allow01 qemux86 n/a n/a n/a n/a n/a
cron_dirs_checks01 qemux86 n/a n/a n/a n/a n/a
file qemux86 n/a n/a n/a n/a n/a
cron qemux86 n/a n/a n/a n/a n/a
logrotate qemux86 n/a n/a n/a n/a n/a
cpio qemux86 n/a n/a n/a n/a n/a
unzip01 qemux86 n/a n/a n/a n/a n/a
gzip01 qemux86 n/a n/a n/a n/a n/a

1.2.1 20120629 build

total: 23 (100%)

LTP cases status owner error msg lsb comment bugzilla
aio02 NAB n/a io_fsync write: Invalid argument n/a io_fsync write: Invalid argument n/a
thp02 NAB n/a thp02 1 TBROK  : cannot find "Hugepagesize:" in /proc/meminfo n/a n/a
max_map_count NAB n/a max_map_count 0 TINFO  : set max_map_count to 64

max_map_count 1 TFAIL  : 65 map entries in total, but expected 64 entries

n/a n/a
getcontext01 NAB n/a getcontext01 1 TFAIL  : getcontext failed: TEST_ERRNO=???(38): Function not implemented n/a libc doesn't implement getcontext for ARM, so this result is expected n/a
getrusage03 NAB n/a getrusage03_child 1 TBROK  : malloc failed at getrusage03_child.c:154: errno=ENOMEM(12): Cannot allocate memory n/a Not enough memory. Beagleboard have 256M memory. n/a
getrusage04 LTP n/a getrusage04 1 TFAIL  : stime increased > 2000us: delta = 7812us n/a This is a LTP bug. n/a
sysctl03 qemux86 n/a n/a n/a n/a n/a
syslog01 qemux86 n/a n/a n/a n/a n/a
syslog02 qemux86 n/a n/a n/a n/a n/a
mtest06_2 NAB n/a main(): mmap(): Cannot allocate memory n/a Not enough memory. Beagleboard have 256M memory. n/a
ksm05 LTP n/a ksm05 1 TBROK  : open: errno=ENOENT(2): No such file or directory n/a It is a LTP bug. n/a
vma01 LTP n/a vma01 1 TBROK  : no matched s = 0x40072000 found.

vma01 2 TBROK  : Remaining cases broken vma01 1 TBROK  : unexpected VMA found. vma01 2 TBROK  : Remaining cases broken

n/a [bug1924]
su01 qemux86 n/a n/a n/a n/a n/a
cron02 qemux86 n/a n/a n/a n/a n/a
cron_deny01 qemux86 n/a n/a n/a n/a n/a
cron_allow01 qemux86 n/a n/a n/a n/a n/a
cron_dirs_checks01 qemux86 n/a n/a n/a n/a n/a
ld LTP n/a Assertion 1 ..................

-) Assertion 2 .................. 1,4c1,3 < gcc: error: x.obj: No such file or directory < gcc: error: y.obj: No such file or directory < gcc: fatal error: no input files < compilation terminated. --- > gcc: x.obj: No such file or directory > gcc: y.obj: No such file or directory > gcc: No input files FAIL - ld failed to give expected error msg

n/a This is a LTP bug [bug1162]
file qemux86 n/a n/a n/a n/a n/a
cron qemux86 n/a n/a n/a n/a n/a
logrotate qemux86 n/a n/a n/a n/a n/a
cpio qemux86 n/a n/a n/a n/a n/a
unzip01 qemux86 n/a n/a n/a n/a n/a

1.3 M1 RC1 20120613 build

total: 33 (100%)

LTP cases status owner error msg lsb comment bugzilla
get_robust_list01 LTP n/a get_robust_list01 4 TFAIL  : get_robust_list succeeded unexpectedly n/a It is a LTP bug. Wait for upstream n/a
aio02 NAB n/a io_fsync write: Invalid argument n/a io_fsync write: Invalid argument n/a
thp02 NAB n/a thp02 1 TBROK  : cannot find "Hugepagesize:" in /proc/meminfo n/a n/a
max_map_count NAB n/a max_map_count 0 TINFO  : set max_map_count to 64

max_map_count 1 TFAIL  : 65 map entries in total, but expected 64 entries

n/a n/a
getcontext01 NAB n/a getcontext01 1 TFAIL  : getcontext failed: TEST_ERRNO=???(38): Function not implemented n/a libc doesn't implement getcontext for ARM, so this result is expected n/a
getrusage03 NAB n/a getrusage03_child 1 TBROK  : malloc failed at getrusage03_child.c:154: errno=ENOMEM(12): Cannot allocate memory n/a Not enough memory. Beagleboard have 256M memory. n/a
getrusage04 LTP n/a getrusage04 1 TFAIL  : stime increased > 2000us: delta = 7812us n/a This is a LTP bug. n/a
sysctl03 qemux86 n/a n/a n/a n/a n/a
syslog01 qemux86 n/a n/a n/a n/a n/a
syslog02 qemux86 n/a n/a n/a n/a n/a
syslog03 qemux86 n/a n/a n/a n/a n/a
syslog04 qemux86 n/a n/a n/a n/a n/a
syslog05 qemux86 n/a n/a n/a n/a n/a
syslog06 qemux86 n/a n/a n/a n/a n/a
syslog07 qemux86 n/a n/a n/a n/a n/a
syslog08 qemux86 n/a n/a n/a n/a n/a
syslog09 qemux86 n/a n/a n/a n/a n/a
syslog010 qemux86 n/a n/a n/a n/a n/a
mtest06 qemux86 n/a mmap1 caught unexpected signal - 11 --- exiting n/a
mtest06_2 NAB n/a main(): mmap(): Cannot allocate memory n/a Not enough memory. Beagleboard have 256M memory. n/a
ksm05 LTP n/a ksm05 1 TBROK  : open: errno=ENOENT(2): No such file or directory n/a It is a LTP bug. n/a
vma01 LTP n/a vma01 1 TBROK  : no matched s = 0x40072000 found.

vma01 2 TBROK  : Remaining cases broken vma01 1 TBROK  : unexpected VMA found. vma01 2 TBROK  : Remaining cases broken

n/a [bug1924]
su01 qemux86 n/a n/a n/a n/a n/a
cron02 qemux86 n/a n/a n/a n/a n/a
cron_deny01 qemux86 n/a n/a n/a n/a n/a
cron_allow01 qemux86 n/a n/a n/a n/a n/a
cron_dirs_checks01 qemux86 n/a n/a n/a n/a n/a
ld LTP n/a Assertion 1 ..................

-) Assertion 2 .................. 1,4c1,3 < gcc: error: x.obj: No such file or directory < gcc: error: y.obj: No such file or directory < gcc: fatal error: no input files < compilation terminated. --- > gcc: x.obj: No such file or directory > gcc: y.obj: No such file or directory > gcc: No input files FAIL - ld failed to give expected error msg

n/a This is a LTP bug [bug1162]
file qemux86 n/a n/a n/a n/a n/a
cron qemux86 n/a n/a n/a n/a n/a
logrotate qemux86 n/a n/a n/a n/a n/a
cpio qemux86 n/a n/a n/a n/a n/a
unzip01 qemux86 n/a n/a n/a n/a n/a

1.3 20120606 build

total: 32 (100%)

LTP cases status owner error msg lsb comment bugzilla
aio02 NAB n/a io_fsync write: Invalid argument n/a io_fsync write: Invalid argument n/a
thp02 NAB n/a thp02 1 TBROK  : cannot find "Hugepagesize:" in /proc/meminfo n/a n/a
max_map_count NAB n/a max_map_count 0 TINFO  : set max_map_count to 64

max_map_count 1 TFAIL  : 65 map entries in total, but expected 64 entries

n/a n/a
getcontext01 NAB n/a getcontext01 1 TFAIL  : getcontext failed: TEST_ERRNO=???(38): Function not implemented n/a libc doesn't implement getcontext for ARM, so this result is expected n/a
getrusage03 NAB n/a getrusage03_child 1 TBROK  : malloc failed at getrusage03_child.c:154: errno=ENOMEM(12): Cannot allocate memory n/a Not enough memory. Beagleboard have 256M memory. n/a
getrusage04 LTP n/a getrusage04 1 TFAIL  : stime increased > 2000us: delta = 7812us n/a This is a LTP bug. n/a
sysctl03 qemux86 n/a n/a n/a n/a n/a
syslog01 qemux86 n/a n/a n/a n/a n/a
syslog02 qemux86 n/a n/a n/a n/a n/a
syslog03 qemux86 n/a n/a n/a n/a n/a
syslog04 qemux86 n/a n/a n/a n/a n/a
syslog05 qemux86 n/a n/a n/a n/a n/a
syslog06 qemux86 n/a n/a n/a n/a n/a
syslog07 qemux86 n/a n/a n/a n/a n/a
syslog08 qemux86 n/a n/a n/a n/a n/a
syslog09 qemux86 n/a n/a n/a n/a n/a
syslog010 qemux86 n/a n/a n/a n/a n/a
mtest06 qemux86 n/a mmap1 caught unexpected signal - 11 --- exiting n/a
mtest06_2 NAB n/a main(): mmap(): Cannot allocate memory n/a Not enough memory. Beagleboard have 256M memory. n/a
ksm05 LTP n/a ksm05 1 TBROK  : open: errno=ENOENT(2): No such file or directory n/a It is a LTP bug. n/a
vma01 LTP n/a vma01 1 TBROK  : no matched s = 0x40072000 found.

vma01 2 TBROK  : Remaining cases broken vma01 1 TBROK  : unexpected VMA found. vma01 2 TBROK  : Remaining cases broken

n/a [bug1924]
su01 qemux86 n/a n/a n/a n/a n/a
cron02 qemux86 n/a n/a n/a n/a n/a
cron_deny01 qemux86 n/a n/a n/a n/a n/a
cron_allow01 qemux86 n/a n/a n/a n/a n/a
cron_dirs_checks01 qemux86 n/a n/a n/a n/a n/a
ld LTP n/a Assertion 1 ..................

-) Assertion 2 .................. 1,4c1,3 < gcc: error: x.obj: No such file or directory < gcc: error: y.obj: No such file or directory < gcc: fatal error: no input files < compilation terminated. --- > gcc: x.obj: No such file or directory > gcc: y.obj: No such file or directory > gcc: No input files FAIL - ld failed to give expected error msg

n/a This is a LTP bug [bug1162]
file qemux86 n/a n/a n/a n/a n/a
cron qemux86 n/a n/a n/a n/a n/a
logrotate qemux86 n/a n/a n/a n/a n/a
cpio qemux86 n/a n/a n/a n/a n/a
unzip01 qemux86 n/a n/a n/a n/a n/a

1.2 RC5 Denzil

total: 24 (100%)

LTP cases status owner error msg lsb comment bugzilla
setxattr03 NAB n/a setxattr03 0 TWARN  : Unset setxattr03immutable immutable failed: errno=EINVAL(22): Invalid argument

setxattr03 0 TWARN  : Unset setxattr03appendonly append-only failed: errno=EINVAL(22): Invalid argument

n/a No xattr support in fs or fs mounted without user_xattr option n/a
aio02 NAB n/a io_fsync write: Invalid argument n/a io_fsync write: Invalid argument n/a
thp02 NAB n/a thp02 1 TBROK  : cannot find "Hugepagesize:" in /proc/meminfo n/a n/a
max_map_count NAB n/a max_map_count 0 TINFO  : set max_map_count to 64

max_map_count 1 TFAIL  : 65 map entries in total, but expected 64 entries

n/a n/a
getcontext01 NAB n/a getcontext01 1 TFAIL  : getcontext failed: TEST_ERRNO=???(38): Function not implemented n/a libc doesn't implement getcontext for ARM, so this result is expected n/a
getrusage03 NAB n/a getrusage03_child 1 TBROK  : malloc failed at getrusage03_child.c:154: errno=ENOMEM(12): Cannot allocate memory n/a Not enough memory. Beagleboard have 256M memory. n/a
getrusage04 LTP n/a getrusage04 1 TFAIL  : stime increased > 2000us: delta = 7812us n/a This is a LTP bug. n/a
sysctl03 qemux86 n/a n/a n/a n/a n/a
syslog01 qemux86 n/a n/a n/a n/a n/a
syslog02 qemux86 n/a n/a n/a n/a n/a
mtest06_2 NAB n/a main(): mmap(): Cannot allocate memory n/a Not enough memory. Beagleboard have 256M memory. n/a
ksm05 LTP n/a ksm05 1 TBROK  : open: errno=ENOENT(2): No such file or directory n/a It is a LTP bug. n/a
vma01 LTP n/a vma01 1 TBROK  : no matched s = 0x40072000 found.

vma01 2 TBROK  : Remaining cases broken vma01 1 TBROK  : unexpected VMA found. vma01 2 TBROK  : Remaining cases broken

n/a [bug1924]
su01 qemux86 n/a n/a n/a n/a n/a
cron02 qemux86 n/a n/a n/a n/a n/a
cron_deny01 qemux86 n/a n/a n/a n/a n/a
cron_allow01 qemux86 n/a n/a n/a n/a n/a
cron_dirs_checks01 qemux86 n/a n/a n/a n/a n/a
ld LTP n/a Assertion 1 ..................

-) Assertion 2 .................. 1,4c1,3 < gcc: error: x.obj: No such file or directory < gcc: error: y.obj: No such file or directory < gcc: fatal error: no input files < compilation terminated. --- > gcc: x.obj: No such file or directory > gcc: y.obj: No such file or directory > gcc: No input files FAIL - ld failed to give expected error msg

n/a This is a LTP bug [bug1162]
file qemux86 n/a n/a n/a n/a n/a
cron qemux86 n/a n/a n/a n/a n/a
logrotate qemux86 n/a n/a n/a n/a n/a
cpio qemux86 n/a n/a n/a n/a n/a
unzip01 qemux86 n/a n/a n/a n/a n/a

1.2 RC4 Denzil

total: 24 (100%)

LTP cases status owner error msg lsb comment bugzilla
setxattr03 NAB n/a setxattr03 0 TWARN  : Unset setxattr03immutable immutable failed: errno=EINVAL(22): Invalid argument

setxattr03 0 TWARN  : Unset setxattr03appendonly append-only failed: errno=EINVAL(22): Invalid argument

n/a No xattr support in fs or fs mounted without user_xattr option n/a
aio02 NAB n/a io_fsync write: Invalid argument n/a io_fsync write: Invalid argument n/a
thp02 NAB n/a thp02 1 TBROK  : cannot find "Hugepagesize:" in /proc/meminfo n/a n/a
max_map_count NAB n/a max_map_count 0 TINFO  : set max_map_count to 64

max_map_count 1 TFAIL  : 65 map entries in total, but expected 64 entries

n/a n/a
getcontext01 NAB n/a getcontext01 1 TFAIL  : getcontext failed: TEST_ERRNO=???(38): Function not implemented n/a libc doesn't implement getcontext for ARM, so this result is expected n/a
getrusage03 NAB n/a getrusage03_child 1 TBROK  : malloc failed at getrusage03_child.c:154: errno=ENOMEM(12): Cannot allocate memory n/a Not enough memory. Beagleboard have 256M memory. n/a
getrusage04 LTP n/a getrusage04 1 TFAIL  : stime increased > 2000us: delta = 7812us n/a This is a LTP bug. n/a
sysctl03 qemux86 n/a n/a n/a n/a n/a
syslog01 qemux86 n/a n/a n/a n/a n/a
syslog02 qemux86 n/a n/a n/a n/a n/a
mtest06_2 NAB n/a main(): mmap(): Cannot allocate memory n/a Not enough memory. Beagleboard have 256M memory. n/a
ksm05 LTP n/a ksm05 1 TBROK  : open: errno=ENOENT(2): No such file or directory n/a It is a LTP bug. n/a
vma01 LTP n/a vma01 1 TBROK  : no matched s = 0x40072000 found.

vma01 2 TBROK  : Remaining cases broken vma01 1 TBROK  : unexpected VMA found. vma01 2 TBROK  : Remaining cases broken

n/a [bug1924]
su01 qemux86 n/a n/a n/a n/a n/a
cron02 qemux86 n/a n/a n/a n/a n/a
cron_deny01 qemux86 n/a n/a n/a n/a n/a
cron_allow01 qemux86 n/a n/a n/a n/a n/a
cron_dirs_checks01 qemux86 n/a n/a n/a n/a n/a
ld LTP n/a Assertion 1 ..................

-) Assertion 2 .................. 1,4c1,3 < gcc: error: x.obj: No such file or directory < gcc: error: y.obj: No such file or directory < gcc: fatal error: no input files < compilation terminated. --- > gcc: x.obj: No such file or directory > gcc: y.obj: No such file or directory > gcc: No input files FAIL - ld failed to give expected error msg

n/a This is a LTP bug [bug1162]
file qemux86 n/a n/a n/a n/a n/a
cron qemux86 n/a n/a n/a n/a n/a
logrotate qemux86 n/a n/a n/a n/a n/a
cpio qemux86 n/a n/a n/a n/a n/a
unzip01 qemux86 n/a n/a n/a n/a n/a

1.2 M4 RC3

total: 24 (100%)

LTP cases status owner error msg lsb comment bugzilla
setxattr03 NAB n/a setxattr03 0 TWARN  : Unset setxattr03immutable immutable failed: errno=EINVAL(22): Invalid argument

setxattr03 0 TWARN  : Unset setxattr03appendonly append-only failed: errno=EINVAL(22): Invalid argument

n/a No xattr support in fs or fs mounted without user_xattr option n/a
aio02 NAB n/a io_fsync write: Invalid argument n/a io_fsync write: Invalid argument n/a
thp02 NAB n/a thp02 1 TBROK  : cannot find "Hugepagesize:" in /proc/meminfo n/a n/a
max_map_count NAB n/a max_map_count 0 TINFO  : set max_map_count to 64

max_map_count 1 TFAIL  : 65 map entries in total, but expected 64 entries

n/a n/a
getcontext01 NAB n/a getcontext01 1 TFAIL  : getcontext failed: TEST_ERRNO=???(38): Function not implemented n/a libc doesn't implement getcontext for ARM, so this result is expected n/a
getrusage03 NAB n/a getrusage03_child 1 TBROK  : malloc failed at getrusage03_child.c:154: errno=ENOMEM(12): Cannot allocate memory n/a Not enough memory. Beagleboard have 256M memory. n/a
getrusage04 LTP n/a getrusage04 1 TFAIL  : stime increased > 2000us: delta = 7812us n/a This is a LTP bug. n/a
sysctl03 qemux86 n/a n/a n/a n/a n/a
syslog01 qemux86 n/a n/a n/a n/a n/a
syslog02 qemux86 n/a n/a n/a n/a n/a
mtest06_2 NAB n/a main(): mmap(): Cannot allocate memory n/a Not enough memory. Beagleboard have 256M memory. n/a
ksm05 LTP n/a ksm05 1 TBROK  : open: errno=ENOENT(2): No such file or directory n/a It is a LTP bug. n/a
vma01 LTP n/a vma01 1 TBROK  : no matched s = 0x40072000 found.

vma01 2 TBROK  : Remaining cases broken vma01 1 TBROK  : unexpected VMA found. vma01 2 TBROK  : Remaining cases broken

n/a [bug1924]
su01 qemux86 n/a n/a n/a n/a n/a
cron02 qemux86 n/a n/a n/a n/a n/a
cron_deny01 qemux86 n/a n/a n/a n/a n/a
cron_allow01 qemux86 n/a n/a n/a n/a n/a
cron_dirs_checks01 qemux86 n/a n/a n/a n/a n/a
ld LTP n/a Assertion 1 ..................

-) Assertion 2 .................. 1,4c1,3 < gcc: error: x.obj: No such file or directory < gcc: error: y.obj: No such file or directory < gcc: fatal error: no input files < compilation terminated. --- > gcc: x.obj: No such file or directory > gcc: y.obj: No such file or directory > gcc: No input files FAIL - ld failed to give expected error msg

n/a This is a LTP bug [bug1162]
file qemux86 n/a n/a n/a n/a n/a
cron qemux86 n/a n/a n/a n/a n/a
logrotate qemux86 n/a n/a n/a n/a n/a
cpio qemux86 n/a n/a n/a n/a n/a
unzip01 qemux86 n/a n/a n/a n/a n/a

1.2 M4 RC2

total: 22 (100%)

LTP cases status owner error msg lsb comment bugzilla
getcontext01 NAB n/a getcontext01 1 TFAIL  : getcontext failed: TEST_ERRNO=???(38): Function not implemented n/a libc doesn't implement getcontext for ARM, so this result is expected n/a
getrusage03 NAB n/a getrusage03_child 1 TBROK  : malloc failed at getrusage03_child.c:154: errno=ENOMEM(12): Cannot allocate memory n/a Not enough memory. Beagleboard have 256M memory. n/a
getrusage04 LTP n/a getrusage04 1 TFAIL  : stime increased > 1000us: delta = 7812us n/a This is a LTP bug. Has been fixed in upstream. n/a
readlink03 LTP n/a readlink03 9 TFAIL  : readlink() failed, Symlink Pathname is empty, errno=2, expected errno=22 n/a This is a LTP bug. Has been fixed in upstream. n/a
sysctl03 qemux86 n/a n/a n/a n/a n/a
syslog01 qemux86 n/a n/a n/a n/a n/a
syslog02 qemux86 n/a n/a n/a n/a n/a
waitid02 n/a waitid02 5 TFAIL  : Fail5 ... -1 is returned: TEST_ERRNO=ECHILD(10): No child processes n/a n/a
mtest06_2 NAB n/a main(): mmap(): Cannot allocate memory n/a Not enough memory. Beagleboard have 256M memory. n/a
ksm05 LTP n/a ksm05 1 TBROK  : open: errno=ENOENT(2): No such file or directory n/a It is a LTP bug. n/a
vma01 n/a vma01 1 TBROK  : no matched s = 0x40072000 found.

vma01 2 TBROK  : Remaining cases broken vma01 1 TBROK  : unexpected VMA found. vma01 2 TBROK  : Remaining cases broken

n/a [bug1924]
su01 qemux86 n/a n/a n/a n/a n/a
cron02 qemux86 n/a n/a n/a n/a n/a
cron_deny01 qemux86 n/a n/a n/a n/a n/a
cron_allow01 qemux86 n/a n/a n/a n/a n/a
cron_dirs_checks01 qemux86 n/a n/a n/a n/a n/a
ld LTP n/a Assertion 1 ..................

-) Assertion 2 .................. 1,4c1,3 < gcc: error: x.obj: No such file or directory < gcc: error: y.obj: No such file or directory < gcc: fatal error: no input files < compilation terminated. --- > gcc: x.obj: No such file or directory > gcc: y.obj: No such file or directory > gcc: No input files FAIL - ld failed to give expected error msg

n/a This is a LTP bug [bug1162]
file qemux86 n/a n/a n/a n/a n/a
cron qemux86 n/a n/a n/a n/a n/a
logrotate qemux86 n/a n/a n/a n/a n/a
cpio qemux86 n/a n/a n/a n/a n/a
unzip01 qemux86 n/a n/a n/a n/a n/a

1.2 M4 RC1

total: 22 (100%)

LTP cases status owner error msg lsb comment bugzilla
getcontext01 NAB n/a getcontext01 1 TFAIL  : getcontext failed: TEST_ERRNO=???(38): Function not implemented n/a libc doesn't implement getcontext for ARM, so this result is expected n/a
getrusage03 NAB n/a getrusage03_child 1 TBROK  : malloc failed at getrusage03_child.c:154: errno=ENOMEM(12): Cannot allocate memory n/a Not enough memory. Beagleboard have 256M memory. n/a
getrusage04 LTP n/a getrusage04 1 TFAIL  : stime increased > 1000us: delta = 7812us n/a This is a LTP bug. Has been fixed in upstream. n/a
readlink03 LTP n/a readlink03 9 TFAIL  : readlink() failed, Symlink Pathname is empty, errno=2, expected errno=22 n/a This is a LTP bug. Has been fixed in upstream. n/a
sysctl03 qemux86 n/a n/a n/a n/a n/a
syslog01 qemux86 n/a n/a n/a n/a n/a
syslog02 qemux86 n/a n/a n/a n/a n/a
mem02 n/a mem02 1 TFAIL  : free did not dealloc memory n/a n/a
mtest06_2 NAB n/a main(): mmap(): Cannot allocate memory n/a Not enough memory. Beagleboard have 256M memory. n/a
ksm05 LTP n/a ksm05 1 TBROK  : open: errno=ENOENT(2): No such file or directory n/a It is a LTP bug. n/a
vma01 n/a vma01 1 TBROK  : no matched s = 0x40072000 found.

vma01 2 TBROK  : Remaining cases broken vma01 1 TBROK  : unexpected VMA found. vma01 2 TBROK  : Remaining cases broken

n/a [bug1924]
su01 qemux86 n/a n/a n/a n/a n/a
cron02 qemux86 n/a n/a n/a n/a n/a
cron_deny01 qemux86 n/a n/a n/a n/a n/a
cron_allow01 qemux86 n/a n/a n/a n/a n/a
cron_dirs_checks01 qemux86 n/a n/a n/a n/a n/a
ld LTP n/a Assertion 1 ..................

-) Assertion 2 .................. 1,4c1,3 < gcc: error: x.obj: No such file or directory < gcc: error: y.obj: No such file or directory < gcc: fatal error: no input files < compilation terminated. --- > gcc: x.obj: No such file or directory > gcc: y.obj: No such file or directory > gcc: No input files FAIL - ld failed to give expected error msg

n/a This is a LTP bug [bug1162]
file qemux86 n/a n/a n/a n/a n/a
cron qemux86 n/a n/a n/a n/a n/a
logrotate qemux86 n/a n/a n/a n/a n/a
cpio qemux86 n/a n/a n/a n/a n/a
unzip01 qemux86 n/a n/a n/a n/a n/a

1.2 M3 RC1

total: 22 (100%)

LTP cases status owner error msg lsb comment bugzilla
getcontext01 NAB n/a getcontext01 1 TFAIL  : getcontext failed: TEST_ERRNO=???(38): Function not implemented n/a libc doesn't implement getcontext for ARM, so this result is expected n/a
getrusage03 NAB n/a getrusage03_child 1 TBROK  : malloc failed at getrusage03_child.c:154: errno=ENOMEM(12): Cannot allocate memory n/a Not enough memory. Beagleboard have 256M memory. n/a
getrusage04 LTP n/a getrusage04 1 TFAIL  : stime increased > 1000us: delta = 7812us n/a This is a LTP bug. Has been fixed in upstream. n/a
readlink03 LTP n/a readlink03 9 TFAIL  : readlink() failed, Symlink Pathname is empty, errno=2, expected errno=22 n/a This is a LTP bug. Has been fixed in upstream. n/a
sysctl03 qemux86 n/a n/a n/a n/a n/a
syslog01 qemux86 n/a n/a n/a n/a n/a
syslog02 qemux86 n/a n/a n/a n/a n/a
waitid02 n/a waitid02 5 TFAIL  : Fail5 ... -1 is returned: TEST_ERRNO=ECHILD(10): No child processes n/a n/a
mtest06_2 NAB n/a main(): mmap(): Cannot allocate memory n/a Not enough memory. Beagleboard have 256M memory. n/a
ksm05 LTP n/a ksm05 1 TBROK  : open: errno=ENOENT(2): No such file or directory n/a It is a LTP bug. n/a
vma01 n/a vma01 1 TBROK  : no matched s = 0x40072000 found.

vma01 2 TBROK  : Remaining cases broken vma01 1 TBROK  : unexpected VMA found. vma01 2 TBROK  : Remaining cases broken

n/a [bug1924]
su01 qemux86 n/a n/a n/a n/a n/a
cron02 qemux86 n/a n/a n/a n/a n/a
cron_deny01 qemux86 n/a n/a n/a n/a n/a
cron_allow01 qemux86 n/a n/a n/a n/a n/a
cron_dirs_checks01 qemux86 n/a n/a n/a n/a n/a
ld LTP n/a Assertion 1 ..................

-) Assertion 2 .................. 1,4c1,3 < gcc: error: x.obj: No such file or directory < gcc: error: y.obj: No such file or directory < gcc: fatal error: no input files < compilation terminated. --- > gcc: x.obj: No such file or directory > gcc: y.obj: No such file or directory > gcc: No input files FAIL - ld failed to give expected error msg

n/a This is a LTP bug [bug1162]
file qemux86 n/a n/a n/a n/a n/a
cron qemux86 n/a n/a n/a n/a n/a
logrotate qemux86 n/a n/a n/a n/a n/a
cpio qemux86 n/a n/a n/a n/a n/a
unzip01 qemux86 n/a n/a n/a n/a n/a

1.1.1

total: 41 (100%)

LTP cases status owner error msg lsb comment bugzilla
mmap11 LTP mmap11 0 TINFO  : [471]

mmap11 1 TBROK  : pthread_create: errno=EAGAIN(11): Resource temporarily unavailable mmap11 2 TBROK  : Remaining cases broken

n/a This is a LTP bug. n/a
mmap10_2 LTP mmap10 0 TINFO  : add to KSM regions.

mmap10 0 TINFO  : use /dev/zero. mmap10 0 TINFO  : start tests. mmap10 1 TBROK  : madvise: errno=EINVAL(22): Invalid argument mmap10 2 TBROK  : Remaining cases broken

n/a It is a LTP bug. n/a
mmap10_3 LTP mmap10 0 TINFO  : add to KSM regions.

mmap10 0 TINFO  : use anonymous pages. mmap10 0 TINFO  : start tests. mmap10 1 TBROK  : madvise: errno=EINVAL(22): Invalid argument mmap10 2 TBROK  : Remaining cases broken

n/a It is a LTP bug. n/a
mmap10_4 LTP mmap10 0 TINFO  : add to KSM regions.

mmap10 0 TINFO  : use anonymous pages. mmap10 0 TINFO  : start tests. mmap10 1 TBROK  : madvise: errno=EINVAL(22): Invalid argument mmap10 2 TBROK  : Remaining cases broken

n/a It is a LTP bug. n/a
mmap10_5 LTP mmap10 0 TINFO  : add to KSM regions.

mmap10 0 TINFO  : use anonymous pages. mmap10 0 TINFO  : start tests. mmap10 1 TBROK  : madvise: errno=EINVAL(22): Invalid argument mmap10 2 TBROK  : Remaining cases broken

n/a It is a LTP bug. n/a
ksm01 LTP ksm01 0 TINFO  : KSM merging...

ksm01 1 TBROK  : open: errno=ENOENT(2): No such file or directory ksm01 2 TBROK  : Remaining cases broken

n/a It is a LTP bug. n/a
ksm01_1 LTP ksm01 0 TINFO  : KSM merging...

ksm01 1 TBROK  : open: errno=ENOENT(2): No such file or directory ksm01 2 TBROK  : Remaining cases broken

n/a It is a LTP bug. n/a
ksm03 LTP ksm03 0 TINFO  : KSM merging...

ksm03 1 TBROK  : open: errno=ENOENT(2): No such file or directory ksm03 2 TBROK  : Remaining cases broken

n/a It is a LTP bug. n/a
ksm03_1 LTP ksm03 0 TINFO  : KSM merging...

ksm03 1 TBROK  : open: errno=ENOENT(2): No such file or directory ksm03 2 TBROK  : Remaining cases broken

n/a It is a LTP bug. n/a
gf02 growfiles(gf02): 31425 growfiles.c/2144: 1 tlibio.c/1675 aio_write, aio_error = 1 Operation not permitted; random method 0200002

growfiles(gf02): 31425 growfiles.c/1679: 1 Hit max errors value of 1 gf02 1 TFAIL  : Test failed

n/a [bug1138]
gf05 growfiles(gf05): 31429 growfiles.c/2144: 1 tlibio.c/1675 aio_write, aio_error = 1 Operation not permitted; random method 0200002

growfiles(gf05): 31429 growfiles.c/1679: 1 Hit max errors value of 1 gf05 1 TFAIL  : Test failed

n/a [bug1138]
gf07 growfiles(gf07): 31432 growfiles.c/2144: 1 tlibio.c/1675 aio_write, aio_error = 1 Operation not permitted; random method 0200002

growfiles(gf07): 31432 growfiles.c/1679: 1 Hit max errors value of 1 gf07 1 TFAIL  : Test failed

n/a [bug1138]
gf09 growfiles(gf09): 31435 growfiles.c/2144: 1 tlibio.c/1675 aio_write, aio_error = 1 Operation not permitted; random method 0200002

growfiles(gf09): 31435 growfiles.c/1679: 1 Hit max errors value of 1 gf09 1 TFAIL  : Test failed

n/a [bug1138]
gf19 growfiles(gf19): 31452 growfiles.c/2144: 1 tlibio.c/1675 aio_write, aio_error = 1 Operation not permitted; random method 0200002

growfiles(gf19): 31452 growfiles.c/1679: 1 Hit max errors value of 1 gf19 1 TFAIL  : Test failed

n/a [bug1138]
ld LTP Assertion 1 ..................

-) Assertion 2 .................. 1,4c1,3 < gcc: error: x.obj: No such file or directory < gcc: error: y.obj: No such file or directory < gcc: fatal error: no input files < compilation terminated. --- > gcc: x.obj: No such file or directory > gcc: y.obj: No such file or directory > gcc: No input files FAIL - ld failed to give expected error msg

n/a This is a LTP bug [bug1162]
getcontext01 NAB n/a getcontext - Sanity test : Fail errno=38 : Function not implemented n/a libc doesn't implement getcontext for ARM, so this result is expected n/a
quota_remount_test01 blacksand n/a /opt/ltp/testcases/bin/quota_remount_test01.sh: line 81: mkfs.ext3: command not found n/a n/a n/a
sysctl03 qemux86 n/a n/a n/a n/a n/a
syslog01 qemux86 n/a n/a n/a n/a n/a
syslog02 qemux86 n/a n/a n/a n/a n/a
syslog03 qemux86 n/a n/a n/a n/a n/a
syslog04 qemux86 n/a n/a n/a n/a n/a
syslog05 qemux86 n/a n/a n/a n/a n/a
syslog06 n/a n/a n/a n/a n/a
syslog07 qemux86 n/a n/a n/a n/a n/a
syslog08 qemux86 n/a n/a n/a n/a n/a
syslog09 qemux86 n/a n/a n/a n/a n/a
syslog10 qemux86 n/a n/a n/a n/a n/a
mtest06 qemux86 n/a mmap1 caught unexpected signal - 11 --- exiting n/a
mtest06_2 blacksand n/a n/a n/a n/a n/a
su01 qemux86 n/a n/a n/a n/a n/a
cron02 qemux86 n/a n/a n/a n/a n/a
cron_deny01 qemux86 n/a n/a n/a n/a n/a
cron_allow01 qemux86 n/a n/a n/a n/a n/a
cron_dirs_checks01 qemux86 n/a n/a n/a n/a n/a
file qemux86 n/a n/a n/a n/a n/a
cron qemux86 n/a n/a n/a n/a n/a
logrotate qemux86 n/a n/a n/a n/a n/a
cpio qemux86 n/a n/a n/a n/a n/a
unzip01 qemux86 n/a n/a n/a n/a n/a
gzip01 qemux86 n/a n/a n/a n/a n/a

1.2 M2 RC1

total: 30 (100%)

LTP cases status owner error msg lsb comment bugzilla
nm NEW -------System test for nm command------

nm: nmfile1.obj: no symbols nm: nmfile1.obj: no symbols nm: nmfile2.obj: no symbols nm: nmfile3.obj: no symbols nm: nmfile1.obj: no symbols nm: nmfile1.obj: no symbols nm: nmfile2.obj: no symbols nm: nmfile3.obj: no symbols nm -A: FAIL

n/a n/a
ldd NEW /usr/lib/gcc/arm-poky-linux-gnueabi/4.6.3/../../../crt1.o: In function `_start':

init.c:(.text+0x34): undefined reference to `main' collect2: ld returned 1 exit status

 ASSERTION 1  

ldd: /tmp/ldd01-16044/a.out: No such file or directory ASSERTION #1 FAIL

n/a n/a
sockioctl01 NEW sockioctl01 4 TFAIL  : ATMARK on UDP ; returned -1 (expected -1), errno 25 (expected 22) n/a Inappropriate ioctl operation returning EINVAL with newer kernels. It is a LTP bug. n/a
proc01 NEW proc01 1 TFAIL  : read failed: /proc/self/task/428/ns/net: errno=EINVAL(22): Invalid argument

proc01 2 TFAIL  : read failed: /proc/self/task/428/ns/uts: errno=EINVAL(22): Invalid argument proc01 3 TFAIL  : read failed: /proc/self/task/428/ns/ipc: errno=EINVAL(22): Invalid argument

n/a introduced with 3.0 kernel. n/a
clock_settime03 NEW clock_settime03 8 TFAIL  : clock_settime(2) failed to produce expected error (return code = -1): TEST_ERRNO=EINVAL(22): Invalid argument

clock_settime03 9 TFAIL  : clock_settime(2) failed to produce expected error (return code = -1): TEST_ERRNO=EINVAL(22): Invalid argument

n/a introduced with 3.0 kernel. n/a
vma01 vma01 0 TINFO  : t = 0x40002000

vma01 0 TINFO  : v = 0x40103000 u = 0x40005000 vma01 0 TINFO  : s = 0x40005000, t = 0x40008000 vma01 1 TBROK  : no matched s = 0x40008000 found. vma01 2 TBROK  : Remaining cases broken vma01 0 TINFO  : t = 0x40002000 vma01 0 TINFO  : v = 0x40103000 vma01 1 TBROK  : unexpected VMA found. vma01 2 TBROK  : Remaining cases broken

n/a n/a
getrusage03 getrusage03 0 TINFO  : post_wait.children = 153872

getrusage03 7 TFAIL  : post_wait.children !~= 400MB

n/a Not enough memory. Beagleboard have 256M memory. The failure cause by a LTP bug. n/a
ksm05 LTP ksm05 1 TBROK  : open: errno=ENOENT(2): No such file or directory n/a It is a LTP bug. n/a
mmap10_2 LTP mmap10 0 TINFO  : add to KSM regions.

mmap10 0 TINFO  : use /dev/zero. mmap10 0 TINFO  : start tests. mmap10 1 TBROK  : madvise: errno=EINVAL(22): Invalid argument mmap10 2 TBROK  : Remaining cases broken

n/a It is a LTP bug. n/a
mmap10_3 LTP mmap10 0 TINFO  : add to KSM regions.

mmap10 0 TINFO  : use anonymous pages. mmap10 0 TINFO  : start tests. mmap10 1 TBROK  : madvise: errno=EINVAL(22): Invalid argument mmap10 2 TBROK  : Remaining cases broken

n/a It is a LTP bug. n/a
mmap10_4 LTP mmap10 0 TINFO  : add to KSM regions.

mmap10 0 TINFO  : use anonymous pages. mmap10 0 TINFO  : start tests. mmap10 1 TBROK  : madvise: errno=EINVAL(22): Invalid argument mmap10 2 TBROK  : Remaining cases broken

n/a It is a LTP bug. n/a
mmap10_5 LTP mmap10 0 TINFO  : add to KSM regions.

mmap10 0 TINFO  : use anonymous pages. mmap10 0 TINFO  : start tests. mmap10 1 TBROK  : madvise: errno=EINVAL(22): Invalid argument mmap10 2 TBROK  : Remaining cases broken

n/a It is a LTP bug. n/a
ld LTP Assertion 1 ..................

-) Assertion 2 .................. 1,4c1,3 < gcc: error: x.obj: No such file or directory < gcc: error: y.obj: No such file or directory < gcc: fatal error: no input files < compilation terminated. --- > gcc: x.obj: No such file or directory > gcc: y.obj: No such file or directory > gcc: No input files FAIL - ld failed to give expected error msg

n/a This is a LTP bug [bug1162]
getcontext01 NAB n/a getcontext - Sanity test : Fail errno=38 : Function not implemented n/a libc doesn't implement getcontext for ARM, so this result is expected n/a
sysctl03 qemux86 n/a n/a n/a n/a n/a
syslog01 qemux86 n/a n/a n/a n/a n/a
syslog02 qemux86 n/a n/a n/a n/a n/a
mtest06 qemux86 n/a mmap1 caught unexpected signal - 11 --- exiting n/a
mtest06_2 blacksand n/a n/a n/a n/a n/a
su01 qemux86 n/a n/a n/a n/a n/a
cron02 qemux86 n/a n/a n/a n/a n/a
cron_deny01 qemux86 n/a n/a n/a n/a n/a
cron_allow01 qemux86 n/a n/a n/a n/a n/a
cron_dirs_checks01 qemux86 n/a n/a n/a n/a n/a
file qemux86 n/a n/a n/a n/a n/a
cron qemux86 n/a n/a n/a n/a n/a
logrotate qemux86 n/a n/a n/a n/a n/a
cpio qemux86 n/a n/a n/a n/a n/a
unzip01 qemux86 n/a n/a n/a n/a n/a
gzip01 qemux86 n/a n/a n/a n/a n/a

1.2 M1 RC2

total: 40 (100%)

LTP cases status owner error msg lsb comment bugzilla
vma01 vma01 0 TINFO  : t = 0x40002000

vma01 0 TINFO  : v = 0x40103000 u = 0x40005000 vma01 0 TINFO  : s = 0x40005000, t = 0x40008000 vma01 1 TBROK  : no matched s = 0x40008000 found. vma01 2 TBROK  : Remaining cases broken vma01 0 TINFO  : t = 0x40002000 vma01 0 TINFO  : v = 0x40103000 vma01 1 TBROK  : unexpected VMA found. vma01 2 TBROK  : Remaining cases broken

n/a n/a
getrusage03 getrusage03 0 TINFO  : post_wait.children = 153872

getrusage03 7 TFAIL  : post_wait.children !~= 400MB

n/a Not enough memory. Beagleboard have 256M memory. The failure cause by a LTP bug. n/a
ksm05 LTP ksm05 1 TBROK  : open: errno=ENOENT(2): No such file or directory n/a It is a LTP bug. n/a
mmap10_2 LTP mmap10 0 TINFO  : add to KSM regions.

mmap10 0 TINFO  : use /dev/zero. mmap10 0 TINFO  : start tests. mmap10 1 TBROK  : madvise: errno=EINVAL(22): Invalid argument mmap10 2 TBROK  : Remaining cases broken

n/a It is a LTP bug. n/a
mmap10_3 LTP mmap10 0 TINFO  : add to KSM regions.

mmap10 0 TINFO  : use anonymous pages. mmap10 0 TINFO  : start tests. mmap10 1 TBROK  : madvise: errno=EINVAL(22): Invalid argument mmap10 2 TBROK  : Remaining cases broken

n/a It is a LTP bug. n/a
mmap10_4 LTP mmap10 0 TINFO  : add to KSM regions.

mmap10 0 TINFO  : use anonymous pages. mmap10 0 TINFO  : start tests. mmap10 1 TBROK  : madvise: errno=EINVAL(22): Invalid argument mmap10 2 TBROK  : Remaining cases broken

n/a It is a LTP bug. n/a
mmap10_5 LTP mmap10 0 TINFO  : add to KSM regions.

mmap10 0 TINFO  : use anonymous pages. mmap10 0 TINFO  : start tests. mmap10 1 TBROK  : madvise: errno=EINVAL(22): Invalid argument mmap10 2 TBROK  : Remaining cases broken

n/a It is a LTP bug. n/a
gf02 growfiles(gf02): 31425 growfiles.c/2144: 1 tlibio.c/1675 aio_write, aio_error = 1 Operation not permitted; random method 0200002

growfiles(gf02): 31425 growfiles.c/1679: 1 Hit max errors value of 1 gf02 1 TFAIL  : Test failed

n/a [bug1138]
gf05 growfiles(gf05): 31429 growfiles.c/2144: 1 tlibio.c/1675 aio_write, aio_error = 1 Operation not permitted; random method 0200002

growfiles(gf05): 31429 growfiles.c/1679: 1 Hit max errors value of 1 gf05 1 TFAIL  : Test failed

n/a [bug1138]
gf07 growfiles(gf07): 31432 growfiles.c/2144: 1 tlibio.c/1675 aio_write, aio_error = 1 Operation not permitted; random method 0200002

growfiles(gf07): 31432 growfiles.c/1679: 1 Hit max errors value of 1 gf07 1 TFAIL  : Test failed

n/a [bug1138]
gf09 growfiles(gf09): 31435 growfiles.c/2144: 1 tlibio.c/1675 aio_write, aio_error = 1 Operation not permitted; random method 0200002

growfiles(gf09): 31435 growfiles.c/1679: 1 Hit max errors value of 1 gf09 1 TFAIL  : Test failed

n/a [bug1138]
gf19 growfiles(gf19): 31452 growfiles.c/2144: 1 tlibio.c/1675 aio_write, aio_error = 1 Operation not permitted; random method 0200002

growfiles(gf19): 31452 growfiles.c/1679: 1 Hit max errors value of 1 gf19 1 TFAIL  : Test failed

n/a [bug1138]
ld LTP Assertion 1 ..................

-) Assertion 2 .................. 1,4c1,3 < gcc: error: x.obj: No such file or directory < gcc: error: y.obj: No such file or directory < gcc: fatal error: no input files < compilation terminated. --- > gcc: x.obj: No such file or directory > gcc: y.obj: No such file or directory > gcc: No input files FAIL - ld failed to give expected error msg

n/a This is a LTP bug [bug1162]
getcontext01 NAB n/a getcontext - Sanity test : Fail errno=38 : Function not implemented n/a libc doesn't implement getcontext for ARM, so this result is expected n/a
quota_remount_test01 blacksand n/a /opt/ltp/testcases/bin/quota_remount_test01.sh: line 81: mkfs.ext3: command not found n/a n/a n/a
sysctl03 qemux86 n/a n/a n/a n/a n/a
syslog01 qemux86 n/a n/a n/a n/a n/a
syslog02 qemux86 n/a n/a n/a n/a n/a
syslog03 qemux86 n/a n/a n/a n/a n/a
syslog04 qemux86 n/a n/a n/a n/a n/a
syslog05 qemux86 n/a n/a n/a n/a n/a
syslog06 n/a n/a n/a n/a n/a
syslog07 qemux86 n/a n/a n/a n/a n/a
syslog08 qemux86 n/a n/a n/a n/a n/a
syslog09 qemux86 n/a n/a n/a n/a n/a
syslog10 qemux86 n/a n/a n/a n/a n/a
mtest06 qemux86 n/a mmap1 caught unexpected signal - 11 --- exiting n/a
mtest06_2 blacksand n/a n/a n/a n/a n/a
su01 qemux86 n/a n/a n/a n/a n/a
cron02 qemux86 n/a n/a n/a n/a n/a
cron_deny01 qemux86 n/a n/a n/a n/a n/a
cron_allow01 qemux86 n/a n/a n/a n/a n/a
cron_dirs_checks01 qemux86 n/a n/a n/a n/a n/a
file qemux86 n/a n/a n/a n/a n/a
cron qemux86 n/a n/a n/a n/a n/a
logrotate qemux86 n/a n/a n/a n/a n/a
cpio qemux86 n/a n/a n/a n/a n/a
unzip01 qemux86 n/a n/a n/a n/a n/a
gzip01 qemux86 n/a n/a n/a n/a n/a

1.0.2

total: 36 (100%)

LTP cases status owner error msg lsb comment bugzilla
mmap11 LTP mmap11 0 TINFO  : [471]

mmap11 1 TBROK  : pthread_create: errno=EAGAIN(11): Resource temporarily unavailable mmap11 2 TBROK  : Remaining cases broken

n/a This is a LTP bug. n/a
mmap10_2 LTP mmap10 0 TINFO  : add to KSM regions.

mmap10 0 TINFO  : use /dev/zero. mmap10 0 TINFO  : start tests. mmap10 1 TBROK  : madvise: errno=EINVAL(22): Invalid argument mmap10 2 TBROK  : Remaining cases broken

n/a It is a LTP bug. n/a
mmap10_3 LTP mmap10 0 TINFO  : add to KSM regions.

mmap10 0 TINFO  : use anonymous pages. mmap10 0 TINFO  : start tests. mmap10 1 TBROK  : madvise: errno=EINVAL(22): Invalid argument mmap10 2 TBROK  : Remaining cases broken

n/a It is a LTP bug. n/a
mmap10_4 LTP mmap10 0 TINFO  : add to KSM regions.

mmap10 0 TINFO  : use anonymous pages. mmap10 0 TINFO  : start tests. mmap10 1 TBROK  : madvise: errno=EINVAL(22): Invalid argument mmap10 2 TBROK  : Remaining cases broken

n/a It is a LTP bug. n/a
mmap10_5 LTP mmap10 0 TINFO  : add to KSM regions.

mmap10 0 TINFO  : use anonymous pages. mmap10 0 TINFO  : start tests. mmap10 1 TBROK  : madvise: errno=EINVAL(22): Invalid argument mmap10 2 TBROK  : Remaining cases broken

n/a It is a LTP bug. n/a
mem02 mem02 2 TFAIL  : free did not dealloc memory n/a [bug909]
ksm01 LTP ksm01 0 TINFO  : KSM merging...

ksm01 1 TBROK  : open: errno=ENOENT(2): No such file or directory ksm01 2 TBROK  : Remaining cases broken

n/a It is a LTP bug. n/a
ksm01_1 LTP ksm01 0 TINFO  : KSM merging...

ksm01 1 TBROK  : open: errno=ENOENT(2): No such file or directory ksm01 2 TBROK  : Remaining cases broken

n/a It is a LTP bug. n/a
ksm03 LTP ksm03 0 TINFO  : KSM merging...

ksm03 1 TBROK  : open: errno=ENOENT(2): No such file or directory ksm03 2 TBROK  : Remaining cases broken

n/a It is a LTP bug. n/a
ksm03_1 LTP ksm03 0 TINFO  : KSM merging...

ksm03 1 TBROK  : open: errno=ENOENT(2): No such file or directory ksm03 2 TBROK  : Remaining cases broken

n/a It is a LTP bug. n/a
getcontext01 NAB n/a getcontext - Sanity test : Fail errno=38 : Function not implemented n/a libc doesn't implement getcontext for ARM, so this result is expected n/a
quota_remount_test01 blacksand n/a /opt/ltp/testcases/bin/quota_remount_test01.sh: line 81: mkfs.ext3: command not found n/a n/a n/a
sysctl03 qemux86 n/a n/a n/a n/a n/a
syslog01 qemux86 n/a n/a n/a n/a n/a
syslog02 qemux86 n/a n/a n/a n/a n/a
syslog03 qemux86 n/a n/a n/a n/a n/a
syslog04 qemux86 n/a n/a n/a n/a n/a
syslog05 qemux86 n/a n/a n/a n/a n/a
syslog06 n/a n/a n/a n/a n/a
syslog07 qemux86 n/a n/a n/a n/a n/a
syslog08 qemux86 n/a n/a n/a n/a n/a
syslog09 qemux86 n/a n/a n/a n/a n/a
syslog10 qemux86 n/a n/a n/a n/a n/a
mtest06 qemux86 n/a mmap1 caught unexpected signal - 11 --- exiting n/a
mtest06_2 blacksand n/a n/a n/a n/a n/a
su01 qemux86 n/a n/a n/a n/a n/a
cron02 qemux86 n/a n/a n/a n/a n/a
cron_deny01 qemux86 n/a n/a n/a n/a n/a
cron_allow01 qemux86 n/a n/a n/a n/a n/a
cron_dirs_checks01 qemux86 n/a n/a n/a n/a n/a
file qemux86 n/a n/a n/a n/a n/a
cron qemux86 n/a n/a n/a n/a n/a
logrotate qemux86 n/a n/a n/a n/a n/a
cpio qemux86 n/a n/a n/a n/a n/a
unzip01 qemux86 n/a n/a n/a n/a n/a
gzip01 qemux86 n/a n/a n/a n/a n/a

1.1/M4 RC4

total: 41 (100%)

LTP cases status owner error msg lsb comment bugzilla
mmap11 LTP mmap11 0 TINFO  : [471]

mmap11 1 TBROK  : pthread_create: errno=EAGAIN(11): Resource temporarily unavailable mmap11 2 TBROK  : Remaining cases broken

n/a This is a LTP bug. n/a
mmap10_2 LTP mmap10 0 TINFO  : add to KSM regions.

mmap10 0 TINFO  : use /dev/zero. mmap10 0 TINFO  : start tests. mmap10 1 TBROK  : madvise: errno=EINVAL(22): Invalid argument mmap10 2 TBROK  : Remaining cases broken

n/a It is a LTP bug. n/a
mmap10_3 LTP mmap10 0 TINFO  : add to KSM regions.

mmap10 0 TINFO  : use anonymous pages. mmap10 0 TINFO  : start tests. mmap10 1 TBROK  : madvise: errno=EINVAL(22): Invalid argument mmap10 2 TBROK  : Remaining cases broken

n/a It is a LTP bug. n/a
mmap10_4 LTP mmap10 0 TINFO  : add to KSM regions.

mmap10 0 TINFO  : use anonymous pages. mmap10 0 TINFO  : start tests. mmap10 1 TBROK  : madvise: errno=EINVAL(22): Invalid argument mmap10 2 TBROK  : Remaining cases broken

n/a It is a LTP bug. n/a
mmap10_5 LTP mmap10 0 TINFO  : add to KSM regions.

mmap10 0 TINFO  : use anonymous pages. mmap10 0 TINFO  : start tests. mmap10 1 TBROK  : madvise: errno=EINVAL(22): Invalid argument mmap10 2 TBROK  : Remaining cases broken

n/a It is a LTP bug. n/a
ksm01 LTP ksm01 0 TINFO  : KSM merging...

ksm01 1 TBROK  : open: errno=ENOENT(2): No such file or directory ksm01 2 TBROK  : Remaining cases broken

n/a It is a LTP bug. n/a
ksm01_1 LTP ksm01 0 TINFO  : KSM merging...

ksm01 1 TBROK  : open: errno=ENOENT(2): No such file or directory ksm01 2 TBROK  : Remaining cases broken

n/a It is a LTP bug. n/a
ksm03 LTP ksm03 0 TINFO  : KSM merging...

ksm03 1 TBROK  : open: errno=ENOENT(2): No such file or directory ksm03 2 TBROK  : Remaining cases broken

n/a It is a LTP bug. n/a
ksm03_1 LTP ksm03 0 TINFO  : KSM merging...

ksm03 1 TBROK  : open: errno=ENOENT(2): No such file or directory ksm03 2 TBROK  : Remaining cases broken

n/a It is a LTP bug. n/a
gf02 growfiles(gf02): 31425 growfiles.c/2144: 1 tlibio.c/1675 aio_write, aio_error = 1 Operation not permitted; random method 0200002

growfiles(gf02): 31425 growfiles.c/1679: 1 Hit max errors value of 1 gf02 1 TFAIL  : Test failed

n/a [bug1138]
gf05 growfiles(gf05): 31429 growfiles.c/2144: 1 tlibio.c/1675 aio_write, aio_error = 1 Operation not permitted; random method 0200002

growfiles(gf05): 31429 growfiles.c/1679: 1 Hit max errors value of 1 gf05 1 TFAIL  : Test failed

n/a [bug1138]
gf07 growfiles(gf07): 31432 growfiles.c/2144: 1 tlibio.c/1675 aio_write, aio_error = 1 Operation not permitted; random method 0200002

growfiles(gf07): 31432 growfiles.c/1679: 1 Hit max errors value of 1 gf07 1 TFAIL  : Test failed

n/a [bug1138]
gf09 growfiles(gf09): 31435 growfiles.c/2144: 1 tlibio.c/1675 aio_write, aio_error = 1 Operation not permitted; random method 0200002

growfiles(gf09): 31435 growfiles.c/1679: 1 Hit max errors value of 1 gf09 1 TFAIL  : Test failed

n/a [bug1138]
gf19 growfiles(gf19): 31452 growfiles.c/2144: 1 tlibio.c/1675 aio_write, aio_error = 1 Operation not permitted; random method 0200002

growfiles(gf19): 31452 growfiles.c/1679: 1 Hit max errors value of 1 gf19 1 TFAIL  : Test failed

n/a [bug1138]
ld LTP Assertion 1 ..................

-) Assertion 2 .................. 1,4c1,3 < gcc: error: x.obj: No such file or directory < gcc: error: y.obj: No such file or directory < gcc: fatal error: no input files < compilation terminated. --- > gcc: x.obj: No such file or directory > gcc: y.obj: No such file or directory > gcc: No input files FAIL - ld failed to give expected error msg

n/a This is a LTP bug [bug1162]
getcontext01 NAB n/a getcontext - Sanity test : Fail errno=38 : Function not implemented n/a libc doesn't implement getcontext for ARM, so this result is expected n/a
quota_remount_test01 blacksand n/a /opt/ltp/testcases/bin/quota_remount_test01.sh: line 81: mkfs.ext3: command not found n/a n/a n/a
sysctl03 qemux86 n/a n/a n/a n/a n/a
syslog01 qemux86 n/a n/a n/a n/a n/a
syslog02 qemux86 n/a n/a n/a n/a n/a
syslog03 qemux86 n/a n/a n/a n/a n/a
syslog04 qemux86 n/a n/a n/a n/a n/a
syslog05 qemux86 n/a n/a n/a n/a n/a
syslog06 n/a n/a n/a n/a n/a
syslog07 qemux86 n/a n/a n/a n/a n/a
syslog08 qemux86 n/a n/a n/a n/a n/a
syslog09 qemux86 n/a n/a n/a n/a n/a
syslog10 qemux86 n/a n/a n/a n/a n/a
mtest06 qemux86 n/a mmap1 caught unexpected signal - 11 --- exiting n/a
mtest06_2 blacksand n/a n/a n/a n/a n/a
su01 qemux86 n/a n/a n/a n/a n/a
cron02 qemux86 n/a n/a n/a n/a n/a
cron_deny01 qemux86 n/a n/a n/a n/a n/a
cron_allow01 qemux86 n/a n/a n/a n/a n/a
cron_dirs_checks01 qemux86 n/a n/a n/a n/a n/a
file qemux86 n/a n/a n/a n/a n/a
cron qemux86 n/a n/a n/a n/a n/a
logrotate qemux86 n/a n/a n/a n/a n/a
cpio qemux86 n/a n/a n/a n/a n/a
unzip01 qemux86 n/a n/a n/a n/a n/a
gzip01 qemux86 n/a n/a n/a n/a n/a

1.1/M4 RC3

total: 41 (100%)

LTP cases status owner error msg lsb comment bugzilla
mmap11 LTP mmap11 0 TINFO  : [471]

mmap11 1 TBROK  : pthread_create: errno=EAGAIN(11): Resource temporarily unavailable mmap11 2 TBROK  : Remaining cases broken

n/a This is a LTP bug. n/a
mmap10_2 LTP mmap10 0 TINFO  : add to KSM regions.

mmap10 0 TINFO  : use /dev/zero. mmap10 0 TINFO  : start tests. mmap10 1 TBROK  : madvise: errno=EINVAL(22): Invalid argument mmap10 2 TBROK  : Remaining cases broken

n/a It is a LTP bug. n/a
mmap10_3 LTP mmap10 0 TINFO  : add to KSM regions.

mmap10 0 TINFO  : use anonymous pages. mmap10 0 TINFO  : start tests. mmap10 1 TBROK  : madvise: errno=EINVAL(22): Invalid argument mmap10 2 TBROK  : Remaining cases broken

n/a It is a LTP bug. n/a
mmap10_4 LTP mmap10 0 TINFO  : add to KSM regions.

mmap10 0 TINFO  : use anonymous pages. mmap10 0 TINFO  : start tests. mmap10 1 TBROK  : madvise: errno=EINVAL(22): Invalid argument mmap10 2 TBROK  : Remaining cases broken

n/a It is a LTP bug. n/a
mmap10_5 LTP mmap10 0 TINFO  : add to KSM regions.

mmap10 0 TINFO  : use anonymous pages. mmap10 0 TINFO  : start tests. mmap10 1 TBROK  : madvise: errno=EINVAL(22): Invalid argument mmap10 2 TBROK  : Remaining cases broken

n/a It is a LTP bug. n/a
ksm01 LTP ksm01 0 TINFO  : KSM merging...

ksm01 1 TBROK  : open: errno=ENOENT(2): No such file or directory ksm01 2 TBROK  : Remaining cases broken

n/a It is a LTP bug. n/a
ksm01_1 LTP ksm01 0 TINFO  : KSM merging...

ksm01 1 TBROK  : open: errno=ENOENT(2): No such file or directory ksm01 2 TBROK  : Remaining cases broken

n/a It is a LTP bug. n/a
ksm03 LTP ksm03 0 TINFO  : KSM merging...

ksm03 1 TBROK  : open: errno=ENOENT(2): No such file or directory ksm03 2 TBROK  : Remaining cases broken

n/a It is a LTP bug. n/a
ksm03_1 LTP ksm03 0 TINFO  : KSM merging...

ksm03 1 TBROK  : open: errno=ENOENT(2): No such file or directory ksm03 2 TBROK  : Remaining cases broken

n/a It is a LTP bug. n/a
gf02 growfiles(gf02): 31425 growfiles.c/2144: 1 tlibio.c/1675 aio_write, aio_error = 1 Operation not permitted; random method 0200002

growfiles(gf02): 31425 growfiles.c/1679: 1 Hit max errors value of 1 gf02 1 TFAIL  : Test failed

n/a [bug1138]
gf05 growfiles(gf05): 31429 growfiles.c/2144: 1 tlibio.c/1675 aio_write, aio_error = 1 Operation not permitted; random method 0200002

growfiles(gf05): 31429 growfiles.c/1679: 1 Hit max errors value of 1 gf05 1 TFAIL  : Test failed

n/a [bug1138]
gf07 growfiles(gf07): 31432 growfiles.c/2144: 1 tlibio.c/1675 aio_write, aio_error = 1 Operation not permitted; random method 0200002

growfiles(gf07): 31432 growfiles.c/1679: 1 Hit max errors value of 1 gf07 1 TFAIL  : Test failed

n/a [bug1138]
gf09 growfiles(gf09): 31435 growfiles.c/2144: 1 tlibio.c/1675 aio_write, aio_error = 1 Operation not permitted; random method 0200002

growfiles(gf09): 31435 growfiles.c/1679: 1 Hit max errors value of 1 gf09 1 TFAIL  : Test failed

n/a [bug1138]
gf19 growfiles(gf19): 31452 growfiles.c/2144: 1 tlibio.c/1675 aio_write, aio_error = 1 Operation not permitted; random method 0200002

growfiles(gf19): 31452 growfiles.c/1679: 1 Hit max errors value of 1 gf19 1 TFAIL  : Test failed

n/a [bug1138]
ld LTP Assertion 1 ..................

-) Assertion 2 .................. 1,4c1,3 < gcc: error: x.obj: No such file or directory < gcc: error: y.obj: No such file or directory < gcc: fatal error: no input files < compilation terminated. --- > gcc: x.obj: No such file or directory > gcc: y.obj: No such file or directory > gcc: No input files FAIL - ld failed to give expected error msg

n/a This is a LTP bug [bug1162]
getcontext01 NAB n/a getcontext - Sanity test : Fail errno=38 : Function not implemented n/a libc doesn't implement getcontext for ARM, so this result is expected n/a
quota_remount_test01 blacksand n/a /opt/ltp/testcases/bin/quota_remount_test01.sh: line 81: mkfs.ext3: command not found n/a n/a n/a
sysctl03 qemux86 n/a n/a n/a n/a n/a
syslog01 qemux86 n/a n/a n/a n/a n/a
syslog02 qemux86 n/a n/a n/a n/a n/a
syslog03 qemux86 n/a n/a n/a n/a n/a
syslog04 qemux86 n/a n/a n/a n/a n/a
syslog05 qemux86 n/a n/a n/a n/a n/a
syslog06 n/a n/a n/a n/a n/a
syslog07 qemux86 n/a n/a n/a n/a n/a
syslog08 qemux86 n/a n/a n/a n/a n/a
syslog09 qemux86 n/a n/a n/a n/a n/a
syslog10 qemux86 n/a n/a n/a n/a n/a
mtest06 qemux86 n/a mmap1 caught unexpected signal - 11 --- exiting n/a
mtest06_2 blacksand n/a n/a n/a n/a n/a
su01 qemux86 n/a n/a n/a n/a n/a
cron02 qemux86 n/a n/a n/a n/a n/a
cron_deny01 qemux86 n/a n/a n/a n/a n/a
cron_allow01 qemux86 n/a n/a n/a n/a n/a
cron_dirs_checks01 qemux86 n/a n/a n/a n/a n/a
file qemux86 n/a n/a n/a n/a n/a
cron qemux86 n/a n/a n/a n/a n/a
logrotate qemux86 n/a n/a n/a n/a n/a
cpio qemux86 n/a n/a n/a n/a n/a
unzip01 qemux86 n/a n/a n/a n/a n/a
gzip01 qemux86 n/a n/a n/a n/a n/a

1.1/M4 RC2

total: 43 (100%)

LTP cases status owner error msg lsb comment bugzilla
dio10 NEW diotest4 1 TBROK  : write failed for testdata-4.18052: No space left on device

diotest4 2 TBROK  : Remaining cases broken

n/a No space left on device. This is not a bug. n/a
dio13 NEW diotest01 1 TFAIL  : write(outfd) failed: No space left on device

diotest01 2 TFAIL  : Test failed

n/a No space left on device. This is not a bug. n/a
mmap11 LTP mmap11 0 TINFO  : [471]

mmap11 1 TBROK  : pthread_create: errno=EAGAIN(11): Resource temporarily unavailable mmap11 2 TBROK  : Remaining cases broken

n/a This is a LTP bug. n/a
mmap10_2 LTP mmap10 0 TINFO  : add to KSM regions.

mmap10 0 TINFO  : use /dev/zero. mmap10 0 TINFO  : start tests. mmap10 1 TBROK  : madvise: errno=EINVAL(22): Invalid argument mmap10 2 TBROK  : Remaining cases broken

n/a It is a LTP bug. n/a
mmap10_3 LTP mmap10 0 TINFO  : add to KSM regions.

mmap10 0 TINFO  : use anonymous pages. mmap10 0 TINFO  : start tests. mmap10 1 TBROK  : madvise: errno=EINVAL(22): Invalid argument mmap10 2 TBROK  : Remaining cases broken

n/a It is a LTP bug. n/a
mmap10_4 LTP mmap10 0 TINFO  : add to KSM regions.

mmap10 0 TINFO  : use anonymous pages. mmap10 0 TINFO  : start tests. mmap10 1 TBROK  : madvise: errno=EINVAL(22): Invalid argument mmap10 2 TBROK  : Remaining cases broken

n/a It is a LTP bug. n/a
mmap10_5 LTP mmap10 0 TINFO  : add to KSM regions.

mmap10 0 TINFO  : use anonymous pages. mmap10 0 TINFO  : start tests. mmap10 1 TBROK  : madvise: errno=EINVAL(22): Invalid argument mmap10 2 TBROK  : Remaining cases broken

n/a It is a LTP bug. n/a
ksm01 LTP ksm01 0 TINFO  : KSM merging...

ksm01 1 TBROK  : open: errno=ENOENT(2): No such file or directory ksm01 2 TBROK  : Remaining cases broken

n/a It is a LTP bug. n/a
ksm01_1 LTP ksm01 0 TINFO  : KSM merging...

ksm01 1 TBROK  : open: errno=ENOENT(2): No such file or directory ksm01 2 TBROK  : Remaining cases broken

n/a It is a LTP bug. n/a
ksm03 LTP ksm03 0 TINFO  : KSM merging...

ksm03 1 TBROK  : open: errno=ENOENT(2): No such file or directory ksm03 2 TBROK  : Remaining cases broken

n/a It is a LTP bug. n/a
ksm03_1 LTP ksm03 0 TINFO  : KSM merging...

ksm03 1 TBROK  : open: errno=ENOENT(2): No such file or directory ksm03 2 TBROK  : Remaining cases broken

n/a It is a LTP bug. n/a
gf02 growfiles(gf02): 31425 growfiles.c/2144: 1 tlibio.c/1675 aio_write, aio_error = 1 Operation not permitted; random method 0200002

growfiles(gf02): 31425 growfiles.c/1679: 1 Hit max errors value of 1 gf02 1 TFAIL  : Test failed

n/a [bug1138]
gf05 growfiles(gf05): 31429 growfiles.c/2144: 1 tlibio.c/1675 aio_write, aio_error = 1 Operation not permitted; random method 0200002

growfiles(gf05): 31429 growfiles.c/1679: 1 Hit max errors value of 1 gf05 1 TFAIL  : Test failed

n/a [bug1138]
gf07 growfiles(gf07): 31432 growfiles.c/2144: 1 tlibio.c/1675 aio_write, aio_error = 1 Operation not permitted; random method 0200002

growfiles(gf07): 31432 growfiles.c/1679: 1 Hit max errors value of 1 gf07 1 TFAIL  : Test failed

n/a [bug1138]
gf09 growfiles(gf09): 31435 growfiles.c/2144: 1 tlibio.c/1675 aio_write, aio_error = 1 Operation not permitted; random method 0200002

growfiles(gf09): 31435 growfiles.c/1679: 1 Hit max errors value of 1 gf09 1 TFAIL  : Test failed

n/a [bug1138]
gf19 growfiles(gf19): 31452 growfiles.c/2144: 1 tlibio.c/1675 aio_write, aio_error = 1 Operation not permitted; random method 0200002

growfiles(gf19): 31452 growfiles.c/1679: 1 Hit max errors value of 1 gf19 1 TFAIL  : Test failed

n/a [bug1138]
ld LTP Assertion 1 ..................

-) Assertion 2 .................. 1,4c1,3 < gcc: error: x.obj: No such file or directory < gcc: error: y.obj: No such file or directory < gcc: fatal error: no input files < compilation terminated. --- > gcc: x.obj: No such file or directory > gcc: y.obj: No such file or directory > gcc: No input files FAIL - ld failed to give expected error msg

n/a This is a LTP bug [bug1162]
getcontext01 NAB n/a getcontext - Sanity test : Fail errno=38 : Function not implemented n/a libc doesn't implement getcontext for ARM, so this result is expected n/a
quota_remount_test01 blacksand n/a /opt/ltp/testcases/bin/quota_remount_test01.sh: line 81: mkfs.ext3: command not found n/a n/a n/a
sysctl03 qemux86 n/a n/a n/a n/a n/a
syslog01 qemux86 n/a n/a n/a n/a n/a
syslog02 qemux86 n/a n/a n/a n/a n/a
syslog03 qemux86 n/a n/a n/a n/a n/a
syslog04 qemux86 n/a n/a n/a n/a n/a
syslog05 qemux86 n/a n/a n/a n/a n/a
syslog06 n/a n/a n/a n/a n/a
syslog07 qemux86 n/a n/a n/a n/a n/a
syslog08 qemux86 n/a n/a n/a n/a n/a
syslog09 qemux86 n/a n/a n/a n/a n/a
syslog10 qemux86 n/a n/a n/a n/a n/a
mtest06 qemux86 n/a mmap1 caught unexpected signal - 11 --- exiting n/a
mtest06_2 blacksand n/a n/a n/a n/a n/a
su01 qemux86 n/a n/a n/a n/a n/a
cron02 qemux86 n/a n/a n/a n/a n/a
cron_deny01 qemux86 n/a n/a n/a n/a n/a
cron_allow01 qemux86 n/a n/a n/a n/a n/a
cron_dirs_checks01 qemux86 n/a n/a n/a n/a n/a
file qemux86 n/a n/a n/a n/a n/a
cron qemux86 n/a n/a n/a n/a n/a
logrotate qemux86 n/a n/a n/a n/a n/a
cpio qemux86 n/a n/a n/a n/a n/a
unzip01 qemux86 n/a n/a n/a n/a n/a
gzip01 qemux86 n/a n/a n/a n/a n/a

1.1/M3

total: 41 (100%)

LTP cases status owner error msg lsb comment bugzilla
mmap11 NEW mmap11 0 TINFO  : [471]

mmap11 1 TBROK  : pthread_create: errno=EAGAIN(11): Resource temporarily unavailable mmap11 2 TBROK  : Remaining cases broken

n/a n/a n/a
mmap10_2 NEW mmap10 0 TINFO  : add to KSM regions.

mmap10 0 TINFO  : use /dev/zero. mmap10 0 TINFO  : start tests. mmap10 1 TBROK  : madvise: errno=EINVAL(22): Invalid argument mmap10 2 TBROK  : Remaining cases broken

n/a n/a n/a
mmap10_3 NEW mmap10 0 TINFO  : add to KSM regions.

mmap10 0 TINFO  : use anonymous pages. mmap10 0 TINFO  : start tests. mmap10 1 TBROK  : madvise: errno=EINVAL(22): Invalid argument mmap10 2 TBROK  : Remaining cases broken

n/a n/a n/a
mmap10_4 NEW mmap10 0 TINFO  : add to KSM regions.

mmap10 0 TINFO  : use anonymous pages. mmap10 0 TINFO  : start tests. mmap10 1 TBROK  : madvise: errno=EINVAL(22): Invalid argument mmap10 2 TBROK  : Remaining cases broken

n/a n/a n/a
mmap10_5 NEW mmap10 0 TINFO  : add to KSM regions.

mmap10 0 TINFO  : use anonymous pages. mmap10 0 TINFO  : start tests. mmap10 1 TBROK  : madvise: errno=EINVAL(22): Invalid argument mmap10 2 TBROK  : Remaining cases broken

n/a n/a n/a
ksm01 NEW ksm01 0 TINFO  : KSM merging...

ksm01 1 TBROK  : open: errno=ENOENT(2): No such file or directory ksm01 2 TBROK  : Remaining cases broken

n/a n/a n/a
ksm01_1 NEW ksm01 0 TINFO  : KSM merging...

ksm01 1 TBROK  : open: errno=ENOENT(2): No such file or directory ksm01 2 TBROK  : Remaining cases broken

n/a n/a n/a
ksm03 NEW ksm03 0 TINFO  : KSM merging...

ksm03 1 TBROK  : open: errno=ENOENT(2): No such file or directory ksm03 2 TBROK  : Remaining cases broken

n/a n/a n/a
ksm03_1 NEW ksm03 0 TINFO  : KSM merging...

ksm03 1 TBROK  : open: errno=ENOENT(2): No such file or directory ksm03 2 TBROK  : Remaining cases broken

n/a n/a n/a
gf02 growfiles(gf02): 31425 growfiles.c/2144: 1 tlibio.c/1675 aio_write, aio_error = 1 Operation not permitted; random method 0200002

growfiles(gf02): 31425 growfiles.c/1679: 1 Hit max errors value of 1 gf02 1 TFAIL  : Test failed

n/a [bug1138]
gf05 growfiles(gf05): 31429 growfiles.c/2144: 1 tlibio.c/1675 aio_write, aio_error = 1 Operation not permitted; random method 0200002

growfiles(gf05): 31429 growfiles.c/1679: 1 Hit max errors value of 1 gf05 1 TFAIL  : Test failed

n/a [bug1138]
gf07 growfiles(gf07): 31432 growfiles.c/2144: 1 tlibio.c/1675 aio_write, aio_error = 1 Operation not permitted; random method 0200002

growfiles(gf07): 31432 growfiles.c/1679: 1 Hit max errors value of 1 gf07 1 TFAIL  : Test failed

n/a [bug1138]
gf09 growfiles(gf09): 31435 growfiles.c/2144: 1 tlibio.c/1675 aio_write, aio_error = 1 Operation not permitted; random method 0200002

growfiles(gf09): 31435 growfiles.c/1679: 1 Hit max errors value of 1 gf09 1 TFAIL  : Test failed

n/a [bug1138]
gf19 growfiles(gf19): 31452 growfiles.c/2144: 1 tlibio.c/1675 aio_write, aio_error = 1 Operation not permitted; random method 0200002

growfiles(gf19): 31452 growfiles.c/1679: 1 Hit max errors value of 1 gf19 1 TFAIL  : Test failed

n/a [bug1138]
ld LTP Assertion 1 ..................

-) Assertion 2 .................. 1,4c1,3 < gcc: error: x.obj: No such file or directory < gcc: error: y.obj: No such file or directory < gcc: fatal error: no input files < compilation terminated. --- > gcc: x.obj: No such file or directory > gcc: y.obj: No such file or directory > gcc: No input files FAIL - ld failed to give expected error msg

n/a This is a LTP bug [bug1162]
getcontext01 NAB n/a getcontext - Sanity test : Fail errno=38 : Function not implemented n/a libc doesn't implement getcontext for ARM, so this result is expected n/a
quota_remount_test01 blacksand n/a /opt/ltp/testcases/bin/quota_remount_test01.sh: line 81: mkfs.ext3: command not found n/a n/a n/a
sysctl03 qemux86 n/a n/a n/a n/a n/a
syslog01 qemux86 n/a n/a n/a n/a n/a
syslog02 qemux86 n/a n/a n/a n/a n/a
syslog03 qemux86 n/a n/a n/a n/a n/a
syslog04 qemux86 n/a n/a n/a n/a n/a
syslog05 qemux86 n/a n/a n/a n/a n/a
syslog06 NEW n/a n/a n/a n/a n/a
syslog07 qemux86 n/a n/a n/a n/a n/a
syslog08 qemux86 n/a n/a n/a n/a n/a
syslog09 qemux86 n/a n/a n/a n/a n/a
syslog10 qemux86 n/a n/a n/a n/a n/a
mtest06 qemux86 n/a mmap1 caught unexpected signal - 11 --- exiting n/a
mtest06_2 blacksand n/a n/a n/a n/a n/a
su01 qemux86 n/a n/a n/a n/a n/a
cron02 qemux86 n/a n/a n/a n/a n/a
cron_deny01 qemux86 n/a n/a n/a n/a n/a
cron_allow01 qemux86 n/a n/a n/a n/a n/a
cron_dirs_checks01 qemux86 n/a n/a n/a n/a n/a
file qemux86 n/a n/a n/a n/a n/a
cron qemux86 n/a n/a n/a n/a n/a
logrotate qemux86 n/a n/a n/a n/a n/a
cpio qemux86 n/a n/a n/a n/a n/a
unzip01 qemux86 n/a n/a n/a n/a n/a
gzip01 qemux86 n/a n/a n/a n/a n/a

1.1/M2

total: 33 (100%)

LTP cases status owner error msg lsb comment bugzilla
gf02 growfiles(gf02): 31425 growfiles.c/2144: 1 tlibio.c/1675 aio_write, aio_error = 1 Operation not permitted; random method 0200002

growfiles(gf02): 31425 growfiles.c/1679: 1 Hit max errors value of 1 gf02 1 TFAIL  : Test failed

n/a [bug1138]
gf05 growfiles(gf05): 31429 growfiles.c/2144: 1 tlibio.c/1675 aio_write, aio_error = 1 Operation not permitted; random method 0200002

growfiles(gf05): 31429 growfiles.c/1679: 1 Hit max errors value of 1 gf05 1 TFAIL  : Test failed

n/a [bug1138]
gf07 growfiles(gf07): 31432 growfiles.c/2144: 1 tlibio.c/1675 aio_write, aio_error = 1 Operation not permitted; random method 0200002

growfiles(gf07): 31432 growfiles.c/1679: 1 Hit max errors value of 1 gf07 1 TFAIL  : Test failed

n/a [bug1138]
gf09 growfiles(gf09): 31435 growfiles.c/2144: 1 tlibio.c/1675 aio_write, aio_error = 1 Operation not permitted; random method 0200002

growfiles(gf09): 31435 growfiles.c/1679: 1 Hit max errors value of 1 gf09 1 TFAIL  : Test failed

n/a [bug1138]
gf19 growfiles(gf19): 31452 growfiles.c/2144: 1 tlibio.c/1675 aio_write, aio_error = 1 Operation not permitted; random method 0200002

growfiles(gf19): 31452 growfiles.c/1679: 1 Hit max errors value of 1 gf19 1 TFAIL  : Test failed

n/a [bug1138]
ld LTP Assertion 1 ..................

-) Assertion 2 .................. 1,4c1,3 < gcc: error: x.obj: No such file or directory < gcc: error: y.obj: No such file or directory < gcc: fatal error: no input files < compilation terminated. --- > gcc: x.obj: No such file or directory > gcc: y.obj: No such file or directory > gcc: No input files FAIL - ld failed to give expected error msg

n/a This is a LTP bug [bug1162]
getcontext01 NAB n/a getcontext - Sanity test : Fail errno=38 : Function not implemented n/a libc doesn't implement getcontext for ARM, so this result is expected n/a
fallocate01 fallocate(6, 0, 49152, 4096) failed: TEST_ERRNO=EFBIG(27): File too large n/a This case is expected to return -EOPNOSUPP and then LTP will skip it. However on qemuarm/qemumips -EFBIG is returned earlier, and thus trigger this failure.

Actually I don't understand why this will happen, and any offset/length returns same failure. fallocate from util-linux could trigger this failure too.

[bug678]
fallocate02 fallocate(6, 0, 49152, 4096) failed: TEST_ERRNO=EFBIG(27): File too large n/a same as fallocate01 [bug678]
fallocate03 fallocate(6, 0, 49152, 4096) failed: TEST_ERRNO=EFBIG(27): File too large n/a same as fallocate01 [bug678]
quota_remount_test01 blacksand n/a /opt/ltp/testcases/bin/quota_remount_test01.sh: line 81: mkfs.ext3: command not found n/a n/a n/a
sysctl03 qemux86 n/a n/a n/a n/a n/a
syslog01 qemux86 n/a n/a n/a n/a n/a
syslog02 qemux86 n/a n/a n/a n/a n/a
syslog03 qemux86 n/a n/a n/a n/a n/a
syslog04 qemux86 n/a n/a n/a n/a n/a
syslog05 qemux86 n/a n/a n/a n/a n/a
syslog07 qemux86 n/a n/a n/a n/a n/a
syslog08 qemux86 n/a n/a n/a n/a n/a
syslog09 qemux86 n/a n/a n/a n/a n/a
syslog10 qemux86 n/a n/a n/a n/a n/a
mtest06_2 blacksand n/a n/a n/a n/a n/a
su01 qemux86 n/a n/a n/a n/a n/a
cron02 qemux86 n/a n/a n/a n/a n/a
cron_deny01 qemux86 n/a n/a n/a n/a n/a
cron_allow01 qemux86 n/a n/a n/a n/a n/a
cron_dirs_checks01 qemux86 n/a n/a n/a n/a n/a
file qemux86 n/a n/a n/a n/a n/a
cron qemux86 n/a n/a n/a n/a n/a
logrotate qemux86 n/a n/a n/a n/a n/a
cpio qemux86 n/a n/a n/a n/a n/a
unzip01 qemux86 n/a n/a n/a n/a n/a
gzip01 qemux86 n/a n/a n/a n/a n/a

1.1/M1

total: 34 (100%)

LTP cases status owner error msg lsb comment bugzilla
gf02 NEW growfiles(gf02): 31425 growfiles.c/2144: 1 tlibio.c/1675 aio_write, aio_error = 1 Operation not permitted; random method 0200002

growfiles(gf02): 31425 growfiles.c/1679: 1 Hit max errors value of 1 gf02 1 TFAIL  : Test failed

n/a [bug1138]
gf05 NEW growfiles(gf05): 31429 growfiles.c/2144: 1 tlibio.c/1675 aio_write, aio_error = 1 Operation not permitted; random method 0200002

growfiles(gf05): 31429 growfiles.c/1679: 1 Hit max errors value of 1 gf05 1 TFAIL  : Test failed

n/a [bug1138]
gf07 NEW growfiles(gf07): 31432 growfiles.c/2144: 1 tlibio.c/1675 aio_write, aio_error = 1 Operation not permitted; random method 0200002

growfiles(gf07): 31432 growfiles.c/1679: 1 Hit max errors value of 1 gf07 1 TFAIL  : Test failed

n/a [bug1138]
gf09 NEW growfiles(gf09): 31435 growfiles.c/2144: 1 tlibio.c/1675 aio_write, aio_error = 1 Operation not permitted; random method 0200002

growfiles(gf09): 31435 growfiles.c/1679: 1 Hit max errors value of 1 gf09 1 TFAIL  : Test failed

n/a [bug1138]
gf19 NEW growfiles(gf19): 31452 growfiles.c/2144: 1 tlibio.c/1675 aio_write, aio_error = 1 Operation not permitted; random method 0200002

growfiles(gf19): 31452 growfiles.c/1679: 1 Hit max errors value of 1 gf19 1 TFAIL  : Test failed

n/a [bug1138]
ld NEW Assertion 1 ..................

-) Assertion 2 .................. 1,4c1,3 < gcc: error: x.obj: No such file or directory < gcc: error: y.obj: No such file or directory < gcc: fatal error: no input files < compilation terminated. --- > gcc: x.obj: No such file or directory > gcc: y.obj: No such file or directory > gcc: No input files FAIL - ld failed to give expected error msg

n/a [bug1162]
getcontext01 NAB n/a getcontext - Sanity test : Fail errno=38 : Function not implemented n/a libc doesn't implement getcontext for ARM, so this result is expected n/a
fallocate01 fallocate(6, 0, 49152, 4096) failed: TEST_ERRNO=EFBIG(27): File too large n/a This case is expected to return -EOPNOSUPP and then LTP will skip it. However on qemuarm/qemumips -EFBIG is returned earlier, and thus trigger this failure.

Actually I don't understand why this will happen, and any offset/length returns same failure. fallocate from util-linux could trigger this failure too.

[bug678]
fallocate02 fallocate(6, 0, 49152, 4096) failed: TEST_ERRNO=EFBIG(27): File too large n/a same as fallocate01 [bug678]
fallocate03 fallocate(6, 0, 49152, 4096) failed: TEST_ERRNO=EFBIG(27): File too large n/a same as fallocate01 [bug678]
quota_remount_test01 blacksand n/a /opt/ltp/testcases/bin/quota_remount_test01.sh: line 81: mkfs.ext3: command not found n/a n/a n/a
ioctl03 qemux86 n/a n/a n/a n/a n/a
sysctl03 qemux86 n/a n/a n/a n/a n/a
syslog01 qemux86 n/a n/a n/a n/a n/a
syslog02 qemux86 n/a n/a n/a n/a n/a
syslog03 qemux86 n/a n/a n/a n/a n/a
syslog04 qemux86 n/a n/a n/a n/a n/a
syslog05 qemux86 n/a n/a n/a n/a n/a
syslog07 qemux86 n/a n/a n/a n/a n/a
syslog08 qemux86 n/a n/a n/a n/a n/a
syslog09 qemux86 n/a n/a n/a n/a n/a
syslog10 qemux86 n/a n/a n/a n/a n/a
mtest06_2 blacksand n/a n/a n/a n/a n/a
su01 qemux86 n/a n/a n/a n/a n/a
cron02 qemux86 n/a n/a n/a n/a n/a
cron_deny01 qemux86 n/a n/a n/a n/a n/a
cron_allow01 qemux86 n/a n/a n/a n/a n/a
cron_dirs_checks01 qemux86 n/a n/a n/a n/a n/a
file qemux86 n/a n/a n/a n/a n/a
cron qemux86 n/a n/a n/a n/a n/a
logrotate qemux86 n/a n/a n/a n/a n/a
cpio qemux86 n/a n/a n/a n/a n/a
unzip01 qemux86 n/a n/a n/a n/a n/a
gzip01 qemux86 n/a n/a n/a n/a n/a

1.0/M4 -RC2

total: 30 (100%)

  • LTP: 0
  • NAB: 0
  • Fixed: 0
  • Duplicated: 30
  • pending: 0
  • not started: 0
  • Disappear without fixing patch: 2(tar, ioctl03)

similarity: 30 (85.00%):

       fallocate01 fallocate02 fallocate03 getcontext01 quota_remount_test01 
LTP cases status owner error msg lsb comment bugzilla
getcontext01 Qemuarm n/a n/a n/a n/a n/a
fallocate01 Qemuarm n/a n/a n/a n/a n/a
fallocate02 Qemuarm n/a n/a n/a n/a n/a
fallocate03 Qemuarm n/a n/a n/a n/a n/a
quota_remount_test01 blacksand n/a n/a n/a n/a n/a
lchown02 qemux86 n/a n/a n/a n/a n/a
lchown02_16 qemux86 n/a n/a n/a n/a n/a
sysctl03 qemux86 n/a n/a n/a n/a n/a
syslog01 qemux86 n/a n/a n/a n/a n/a
syslog02 qemux86 n/a n/a n/a n/a n/a
syslog03 qemux86 n/a n/a n/a n/a n/a
syslog04 qemux86 n/a n/a n/a n/a n/a
syslog05 qemux86 n/a n/a n/a n/a n/a
syslog07 qemux86 n/a n/a n/a n/a n/a
syslog08 qemux86 n/a n/a n/a n/a n/a
syslog09 qemux86 n/a n/a n/a n/a n/a
syslog10 qemux86 n/a n/a n/a n/a n/a
mtest06_2 qemux86 n/a n/a n/a n/a n/a
mtest06 qemux86 n/a n/a n/a n/a n/a
su01 qemux86 n/a n/a n/a n/a n/a
cron02 qemux86 n/a n/a n/a n/a n/a
cron_deny01 qemux86 n/a n/a n/a n/a n/a
cron_allow01 qemux86 n/a n/a n/a n/a n/a
cron_dirs_checks01 qemux86 n/a n/a n/a n/a n/a
file qemux86 n/a n/a n/a n/a n/a
cron qemux86 n/a n/a n/a n/a n/a
logrotate qemux86 n/a n/a n/a n/a n/a
cpio qemux86 n/a n/a n/a n/a n/a
unzip01 qemux86 n/a n/a n/a n/a n/a
gzip01 qemux86 n/a n/a n/a n/a n/a


1.0/M2

total: 35 (100%)

  • LTP: 0
  • NAB: 0
  • Fixed: 0
  • Duplicated: 35
  • pending: 0
  • not started: 0

similarity: 30 (85.00%):

       fallocate01 fallocate02 fallocate03 getcontext01 quota_remount_test01 
LTP cases status owner error msg lsb comment bugzilla
getcontext01 Qemuarm n/a n/a n/a n/a n/a
fallocate01 Qemuarm n/a n/a n/a n/a n/a
fallocate02 Qemuarm n/a n/a n/a n/a n/a
fallocate03 Qemuarm n/a n/a n/a n/a n/a
quota_remount_test01 blacksand n/a n/a n/a n/a n/a
chroot01 qemux86 n/a n/a n/a n/a n/a
ioctl03 qemux86 n/a n/a n/a n/a n/a
lchown02 qemux86 n/a n/a n/a n/a n/a
lchown02_16 qemux86 n/a n/a n/a n/a n/a
open08 qemux86 n/a n/a n/a n/a n/a
sysctl03 qemux86 n/a n/a n/a n/a n/a
syslog01 qemux86 n/a n/a n/a n/a n/a
syslog02 qemux86 n/a n/a n/a n/a n/a
syslog03 qemux86 n/a n/a n/a n/a n/a
syslog04 qemux86 n/a n/a n/a n/a n/a
syslog05 qemux86 n/a n/a n/a n/a n/a
syslog07 qemux86 n/a n/a n/a n/a n/a
syslog08 qemux86 n/a n/a n/a n/a n/a
syslog09 qemux86 n/a n/a n/a n/a n/a
syslog10 qemux86 n/a n/a n/a n/a n/a
mtest06_2 qemux86 n/a n/a n/a n/a n/a
su01 qemux86 n/a n/a n/a n/a n/a
cron02 qemux86 n/a n/a n/a n/a n/a
cron_deny01 qemux86 n/a n/a n/a n/a n/a
cron_allow01 qemux86 n/a n/a n/a n/a n/a
cron_dirs_checks01 qemux86 n/a n/a n/a n/a n/a
ld qemux86 n/a n/a n/a n/a n/a
ldd qemux86 n/a n/a n/a n/a n/a
file qemux86 n/a n/a n/a n/a n/a
tar qemux86 n/a n/a n/a n/a n/a
cron qemux86 n/a n/a n/a n/a n/a
logrotate qemux86 n/a n/a n/a n/a n/a
cpio qemux86 n/a n/a n/a n/a n/a
unzip01 qemux86 n/a n/a n/a n/a n/a
gzip01 qemux86 n/a n/a n/a n/a n/a
Personal tools