Blacksand-ltp

From Yocto Project
Jump to: navigation, search

Contents

1.3 M5 RC4 20121010 build

total: 21 (100%)

LTP cases status owner error msg lsb comment bugzilla
getrusage04 NAB getrusage04 0 TINFO  : utime: 0us; stime: 0us getrusage04 0 TINFO  : utime: 0us; stime: 4000us getrusage04 1 TFAIL  : stime increased > 2000us: n/a Cause of memory n/a
madvise04 LTP madvise04 1 TFAIL  : madvise test for MADV_DONTDUMP failed with return = -1, errno = 22 : Invalid argument n/a It's a LTP bug n/a
ksm05 NAB ksm05 1 TBROK  : open: errno=ENOENT(2): No such file or directory

ksm05 2 TBROK  : Remaining cases broken ksm05 3 TBROK  : open: errno=ENOENT(2): No such file or directory

n/a It is a LTP bug n/a
mallocstress01 NAB n/a Not enough memory n/a
mtest06_2 NAB main(): mmap(): Cannot allocate memory n/a Not enough memory n/a
thp02 NAB thp02 1 TBROK  : cannot find "Hugepagesize:" in /proc/meminfo thp02 2 TBROK  : Remaining cases broken n/a Kernel doesn't support this. n/a
max_map_count NAB max_map_count 0 TINFO  : set max_map_count to 65536 max_map_count 6 TFAIL  : 65537 map entries in total, ut expected 65536 entries max_map_count 0 TINFO  : set overcommit_memory to 0 max_map_count 0 TINFO  : set max_map_count to 6553 n/a Test case fails because the difference of system implement n/a
aio02 LTP io_fsync write: Invalid argument

aio02/aio_tio 0 TINFO  : Running test 1 aio02/aio_tio 0 TINFO  : Running test 2 aio02/aio_tio 0 TINFO  : Running test 3 aio02/aio_tio 0 TINFO  : Running test 4 aio02/aio_tio 0 TINFO  : Running test 5 aio02/aio_tio 0 TINFO  : Running test 6 aio02/aio_tio 0 TINFO  : Running test 7

n/a io_fsync write: Invalid argument n/a
su01 qemux86 n/a n/a n/a n/a n/a
cron02 qemux86 n/a n/a n/a n/a n/a
cron_deny01 qemux86 n/a n/a n/a n/a n/a
cron_allow01 qemux86 n/a n/a n/a n/a n/a
cron_dirs_checks01 qemux86 n/a n/a n/a n/a n/a
file qemux86 n/a /opt/ltp/testcases/bin/file_test.sh: line 549: rpmbuild: command not found n/a n/a n/a
cron qemux86 n/a n/a n/a n/a n/a
logrotate qemux86 n/a n/a n/a n/a n/a
cpio qemux86 n/a n/a n/a n/a n/a
unzip01 qemux86 n/a n/a n/a n/a n/a
sysctl03 qemux86 n/a n/a n/a n/a n/a
syslog01 qemux86 n/a n/a n/a n/a n/a
syslog02 qemux86 n/a n/a n/a n/a n/a

1.3 M5 RC3 20121003 build

total: 26 (100%)

LTP cases status owner error msg lsb comment bugzilla
get_robust_list01 LTP get_robust_list01 4 TFAIL  : get_robust_list succeeded unexpectedly n/a It is a LTP bug. Wait for upstream n/a
getrusage04 NAB getrusage04 0 TINFO  : utime: 0us; stime: 0us getrusage04 0 TINFO  : utime: 0us; stime: 4000us getrusage04 1 TFAIL  : stime increased > 2000us: n/a Cause of memory n/a
ksm05 NAB ksm05 1 TBROK  : open: errno=ENOENT(2): No such file or directory

ksm05 2 TBROK  : Remaining cases broken ksm05 3 TBROK  : open: errno=ENOENT(2): No such file or directory

n/a It is a LTP bug n/a
setxattr03 NAB setxattr03 0 TWARN  : Unset setxattr03immutable immutable failed: errno=EINVAL(22): Invalid argument

setxattr03 0 TWARN  : Unset setxattr03appendonly append-only failed: errno=EINVAL(22): Invalid argument

n/a Warning message n/a
dio10 NAB diotest4 1 TBROK  : write failed for testdata-4.12416: No space left on device n/a No space left n/a
dio13 NAB diotest01 1 TFAIL  : write(outfd) failed: No space left on device n/a No space left n/a
mtest01 NAB mtest01 1 TFAIL  : More memory than the maximum amount you specified is already being used n/a Not enough memory n/a
mtest01w NAB mtest01 1 TFAIL  : More memory than the maximum amount you specified is already being used n/a Not enough memory n/a
mallocstress01 NAB n/a Not enough memory n/a
mtest06_2 NAB main(): mmap(): Cannot allocate memory n/a Not enough memory n/a
thp02 NAB thp02 1 TBROK  : cannot find "Hugepagesize:" in /proc/meminfo thp02 2 TBROK  : Remaining cases broken n/a Kernel doesn't support this. n/a
max_map_count NAB max_map_count 0 TINFO  : set max_map_count to 65536 max_map_count 6 TFAIL  : 65537 map entries in total, ut expected 65536 entries max_map_count 0 TINFO  : set overcommit_memory to 0 max_map_count 0 TINFO  : set max_map_count to 6553 n/a Test case fails because the difference of system implement n/a
aio02 LTP io_fsync write: Invalid argument

aio02/aio_tio 0 TINFO  : Running test 1 aio02/aio_tio 0 TINFO  : Running test 2 aio02/aio_tio 0 TINFO  : Running test 3 aio02/aio_tio 0 TINFO  : Running test 4 aio02/aio_tio 0 TINFO  : Running test 5 aio02/aio_tio 0 TINFO  : Running test 6 aio02/aio_tio 0 TINFO  : Running test 7

n/a io_fsync write: Invalid argument n/a
su01 qemux86 n/a n/a n/a n/a n/a
cron02 qemux86 n/a n/a n/a n/a n/a
cron_deny01 qemux86 n/a n/a n/a n/a n/a
cron_allow01 qemux86 n/a n/a n/a n/a n/a
cron_dirs_checks01 qemux86 n/a n/a n/a n/a n/a
file qemux86 n/a /opt/ltp/testcases/bin/file_test.sh: line 549: rpmbuild: command not found n/a n/a n/a
cron qemux86 n/a n/a n/a n/a n/a
logrotate qemux86 n/a n/a n/a n/a n/a
cpio qemux86 n/a n/a n/a n/a n/a
unzip01 qemux86 n/a n/a n/a n/a n/a
sysctl03 qemux86 n/a n/a n/a n/a n/a
syslog01 qemux86 n/a n/a n/a n/a n/a
syslog02 qemux86 n/a n/a n/a n/a n/a

1.3 M4 RC3 20120916 build

total: 7 (100%)

LTP cases status owner error msg lsb comment bugzilla
getrusage04 NAB getrusage04 1 TFAIL  : utime increased > 2000us: n/a Cause of memory n/a
sysctl03 qemux86 n/a n/a n/a n/a n/a
syslog01 qemux86 n/a n/a n/a n/a n/a
syslog02 qemux86 n/a n/a n/a n/a n/a
get_robust_list01 LTP get_robust_list01 4 TFAIL  : get_robust_list succeeded unexpectedly n/a n/a It is a LTP bug. Wait for upstream n/a
setxattr03 NAB setxattr03 0 TWARN  : Unset setxattr03immutable immutable failed: errno=ENOTTY(25): Inappropriate ioctl for device

setxattr03 0 TWARN  : Unset setxattr03appendonly append-only failed: errno=ENOTTY(25): Inappropriate ioctl for device

n/a n/a Warning message n/a
gf16 growfiles(gf16): 719 growfiles.c/1598: received unexpected signal: 1

gf16 1 TFAIL  : Test failed

n/a n/a n/a

1.3 M1 RC1 20120613 build

total: 16 (100%)

LTP cases status owner error msg lsb comment bugzilla
getrusage04 NEW getrusage04 0 TINFO  : Using 1 as multiply factor for max [us]time increment (1000+1000us)! getrusage04 0 TINFO  : utime: 0us; stime: 0us getrusage04 0 TINFO  : utime: 4000us; stime: 0us getrusage04 1 TFAIL  : utime increased > 2000us: n/a Cause of memory n/a
sysctl03 qemux86 n/a n/a n/a n/a n/a
syslog01 qemux86 n/a n/a n/a n/a n/a
syslog02 qemux86 n/a n/a n/a n/a n/a
syslog03 qemux86 n/a n/a n/a n/a n/a
syslog04 qemux86 n/a n/a n/a n/a n/a
syslog05 qemux86 n/a n/a n/a n/a n/a
syslog06 qemux86 n/a n/a n/a n/a n/a
syslog07 qemux86 n/a n/a n/a n/a n/a
syslog08 qemux86 n/a n/a n/a n/a n/a
syslog09 qemux86 n/a n/a n/a n/a n/a
syslog10 qemux86 n/a n/a n/a n/a n/a
cron02 qemux86 n/a n/a n/a n/a n/a
cron_deny01 qemux86 n/a n/a n/a n/a n/a
aio02 NEW io_fsync write: Invalid argument

aio02/aio_tio 0 TINFO  : Running test 1 aio02/aio_tio 0 TINFO  : Running test 2 aio02/aio_tio 0 TINFO  : Running test 3 aio02/aio_tio 0 TINFO  : Running test 4 aio02/aio_tio 0 TINFO  : Running test 5 aio02/aio_tio 0 TINFO  : Running test 6 aio02/aio_tio 0 TINFO  : Running test 7

n/a n/a n/a
mtest06 NEW n/a n/a n/a n/a n/a
mallocstress01 NEW n/a n/a n/a n/a n/a
get_robust_list01 NEW get_robust_list01 1 TPASS  : get_robust_list failed as expected with EFAULT get_robust_list01 2 TPASS  : get_robust_list failed as expected with EFAULT get_robust_list01 3 TPASS  : get_robust_list failed as expected with ESRCH get_robust_list01 4 TFAIL  : get_robust_list succeeded unexpectedly get_robust_list01 5 TPASS  : get_robust_list succeeded n/a n/a n/a n/a

1.3 20120606 build

total: 15 (100%)

LTP cases status owner error msg lsb comment bugzilla
getrusage04 NEW getrusage04 0 TINFO  : Using 1 as multiply factor for max [us]time increment (1000+1000us)! getrusage04 0 TINFO  : utime: 0us; stime: 0us getrusage04 0 TINFO  : utime: 4000us; stime: 0us getrusage04 1 TFAIL  : utime increased > 2000us: n/a Cause of memory n/a
sysctl03 qemux86 n/a n/a n/a n/a n/a
syslog01 qemux86 n/a n/a n/a n/a n/a
syslog02 qemux86 n/a n/a n/a n/a n/a
syslog03 qemux86 n/a n/a n/a n/a n/a
syslog04 qemux86 n/a n/a n/a n/a n/a
syslog05 qemux86 n/a n/a n/a n/a n/a
syslog06 qemux86 n/a n/a n/a n/a n/a
syslog07 qemux86 n/a n/a n/a n/a n/a
syslog08 qemux86 n/a n/a n/a n/a n/a
syslog09 qemux86 n/a n/a n/a n/a n/a
syslog10 qemux86 n/a n/a n/a n/a n/a
cron02 qemux86 n/a n/a n/a n/a n/a
cron_deny01 qemux86 n/a n/a n/a n/a n/a
aio02 NEW io_fsync write: Invalid argument

aio02/aio_tio 0 TINFO  : Running test 1 aio02/aio_tio 0 TINFO  : Running test 2 aio02/aio_tio 0 TINFO  : Running test 3 aio02/aio_tio 0 TINFO  : Running test 4 aio02/aio_tio 0 TINFO  : Running test 5 aio02/aio_tio 0 TINFO  : Running test 6 aio02/aio_tio 0 TINFO  : Running test 7

n/a n/a n/a
mtest06 NEW n/a n/a n/a n/a n/a
mallocstress01 NEW n/a n/a n/a n/a n/a

1.2/M4(RC5) Denzil

total: 21 (100%)

LTP cases status owner error msg lsb comment bugzilla
getrusage04 NEW getrusage04 0 TINFO  : utime: 0us; stime: 0us getrusage04 0 TINFO  : utime: 0us; stime: 4000us getrusage04 1 TFAIL  : stime increased > 2000us: n/a Cause of memory n/a
ksm05 NEW ksm05 1 TBROK  : open: errno=ENOENT(2): No such file or directory

ksm05 2 TBROK  : Remaining cases broken ksm05 3 TBROK  : open: errno=ENOENT(2): No such file or directory

n/a Cause of memory n/a
ld LTP Assertion 1 ..................

-) Assertion 2 .................. 1,4c1,3 < gcc: error: x.obj: No such file or directory < gcc: error: y.obj: No such file or directory < gcc: fatal error: no input files < compilation terminated. --- > gcc: x.obj: No such file or directory > gcc: y.obj: No such file or directory > gcc: No input files FAIL - ld failed to give expected error msg

n/a This is a LTP bug [bug1162]
su01 qemux86 n/a n/a n/a n/a n/a
cron02 qemux86 n/a n/a n/a n/a n/a
cron_deny01 qemux86 n/a n/a n/a n/a n/a
cron_allow01 qemux86 n/a n/a n/a n/a n/a
cron_dirs_checks01 qemux86 n/a n/a n/a n/a n/a
file qemux86 n/a /opt/ltp/testcases/bin/file_test.sh: line 549: rpmbuild: command not found n/a n/a n/a
cron qemux86 n/a n/a n/a n/a n/a
logrotate qemux86 n/a n/a n/a n/a n/a
cpio qemux86 n/a n/a n/a n/a n/a
unzip01 qemux86 n/a n/a n/a n/a n/a
sysctl03 qemux86 n/a n/a n/a n/a n/a
syslog01 qemux86 n/a n/a n/a n/a n/a
syslog02 qemux86 n/a n/a n/a n/a n/a
readlink03 LTP readlink03 9 TFAIL  : readlink() failed, Symlink Pathname is empty, errno=22, expected errno=2 readlink03 0 TWARN  : It may be a Kernel Bug, see the patch:http://git.kernel.org/linus/1fa1e7f6 n/a When 'Symlink Pathname is empty' the return value was 'ENOENT' but with newer kernels the return value is 'EINVAL'. It is a LTP bug. n/a
thp02 NEW thp02 1 TBROK  : cannot find "Hugepagesize:" in /proc/meminfo thp02 2 TBROK  : Remaining cases broken n/a n/a n/a
max_map_count NEW max_map_count 0 TINFO  : set max_map_count to 65536 max_map_count 6 TFAIL  : 65537 map entries in total, ut expected 65536 entries max_map_count 0 TINFO  : set overcommit_memory to 0 max_map_count 0 TINFO  : set max_map_count to 6553 n/a n/a n/a
min_free_kbytes NEW min_free_kbytes 2 TFAIL  : child unexpectedly failed: 0 min_free_kbytes 0 TINFO  : set min_free_kbytes to 3798 min_free_kbytes 0 TINFO  : set overcommit_memory to 0 n/a n/a n/a
aio02 NEW io_fsync write: Invalid argument

aio02/aio_tio 0 TINFO  : Running test 1 aio02/aio_tio 0 TINFO  : Running test 2 aio02/aio_tio 0 TINFO  : Running test 3 aio02/aio_tio 0 TINFO  : Running test 4 aio02/aio_tio 0 TINFO  : Running test 5 aio02/aio_tio 0 TINFO  : Running test 6 aio02/aio_tio 0 TINFO  : Running test 7

n/a n/a n/a

1.2/M4(RC4)

total: 21 (100%)

LTP cases status owner error msg lsb comment bugzilla
getrusage04 NEW getrusage04 0 TINFO  : utime: 0us; stime: 0us getrusage04 0 TINFO  : utime: 0us; stime: 4000us getrusage04 1 TFAIL  : stime increased > 2000us: n/a Cause of memory n/a
ksm05 NEW ksm05 1 TBROK  : open: errno=ENOENT(2): No such file or directory

ksm05 2 TBROK  : Remaining cases broken ksm05 3 TBROK  : open: errno=ENOENT(2): No such file or directory

n/a Cause of memory n/a
ld LTP Assertion 1 ..................

-) Assertion 2 .................. 1,4c1,3 < gcc: error: x.obj: No such file or directory < gcc: error: y.obj: No such file or directory < gcc: fatal error: no input files < compilation terminated. --- > gcc: x.obj: No such file or directory > gcc: y.obj: No such file or directory > gcc: No input files FAIL - ld failed to give expected error msg

n/a This is a LTP bug [bug1162]
su01 qemux86 n/a n/a n/a n/a n/a
cron02 qemux86 n/a n/a n/a n/a n/a
cron_deny01 qemux86 n/a n/a n/a n/a n/a
cron_allow01 qemux86 n/a n/a n/a n/a n/a
cron_dirs_checks01 qemux86 n/a n/a n/a n/a n/a
file qemux86 n/a /opt/ltp/testcases/bin/file_test.sh: line 549: rpmbuild: command not found n/a n/a n/a
cron qemux86 n/a n/a n/a n/a n/a
logrotate qemux86 n/a n/a n/a n/a n/a
cpio qemux86 n/a n/a n/a n/a n/a
unzip01 qemux86 n/a n/a n/a n/a n/a
sysctl03 qemux86 n/a n/a n/a n/a n/a
syslog01 qemux86 n/a n/a n/a n/a n/a
syslog02 qemux86 n/a n/a n/a n/a n/a
readlink03 LTP readlink03 9 TFAIL  : readlink() failed, Symlink Pathname is empty, errno=22, expected errno=2 readlink03 0 TWARN  : It may be a Kernel Bug, see the patch:http://git.kernel.org/linus/1fa1e7f6 n/a When 'Symlink Pathname is empty' the return value was 'ENOENT' but with newer kernels the return value is 'EINVAL'. It is a LTP bug. n/a
thp02 NEW thp02 1 TBROK  : cannot find "Hugepagesize:" in /proc/meminfo thp02 2 TBROK  : Remaining cases broken n/a n/a n/a
max_map_count NEW max_map_count 0 TINFO  : set max_map_count to 65536 max_map_count 6 TFAIL  : 65537 map entries in total, ut expected 65536 entries max_map_count 0 TINFO  : set overcommit_memory to 0 max_map_count 0 TINFO  : set max_map_count to 6553 n/a n/a n/a
min_free_kbytes NEW min_free_kbytes 2 TFAIL  : child unexpectedly failed: 0 min_free_kbytes 0 TINFO  : set min_free_kbytes to 3798 min_free_kbytes 0 TINFO  : set overcommit_memory to 0 n/a n/a n/a
aio02 NEW io_fsync write: Invalid argument

aio02/aio_tio 0 TINFO  : Running test 1 aio02/aio_tio 0 TINFO  : Running test 2 aio02/aio_tio 0 TINFO  : Running test 3 aio02/aio_tio 0 TINFO  : Running test 4 aio02/aio_tio 0 TINFO  : Running test 5 aio02/aio_tio 0 TINFO  : Running test 6 aio02/aio_tio 0 TINFO  : Running test 7

n/a n/a n/a

1.2/M4(RC3)

total: 21 (100%)

LTP cases status owner error msg lsb comment bugzilla
getrusage04 NEW getrusage04 0 TINFO  : utime: 0us; stime: 4000us getrusage04 1 TFAIL  : stime increased > 2000us: n/a Cause of memory n/a
ksm05 NEW ksm05 1 TBROK  : open: errno=ENOENT(2): No such file or directory

ksm05 2 TBROK  : Remaining cases broken ksm05 3 TBROK  : open: errno=ENOENT(2): No such file or directory

n/a Cause of memory n/a
ld LTP Assertion 1 ..................

-) Assertion 2 .................. 1,4c1,3 < gcc: error: x.obj: No such file or directory < gcc: error: y.obj: No such file or directory < gcc: fatal error: no input files < compilation terminated. --- > gcc: x.obj: No such file or directory > gcc: y.obj: No such file or directory > gcc: No input files FAIL - ld failed to give expected error msg

n/a This is a LTP bug [bug1162]
su01 qemux86 n/a n/a n/a n/a n/a
cron02 qemux86 n/a n/a n/a n/a n/a
cron_deny01 qemux86 n/a n/a n/a n/a n/a
cron_allow01 qemux86 n/a n/a n/a n/a n/a
cron_dirs_checks01 qemux86 n/a n/a n/a n/a n/a
file qemux86 n/a /opt/ltp/testcases/bin/file_test.sh: line 549: rpmbuild: command not found n/a n/a n/a
cron qemux86 n/a n/a n/a n/a n/a
logrotate qemux86 n/a n/a n/a n/a n/a
cpio qemux86 n/a n/a n/a n/a n/a
unzip01 qemux86 n/a n/a n/a n/a n/a
sysctl03 qemux86 n/a n/a n/a n/a n/a
syslog01 qemux86 n/a n/a n/a n/a n/a
syslog02 qemux86 n/a n/a n/a n/a n/a
readlink03 LTP readlink03 9 TFAIL  : readlink() failed, Symlink Pathname is empty, errno=22, expected errno=2 readlink03 0 TWARN  : It may be a Kernel Bug, see the patch:http://git.kernel.org/linus/1fa1e7f6 n/a When 'Symlink Pathname is empty' the return value was 'ENOENT' but with newer kernels the return value is 'EINVAL'. It is a LTP bug. n/a
thp02 NEW thp02 1 TBROK  : cannot find "Hugepagesize:" in /proc/meminfo thp02 2 TBROK  : Remaining cases broken n/a n/a n/a
max_map_count NEW max_map_count 0 TINFO  : set max_map_count to 65536 max_map_count 6 TFAIL  : 65537 map entries in total, ut expected 65536 entries max_map_count 0 TINFO  : set overcommit_memory to 0 max_map_count 0 TINFO  : set max_map_count to 6553 n/a n/a n/a
min_free_kbytes NEW min_free_kbytes 1 TFAIL  : child unexpectedly failed: 0 min_free_kbytes 0 TINFO : set min_free_kbytes to 449128 memfree is 898132 kB before eatup mem memfree is 550244 kB after eatup mem n/a n/a n/a
aio02 NEW io_fsync write: Invalid argument

aio02/aio_tio 0 TINFO  : Running test 1 aio02/aio_tio 0 TINFO  : Running test 2 aio02/aio_tio 0 TINFO  : Running test 3 aio02/aio_tio 0 TINFO  : Running test 4 aio02/aio_tio 0 TINFO  : Running test 5 aio02/aio_tio 0 TINFO  : Running test 6 aio02/aio_tio 0 TINFO  : Running test 7

n/a n/a n/a

1.2/M4(RC2)

total: 21 (100%)

LTP cases status owner error msg lsb comment bugzilla
getrusage04 NEW getrusage04 0 TINFO  : utime: 0us; stime: 0us

getrusage04 0 TINFO  : utime: 0us; stime: 4000us getrusage04 1 TFAIL  : stime increased > 1000us: delta = 4000us

n/a Cause of memory n/a
ksm05 NEW ksm05 1 TBROK  : open: errno=ENOENT(2): No such file or directory

ksm05 2 TBROK  : Remaining cases broken ksm05 3 TBROK  : open: errno=ENOENT(2): No such file or directory ksm05 4 TBROK  : open: errno=ENOENT(2): No such file or directory ksm05 5 TBROK  : open: errno=ENOENT(2): No such file or directory

n/a Cause of memory n/a
ld LTP Assertion 1 ..................

-) Assertion 2 .................. 1,4c1,3 < gcc: error: x.obj: No such file or directory < gcc: error: y.obj: No such file or directory < gcc: fatal error: no input files < compilation terminated. --- > gcc: x.obj: No such file or directory > gcc: y.obj: No such file or directory > gcc: No input files FAIL - ld failed to give expected error msg

n/a This is a LTP bug [bug1162]
su01 qemux86 n/a n/a n/a n/a n/a
cron02 qemux86 n/a n/a n/a n/a n/a
cron_deny01 qemux86 n/a n/a n/a n/a n/a
cron_allow01 qemux86 n/a n/a n/a n/a n/a
cron_dirs_checks01 qemux86 n/a n/a n/a n/a n/a
file qemux86 n/a /opt/ltp/testcases/bin/file_test.sh: line 549: rpmbuild: command not found n/a n/a n/a
cron qemux86 n/a n/a n/a n/a n/a
logrotate qemux86 n/a n/a n/a n/a n/a
cpio qemux86 n/a n/a n/a n/a n/a
unzip01 qemux86 n/a n/a n/a n/a n/a
sysctl03 qemux86 n/a n/a n/a n/a n/a
syslog01 qemux86 n/a n/a n/a n/a n/a
syslog02 qemux86 n/a n/a n/a n/a n/a
readlink03 LTP readlink03 9 TFAIL  : readlink() failed, Symlink Pathname is empty, errno=22, expected errno=2 readlink03 0 TWARN  : It may be a Kernel Bug, see the patch:http://git.kernel.org/linus/1fa1e7f6 n/a When 'Symlink Pathname is empty' the return value was 'ENOENT' but with newer kernels the return value is 'EINVAL'. It is a LTP bug. n/a
thp02 NEW thp02 1 TBROK  : cannot find "Hugepagesize:" in /proc/meminfo thp02 2 TBROK  : Remaining cases broken n/a n/a n/a
max_map_count NEW max_map_count 0 TINFO  : set max_map_count to 65536 max_map_count 6 TFAIL  : 65537 map entries in total, ut expected 65536 entries max_map_count 0 TINFO  : set overcommit_memory to 0 max_map_count 0 TINFO  : set max_map_count to 6553 n/a n/a n/a
min_free_kbytes NEW min_free_kbytes 1 TFAIL  : child unexpectedly failed: 0 min_free_kbytes 0 TINFO : set min_free_kbytes to 449128 memfree is 898132 kB before eatup mem memfree is 550244 kB after eatup mem n/a n/a n/a
aio02 NEW io_fsync write: Invalid argument

aio02/aio_tio 0 TINFO  : Running test 1 aio02/aio_tio 0 TINFO  : Running test 2 aio02/aio_tio 0 TINFO  : Running test 3 aio02/aio_tio 0 TINFO  : Running test 4 aio02/aio_tio 0 TINFO  : Running test 5 aio02/aio_tio 0 TINFO  : Running test 6 aio02/aio_tio 0 TINFO  : Running test 7

n/a n/a n/a

1.2/M4(RC1)

total: 16 (100%)

LTP cases status owner error msg lsb comment bugzilla
getrusage04 NEW getrusage04 0 TINFO  : utime: 0us; stime: 0us

getrusage04 0 TINFO  : utime: 0us; stime: 4000us getrusage04 1 TFAIL  : stime increased > 1000us: delta = 4000us

n/a Cause of memory n/a
ksm05 NEW ksm05 1 TBROK  : open: errno=ENOENT(2): No such file or directory

ksm05 2 TBROK  : Remaining cases broken ksm05 3 TBROK  : open: errno=ENOENT(2): No such file or directory ksm05 4 TBROK  : open: errno=ENOENT(2): No such file or directory ksm05 5 TBROK  : open: errno=ENOENT(2): No such file or directory

n/a Cause of memory n/a
ld LTP Assertion 1 ..................

-) Assertion 2 .................. 1,4c1,3 < gcc: error: x.obj: No such file or directory < gcc: error: y.obj: No such file or directory < gcc: fatal error: no input files < compilation terminated. --- > gcc: x.obj: No such file or directory > gcc: y.obj: No such file or directory > gcc: No input files FAIL - ld failed to give expected error msg

n/a This is a LTP bug [bug1162]
su01 qemux86 n/a n/a n/a n/a n/a
cron02 qemux86 n/a n/a n/a n/a n/a
cron_deny01 qemux86 n/a n/a n/a n/a n/a
cron_allow01 qemux86 n/a n/a n/a n/a n/a
cron_dirs_checks01 qemux86 n/a n/a n/a n/a n/a
file qemux86 n/a /opt/ltp/testcases/bin/file_test.sh: line 549: rpmbuild: command not found n/a n/a n/a
cron qemux86 n/a n/a n/a n/a n/a
logrotate qemux86 n/a n/a n/a n/a n/a
cpio qemux86 n/a n/a n/a n/a n/a
unzip01 qemux86 n/a n/a n/a n/a n/a
sysctl03 qemux86 n/a n/a n/a n/a n/a
syslog01 qemux86 n/a n/a n/a n/a n/a
syslog02 qemux86 n/a n/a n/a n/a n/a

1.2/M3(RC1)

total: 16 (100%)

LTP cases status owner error msg lsb comment bugzilla
getrusage04 NEW getrusage03 0 TINFO  : post_wait.children = 283836

getrusage03 5 TFAIL  : child.children !~= 300MB

n/a Cause of memory n/a
ksm05 NEW ksm05 1 TBROK  : open: errno=ENOENT(2): No such file or directory

ksm05 2 TBROK  : Remaining cases broken ksm05 3 TBROK  : open: errno=ENOENT(2): No such file or directory ksm05 4 TBROK  : open: errno=ENOENT(2): No such file or directory ksm05 5 TBROK  : open: errno=ENOENT(2): No such file or directory

n/a Cause of memory n/a
ld LTP Assertion 1 ..................

-) Assertion 2 .................. 1,4c1,3 < gcc: error: x.obj: No such file or directory < gcc: error: y.obj: No such file or directory < gcc: fatal error: no input files < compilation terminated. --- > gcc: x.obj: No such file or directory > gcc: y.obj: No such file or directory > gcc: No input files FAIL - ld failed to give expected error msg

n/a This is a LTP bug [bug1162]
su01 qemux86 n/a n/a n/a n/a n/a
cron02 qemux86 n/a n/a n/a n/a n/a
cron_deny01 qemux86 n/a n/a n/a n/a n/a
cron_allow01 qemux86 n/a n/a n/a n/a n/a
cron_dirs_checks01 qemux86 n/a n/a n/a n/a n/a
file qemux86 n/a /opt/ltp/testcases/bin/file_test.sh: line 549: rpmbuild: command not found n/a n/a n/a
cron qemux86 n/a n/a n/a n/a n/a
logrotate qemux86 n/a n/a n/a n/a n/a
cpio qemux86 n/a n/a n/a n/a n/a
unzip01 qemux86 n/a n/a n/a n/a n/a
sysctl03 qemux86 n/a n/a n/a n/a n/a
syslog01 qemux86 n/a n/a n/a n/a n/a
syslog02 qemux86 n/a n/a n/a n/a n/a

1.1.1

total: 36 (100%)

LTP cases status owner error msg lsb comment bugzilla
proc01 NEW jiajun proc01 1 TFAIL : read failed: /proc/self/task/18865/ns/net: errno=EINVAL(22): Invalid argument proc01 2 TFAIL : read failed: /proc/self/task/18865/ns/uts: errno=EINVAL(22): Invalid argument proc01 3 TFAIL : read failed: /proc/self/task/18865/ns/ipc: errno=EINVAL(22): Invalid argument proc01 4 TFAIL : read failed: /proc/self/ns/net: errno=EINVAL(22): Invalid argument proc01 5 TFAIL : read failed: /proc/self/ns/uts: errno=EINVAL(22): Invalid argument proc01 6 TFAIL : read failed: /proc/self/ns/ipc: errno=EINVAL(22): Invalid argument proc01 7 TFAIL : readproc() failed with 6 errors introduced with 3.0 kernel
mmap11 LTP mmap11 0 TINFO  : [751]

mmap11 1 TBROK  : pthread_create: errno=EAGAIN(11): Resource temporarily unavailable mmap11 2 TBROK  : Remaining cases broken

n/a This is a LTP bug n/a
clock_settime03 NEW jiajun clock_settime03 8 TFAIL  : clock_settime(2) failed to produce expected error (return code = -1): TEST_ERRNO=EINVAL(22): Invalid argument clock_settime03 9 TFAIL  : clock_settime(2) failed to produce expected error (return code = -1): TEST_ERRNO=EINVAL(22): Invalid argument introduced with 3.0 kernel
readlink03 LTP readlink03 9 TFAIL  : readlink() failed, Symlink Pathname is empty, errno=22, expected errno=2 n/a When 'Symlink Pathname is empty' the return value was 'ENOENT' but with newer kernels the return value is 'EINVAL'. It is a LTP bug. n/a
sockioctl01 LTP sockioctl01 4 TFAIL  : ATMARK on UDP ; returned -1 (expected -1), errno 25 (expected 22) n/a Inappropriate ioctl operation returning EINVAL with newer kernels. It is a LTP bug. n/a
mmap10_2 LTP mmap10 0 TINFO  : add to KSM regions.

mmap10 0 TINFO  : use /dev/zero. mmap10 0 TINFO  : start tests. mmap10 1 TBROK  : madvise: errno=EINVAL(22): Invalid argument mmap10 2 TBROK  : Remaining cases broken

n/a This is a LTP bug n/a
mmap10_3 LTP mmap10 0 TINFO  : add to KSM regions.

mmap10 0 TINFO  : use anonymous pages. mmap10 0 TINFO  : start tests. mmap10 1 TBROK  : madvise: errno=EINVAL(22): Invalid argument mmap10 2 TBROK  : Remaining cases broken

n/a This is a LTP bug n/a
mmap10_4 LTP mmap10 0 TINFO  : add to KSM regions.

mmap10 0 TINFO  : use anonymous pages. mmap10 0 TINFO  : start tests. mmap10 1 TBROK  : madvise: errno=EINVAL(22): Invalid argument mmap10 2 TBROK  : Remaining cases broken

n/a This is a LTP bug n/a
mmap10_5 LTP mmap10 0 TINFO  : add to KSM regions.

mmap10 0 TINFO  : use anonymous pages. mmap10 0 TINFO  : start tests. mmap10 1 TBROK  : madvise: errno=EINVAL(22): Invalid argument mmap10 2 TBROK  : Remaining cases broken

n/a This is a LTP bug n/a
ksm01 LTP ksm01 0 TINFO  : KSM merging...

ksm01 1 TBROK  : open: errno=ENOENT(2): No such file or directory ksm01 2 TBROK  : Remaining cases broken

n/a This is a LTP bug n/a
ksm01_1 LTP ksm01 1 TCONF  : KSM configuration is not enabled

ksm01 2 TCONF  : Remaining cases not appropriate for configuration

n/a This is a LTP bug n/a
ksm03 LTP ksm03 0 TINFO  : KSM merging...

ksm03 1 TBROK  : open: errno=ENOENT(2): No such file or directory ksm03 2 TBROK  : Remaining cases broke

n/a This is a LTP bug n/a
ksm03_1 LTP ksm03 0 TINFO  : child 2 stops.

ksm03 1 TBROK  : unexpected signal 15 received (pid = 20429). ksm03 2 TBROK  : Remaining cases broken ksm03 0 TINFO  : child 1 stops. ksm03 1 TBROK  : unexpected signal 15 received (pid = 20428). ksm03 2 TBROK  : Remaining cases broken ksm03 0 TINFO  : KSM merging... ksm03 1 TBROK  : open: errno=ENOENT(2): No such file or directory ksm03 2 TBROK  : Remaining cases broken

n/a This is a LTP bug n/a
ld LTP Assertion 1 ..................

-) Assertion 2 .................. 1,4c1,3 < gcc: error: x.obj: No such file or directory < gcc: error: y.obj: No such file or directory < gcc: fatal error: no input files < compilation terminated. --- > gcc: x.obj: No such file or directory > gcc: y.obj: No such file or directory > gcc: No input files FAIL - ld failed to give expected error msg

n/a This is a LTP bug [bug1162]
su01 qemux86 n/a n/a n/a n/a n/a
cron02 qemux86 n/a n/a n/a n/a n/a
cron_deny01 qemux86 n/a n/a n/a n/a n/a
cron_allow01 qemux86 n/a n/a n/a n/a n/a
cron_dirs_checks01 qemux86 n/a n/a n/a n/a n/a
file qemux86 n/a /opt/ltp/testcases/bin/file_test.sh: line 549: rpmbuild: command not found n/a n/a n/a
cron qemux86 n/a n/a n/a n/a n/a
logrotate qemux86 n/a n/a n/a n/a n/a
cpio qemux86 n/a n/a n/a n/a n/a
unzip01 qemux86 n/a n/a n/a n/a n/a
gzip01 qemux86 n/a n/a n/a n/a n/a
sysctl03 qemux86 n/a n/a n/a n/a n/a
syslog01 qemux86 n/a n/a n/a n/a n/a
syslog02 qemux86 n/a n/a n/a n/a n/a
syslog03 qemux86 n/a n/a n/a n/a n/a
syslog04 qemux86 n/a n/a n/a n/a n/a
syslog05 qemux86 n/a n/a n/a n/a n/a
syslog06 n/a n/a n/a n/a n/a
syslog07 qemux86 n/a n/a n/a n/a n/a
syslog08 qemux86 n/a n/a n/a n/a n/a
syslog09 qemux86 n/a n/a n/a n/a n/a
syslog10 qemux86 n/a n/a n/a n/a n/a

1.2/M2(RC1)

total: 27 (100%)

LTP cases status owner error msg lsb comment bugzilla
getrusage03 NEW getrusage03 0 TINFO  : post_wait.children = 153868

getrusage03 5 TFAIL  : child.children !~= 300MB

n/a Cause of memory n/a
ldd NEW /usr/lib/gcc/i586-poky-linux/4.6.3/../../../../i586-poky-linux/bin/ld: error in /opt/ltp/testcases/bin/lddfile5.obj(.eh_frame); no .eh_frame_hdr table will be created. n/a n/a [bug1922]
ksm05 NEW ksm05 1 TBROK  : open: errno=ENOENT(2): No such file or directory

ksm05 2 TBROK  : Remaining cases broken ksm05 3 TBROK  : open: errno=ENOENT(2): No such file or directory ksm05 4 TBROK  : open: errno=ENOENT(2): No such file or directory ksm05 5 TBROK  : open: errno=ENOENT(2): No such file or directory

n/a Cause of memory n/a
clock_settime03 NEW jiajun clock_settime03 1 TPASS  : clock_settime(2) got expected failure.: TEST_ERRNO=EFAULT(14): Bad address n/a introduced with 3.0 kernel n/a
nm NEW nm: nmfile1.obj: no symbols

nm: nmfile2.obj: no symbols nm: nmfile3.obj: no symbols nm -A: FAIL

n/a n/a [bug1923]
proc01 NEW jiajun proc01 1 TFAIL : read failed: /proc/self/task/28424/ns/net: errno=EINVAL(22): Invalid argument proc01 2 TFAIL : read failed: /proc/self/task/28424/ns/uts: errno=EINVAL(22): Invalid argument proc01 3 TFAIL : read failed: /proc/self/task/28424/ns/ipc: errno=EINVAL(22): Invalid argument proc01 4 TFAIL : read failed: /proc/self/ns/net: errno=EINVAL(22): Invalid argument proc01 5 TFAIL : read failed: /proc/self/ns/uts: errno=EINVAL(22): Invalid argument proc01 6 TFAIL : read failed: /proc/self/ns/ipc: errno=EINVAL(22): Invalid argument proc01 7 TFAIL : readproc() failed with 6 errors n/a introduced with 3.0 kernel n/a
readlink03 LTP readlink03 9 TFAIL  : readlink() failed, Symlink Pathname is empty, errno=22, expected errno=2 n/a When 'Symlink Pathname is empty' the return value was 'ENOENT' but with newer kernels the return value is 'EINVAL'. It is a LTP bug. n/a
sockioctl01 LTP ATMARK on UDP; returned -1 (expected -1), errno 25 (expected 22) n/a Inappropriate ioctl operation returning EINVAL with newer kernels. It is a LTP bug. n/a
mmap10_2 LTP mmap10 0 TINFO  : add to KSM regions.

mmap10 0 TINFO  : use /dev/zero. mmap10 0 TINFO  : start tests. mmap10 1 TBROK  : madvise: errno=EINVAL(22): Invalid argument mmap10 2 TBROK  : Remaining cases broken

n/a This is a LTP bug n/a
mmap10_3 LTP mmap10 0 TINFO  : add to KSM regions.

mmap10 0 TINFO  : use /dev/zero. mmap10 0 TINFO  : start tests. mmap10 1 TBROK  : madvise: errno=EINVAL(22): Invalid argument mmap10 2 TBROK  : Remaining cases broken

n/a This is a LTP bug n/a
mmap10_4 LTP mmap10 0 TINFO  : add to KSM regions.

mmap10 0 TINFO  : use /dev/zero. mmap10 0 TINFO  : start tests. mmap10 1 TBROK  : madvise: errno=EINVAL(22): Invalid argument mmap10 2 TBROK  : Remaining cases broken

n/a This is a LTP bug n/a
mmap10_5 LTP mmap10 0 TINFO  : add to KSM regions.

mmap10 0 TINFO  : use /dev/zero. mmap10 0 TINFO  : start tests. mmap10 1 TBROK  : madvise: errno=EINVAL(22): Invalid argument mmap10 2 TBROK  : Remaining cases broken

n/a This is a LTP bug n/a
ld LTP Assertion 1 ..................

-) Assertion 2 .................. 1,4c1,3 < gcc: error: x.obj: No such file or directory < gcc: error: y.obj: No such file or directory < gcc: fatal error: no input files < compilation terminated. --- > gcc: x.obj: No such file or directory > gcc: y.obj: No such file or directory > gcc: No input files FAIL - ld failed to give expected error msg

n/a This is a LTP bug [bug1162]
su01 qemux86 n/a n/a n/a n/a n/a
cron02 qemux86 n/a n/a n/a n/a n/a
cron_deny01 qemux86 n/a n/a n/a n/a n/a
cron_allow01 qemux86 n/a n/a n/a n/a n/a
cron_dirs_checks01 qemux86 n/a n/a n/a n/a n/a
file qemux86 n/a /opt/ltp/testcases/bin/file_test.sh: line 549: rpmbuild: command not found n/a n/a n/a
cron qemux86 n/a n/a n/a n/a n/a
logrotate qemux86 n/a n/a n/a n/a n/a
cpio qemux86 n/a n/a n/a n/a n/a
unzip01 qemux86 n/a n/a n/a n/a n/a
gzip01 qemux86 n/a n/a n/a n/a n/a
sysctl03 qemux86 n/a n/a n/a n/a n/a
syslog01 qemux86 n/a n/a n/a n/a n/a
syslog02 qemux86 n/a n/a n/a n/a n/a

1.2/M1(RC2)

total: 36 (100%)

LTP cases status owner error msg lsb comment bugzilla
proc01 NEW jiajun proc01 1 TFAIL : read failed: /proc/self/task/28424/ns/net: errno=EINVAL(22): Invalid argument proc01 2 TFAIL : read failed: /proc/self/task/28424/ns/uts: errno=EINVAL(22): Invalid argument proc01 3 TFAIL : read failed: /proc/self/task/28424/ns/ipc: errno=EINVAL(22): Invalid argument proc01 4 TFAIL : read failed: /proc/self/ns/net: errno=EINVAL(22): Invalid argument proc01 5 TFAIL : read failed: /proc/self/ns/uts: errno=EINVAL(22): Invalid argument proc01 6 TFAIL : read failed: /proc/self/ns/ipc: errno=EINVAL(22): Invalid argument proc01 7 TFAIL : readproc() failed with 6 errors introduced with 3.0 kernel
mmap11 LTP mmap11 0 TINFO  : [751]

mmap11 1 TBROK  : pthread_create: errno=EAGAIN(11): Resource temporarily unavailable mmap11 2 TBROK  : Remaining cases broken

n/a This is a LTP bug n/a
clock_settime03 NEW jiajun clock_settime03 8 TFAIL  : clock_settime(2) failed to produce expected error (return code = -1): TEST_ERRNO=EINVAL(22): Invalid argument clock_settime03 9 TFAIL  : clock_settime(2) failed to produce expected error (return code = -1): TEST_ERRNO=EINVAL(22): Invalid argument introduced with 3.0 kernel
readlink03 LTP readlink03 9 TFAIL  : readlink() failed, Symlink Pathname is empty, errno=22, expected errno=2 n/a When 'Symlink Pathname is empty' the return value was 'ENOENT' but with newer kernels the return value is 'EINVAL'. It is a LTP bug. n/a
sockioctl01 LTP ATMARK on UDP; returned -1 (expected -1), errno 25 (expected 22) n/a Inappropriate ioctl operation returning EINVAL with newer kernels. It is a LTP bug. n/a
mmap10_2 LTP mmap10 0 TINFO  : add to KSM regions.

mmap10 0 TINFO  : use /dev/zero. mmap10 0 TINFO  : start tests. mmap10 1 TBROK  : madvise: errno=EINVAL(22): Invalid argument mmap10 2 TBROK  : Remaining cases broken

n/a This is a LTP bug n/a
mmap10_3 LTP mmap10 0 TINFO  : add to KSM regions.

mmap10 0 TINFO  : use anonymous pages. mmap10 0 TINFO  : start tests. mmap10 1 TBROK  : madvise: errno=EINVAL(22): Invalid argument mmap10 2 TBROK  : Remaining cases broken

n/a This is a LTP bug n/a
mmap10_4 LTP mmap10 0 TINFO  : add to KSM regions.

mmap10 0 TINFO  : use anonymous pages. mmap10 0 TINFO  : start tests. mmap10 1 TBROK  : madvise: errno=EINVAL(22): Invalid argument mmap10 2 TBROK  : Remaining cases broken

n/a This is a LTP bug n/a
mmap10_5 LTP mmap10 0 TINFO  : add to KSM regions.

mmap10 0 TINFO  : use anonymous pages. mmap10 0 TINFO  : start tests. mmap10 1 TBROK  : madvise: errno=EINVAL(22): Invalid argument mmap10 2 TBROK  : Remaining cases broken

n/a This is a LTP bug n/a
ksm01 LTP ksm01 0 TINFO  : KSM merging...

ksm01 1 TBROK  : open: errno=ENOENT(2): No such file or directory ksm01 2 TBROK  : Remaining cases broken

n/a This is a LTP bug n/a
ksm01_1 LTP ksm01 0 TINFO  : KSM merging...

ksm01 1 TBROK  : open: errno=ENOENT(2): No such file or directory ksm01 2 TBROK  : Remaining cases broken

n/a This is a LTP bug n/a
ksm03 LTP ksm03 0 TINFO  : KSM merging...

ksm03 1 TBROK  : open: errno=ENOENT(2): No such file or directory ksm03 2 TBROK  : Remaining cases broken

n/a This is a LTP bug n/a
ksm03_1 LTP ksm03 0 TINFO  : KSM merging...

ksm03 1 TBROK  : open: errno=ENOENT(2): No such file or directory ksm03 2 TBROK  : Remaining cases broken

n/a This is a LTP bug n/a
ld LTP Assertion 1 ..................

-) Assertion 2 .................. 1,4c1,3 < gcc: error: x.obj: No such file or directory < gcc: error: y.obj: No such file or directory < gcc: fatal error: no input files < compilation terminated. --- > gcc: x.obj: No such file or directory > gcc: y.obj: No such file or directory > gcc: No input files FAIL - ld failed to give expected error msg

n/a This is a LTP bug [bug1162]
su01 qemux86 n/a n/a n/a n/a n/a
cron02 qemux86 n/a n/a n/a n/a n/a
cron_deny01 qemux86 n/a n/a n/a n/a n/a
cron_allow01 qemux86 n/a n/a n/a n/a n/a
cron_dirs_checks01 qemux86 n/a n/a n/a n/a n/a
file qemux86 n/a /opt/ltp/testcases/bin/file_test.sh: line 549: rpmbuild: command not found n/a n/a n/a
cron qemux86 n/a n/a n/a n/a n/a
logrotate qemux86 n/a n/a n/a n/a n/a
cpio qemux86 n/a n/a n/a n/a n/a
unzip01 qemux86 n/a n/a n/a n/a n/a
gzip01 qemux86 n/a n/a n/a n/a n/a
sysctl03 qemux86 n/a n/a n/a n/a n/a
syslog01 qemux86 n/a n/a n/a n/a n/a
syslog02 qemux86 n/a n/a n/a n/a n/a
syslog03 qemux86 n/a n/a n/a n/a n/a
syslog04 qemux86 n/a n/a n/a n/a n/a
syslog05 qemux86 n/a n/a n/a n/a n/a
syslog06 n/a n/a n/a n/a n/a
syslog07 qemux86 n/a n/a n/a n/a n/a
syslog08 qemux86 n/a n/a n/a n/a n/a
syslog09 qemux86 n/a n/a n/a n/a n/a
syslog10 qemux86 n/a n/a n/a n/a n/a

1.1/M4(RC4)

total: 37 (100%)

LTP cases status owner error msg lsb comment bugzilla
creat08 NEW
proc01 NEW jiajun clock_settime(2) failed to produce expected error (return code = -1): TEST_ERRNO=EINVAL(22): Invalid argument introduced with 3.0 kernel
mmap11 LTP mmap11 0 TINFO  : [751]

mmap11 1 TBROK  : pthread_create: errno=EAGAIN(11): Resource temporarily unavailable mmap11 2 TBROK  : Remaining cases broken

n/a This is a LTP bug n/a
clock_settime03 NEW jiajun sockioctl01 8/9 TFAIL  : ATMARK on UDP ; returned -1 (expected -1), errno 25 (expected 22) introduced with 3.0 kernel
readlink03 LTP readlink03 9 TFAIL  : readlink() failed, Symlink Pathname is empty, errno=22, expected errno=2 n/a When 'Symlink Pathname is empty' the return value was 'ENOENT' but with newer kernels the return value is 'EINVAL'. It is a LTP bug. n/a
sockioctl01 LTP ATMARK on UDP; returned -1 (expected -1), errno 25 (expected 22) n/a Inappropriate ioctl operation returning EINVAL with newer kernels. It is a LTP bug. n/a
mmap10_2 LTP mmap10 0 TINFO  : add to KSM regions.

mmap10 0 TINFO  : use /dev/zero. mmap10 0 TINFO  : start tests. mmap10 1 TBROK  : madvise: errno=EINVAL(22): Invalid argument mmap10 2 TBROK  : Remaining cases broken

n/a This is a LTP bug n/a
mmap10_3 LTP mmap10 0 TINFO  : add to KSM regions.

mmap10 0 TINFO  : use anonymous pages. mmap10 0 TINFO  : start tests. mmap10 1 TBROK  : madvise: errno=EINVAL(22): Invalid argument mmap10 2 TBROK  : Remaining cases broken

n/a This is a LTP bug n/a
mmap10_4 LTP mmap10 0 TINFO  : add to KSM regions.

mmap10 0 TINFO  : use anonymous pages. mmap10 0 TINFO  : start tests. mmap10 1 TBROK  : madvise: errno=EINVAL(22): Invalid argument mmap10 2 TBROK  : Remaining cases broken

n/a This is a LTP bug n/a
mmap10_5 LTP mmap10 0 TINFO  : add to KSM regions.

mmap10 0 TINFO  : use anonymous pages. mmap10 0 TINFO  : start tests. mmap10 1 TBROK  : madvise: errno=EINVAL(22): Invalid argument mmap10 2 TBROK  : Remaining cases broken

n/a This is a LTP bug n/a
ksm01 LTP ksm01 0 TINFO  : KSM merging...

ksm01 1 TBROK  : open: errno=ENOENT(2): No such file or directory ksm01 2 TBROK  : Remaining cases broken

n/a This is a LTP bug n/a
ksm01_1 LTP ksm01 0 TINFO  : KSM merging...

ksm01 1 TBROK  : open: errno=ENOENT(2): No such file or directory ksm01 2 TBROK  : Remaining cases broken

n/a This is a LTP bug n/a
ksm03 LTP ksm03 0 TINFO  : KSM merging...

ksm03 1 TBROK  : open: errno=ENOENT(2): No such file or directory ksm03 2 TBROK  : Remaining cases broken

n/a This is a LTP bug n/a
ksm03_1 LTP ksm03 0 TINFO  : KSM merging...

ksm03 1 TBROK  : open: errno=ENOENT(2): No such file or directory ksm03 2 TBROK  : Remaining cases broken

n/a This is a LTP bug n/a
ld LTP Assertion 1 ..................

-) Assertion 2 .................. 1,4c1,3 < gcc: error: x.obj: No such file or directory < gcc: error: y.obj: No such file or directory < gcc: fatal error: no input files < compilation terminated. --- > gcc: x.obj: No such file or directory > gcc: y.obj: No such file or directory > gcc: No input files FAIL - ld failed to give expected error msg

n/a This is a LTP bug [bug1162]
su01 qemux86 n/a n/a n/a n/a n/a
cron02 qemux86 n/a n/a n/a n/a n/a
cron_deny01 qemux86 n/a n/a n/a n/a n/a
cron_allow01 qemux86 n/a n/a n/a n/a n/a
cron_dirs_checks01 qemux86 n/a n/a n/a n/a n/a
file qemux86 n/a /opt/ltp/testcases/bin/file_test.sh: line 549: rpmbuild: command not found n/a n/a n/a
cron qemux86 n/a n/a n/a n/a n/a
logrotate qemux86 n/a n/a n/a n/a n/a
cpio qemux86 n/a n/a n/a n/a n/a
unzip01 qemux86 n/a n/a n/a n/a n/a
gzip01 qemux86 n/a n/a n/a n/a n/a
sysctl03 qemux86 n/a n/a n/a n/a n/a
syslog01 qemux86 n/a n/a n/a n/a n/a
syslog02 qemux86 n/a n/a n/a n/a n/a
syslog03 qemux86 n/a n/a n/a n/a n/a
syslog04 qemux86 n/a n/a n/a n/a n/a
syslog05 qemux86 n/a n/a n/a n/a n/a
syslog06 n/a n/a n/a n/a n/a
syslog07 qemux86 n/a n/a n/a n/a n/a
syslog08 qemux86 n/a n/a n/a n/a n/a
syslog09 qemux86 n/a n/a n/a n/a n/a
syslog10 qemux86 n/a n/a n/a n/a n/a

1.1/M4(RC3)

total: 37 (100%)

LTP cases status owner error msg lsb comment bugzilla
creat08 NEW
proc01 NEW jiajun clock_settime(2) failed to produce expected error (return code = -1): TEST_ERRNO=EINVAL(22): Invalid argument introduced with 3.0 kernel
clock_settime03 NEW jiajun sockioctl01 4 TFAIL  : ATMARK on UDP ; returned -1 (expected -1), errno 25 (expected 22) introduced with 3.0 kernel
readlink03 LTP readlink03 9 TFAIL  : readlink() failed, Symlink Pathname is empty, errno=22, expected errno=2 n/a When 'Symlink Pathname is empty' the return value was 'ENOENT' but with newer kernels the return value is 'EINVAL'. It is a LTP bug. n/a
sockioctl01 LTP sockioctl01 4 TFAIL  : ATMARK on UDP ; returned -1 (expected -1), errno 25 (expected 22) n/a Inappropriate ioctl operation returning EINVAL with newer kernels. It is a LTP bug. n/a
mmap11 LTP mmap11 0 TINFO  : [471]

mmap11 1 TBROK  : pthread_create: errno=EAGAIN(11): Resource temporarily unavailable mmap11 2 TBROK  : Remaining cases broken

n/a This is a LTP bug n/a
mmap10_2 LTP mmap10 0 TINFO  : add to KSM regions.

mmap10 0 TINFO  : use /dev/zero. mmap10 0 TINFO  : start tests. mmap10 1 TBROK  : madvise: errno=EINVAL(22): Invalid argument mmap10 2 TBROK  : Remaining cases broken

n/a This is a LTP bug n/a
mmap10_3 LTP mmap10 0 TINFO  : add to KSM regions.

mmap10 0 TINFO  : use anonymous pages. mmap10 0 TINFO  : start tests. mmap10 1 TBROK  : madvise: errno=EINVAL(22): Invalid argument mmap10 2 TBROK  : Remaining cases broken

n/a This is a LTP bug n/a
mmap10_4 LTP mmap10 0 TINFO  : add to KSM regions.

mmap10 0 TINFO  : use anonymous pages. mmap10 0 TINFO  : start tests. mmap10 1 TBROK  : madvise: errno=EINVAL(22): Invalid argument mmap10 2 TBROK  : Remaining cases broken

n/a This is a LTP bug n/a
mmap10_5 LTP mmap10 0 TINFO  : add to KSM regions.

mmap10 0 TINFO  : use anonymous pages. mmap10 0 TINFO  : start tests. mmap10 1 TBROK  : madvise: errno=EINVAL(22): Invalid argument mmap10 2 TBROK  : Remaining cases broken

n/a This is a LTP bug n/a
ksm01 LTP ksm01 0 TINFO  : KSM merging...

ksm01 1 TBROK  : open: errno=ENOENT(2): No such file or directory ksm01 2 TBROK  : Remaining cases broken

n/a This is a LTP bug n/a
ksm01_1 LTP ksm01 0 TINFO  : KSM merging...

ksm01 1 TBROK  : open: errno=ENOENT(2): No such file or directory ksm01 2 TBROK  : Remaining cases broken

n/a This is a LTP bug n/a
ksm03 LTP ksm03 0 TINFO  : KSM merging...

ksm03 1 TBROK  : open: errno=ENOENT(2): No such file or directory ksm03 2 TBROK  : Remaining cases broken

n/a This is a LTP bug n/a
ksm03_1 LTP ksm03 0 TINFO  : KSM merging...

ksm03 1 TBROK  : open: errno=ENOENT(2): No such file or directory ksm03 2 TBROK  : Remaining cases broken

n/a This is a LTP bug n/a
ld LTP Assertion 1 ..................

-) Assertion 2 .................. 1,4c1,3 < gcc: error: x.obj: No such file or directory < gcc: error: y.obj: No such file or directory < gcc: fatal error: no input files < compilation terminated. --- > gcc: x.obj: No such file or directory > gcc: y.obj: No such file or directory > gcc: No input files FAIL - ld failed to give expected error msg

n/a This is a LTP bug [bug1162]
su01 qemux86 n/a n/a n/a n/a n/a
cron02 qemux86 n/a n/a n/a n/a n/a
cron_deny01 qemux86 n/a n/a n/a n/a n/a
cron_allow01 qemux86 n/a n/a n/a n/a n/a
cron_dirs_checks01 qemux86 n/a n/a n/a n/a n/a
file qemux86 n/a /opt/ltp/testcases/bin/file_test.sh: line 549: rpmbuild: command not found n/a n/a n/a
cron qemux86 n/a n/a n/a n/a n/a
logrotate qemux86 n/a n/a n/a n/a n/a
cpio qemux86 n/a n/a n/a n/a n/a
unzip01 qemux86 n/a n/a n/a n/a n/a
gzip01 qemux86 n/a n/a n/a n/a n/a
sysctl03 qemux86 n/a n/a n/a n/a n/a
syslog01 qemux86 n/a n/a n/a n/a n/a
syslog02 qemux86 n/a n/a n/a n/a n/a
syslog03 qemux86 n/a n/a n/a n/a n/a
syslog04 qemux86 n/a n/a n/a n/a n/a
syslog05 qemux86 n/a n/a n/a n/a n/a
syslog06 n/a n/a n/a n/a n/a
syslog07 qemux86 n/a n/a n/a n/a n/a
syslog08 qemux86 n/a n/a n/a n/a n/a
syslog09 qemux86 n/a n/a n/a n/a n/a
syslog10 qemux86 n/a n/a n/a n/a n/a

1.1/M4

total: 26 (100%)

LTP cases status owner error msg comment bugzilla
readlink03 NEW jiajun readlink03 9 TFAIL  : readlink() failed, Symlink Pathname is empty, errno=22, expected errno= introduced with 3.0 kernel
sockioctl01 NEW jiajun sockioctl01 4 TFAIL  : ATMARK on UDP ; returned -1 (expected -1), errno 25 (expected 22) introduced with 3.0 kernel
proc01 NEW jiajun clock_settime(2) failed to produce expected error (return code = -1): TEST_ERRNO=EINVAL(22): Invalid argument introduced with 3.0 kernel
clock_settime03 NEW jiajun sockioctl01 4 TFAIL  : ATMARK on UDP ; returned -1 (expected -1), errno 25 (expected 22) introduced with 3.0 kernel
file qemux86 n/a n/a n/a n/a
sysctl03 qemux86 n/a n/a n/a n/a
syslog01 qemux86 n/a n/a n/a n/a
syslog02 qemux86 n/a n/a n/a n/a
syslog03 qemux86 n/a n/a n/a n/a
syslog04 qemux86 n/a n/a n/a n/a
syslog05 qemux86 n/a n/a n/a n/a
syslog07 qemux86 n/a n/a n/a n/a
syslog08 qemux86 n/a n/a n/a n/a
syslog09 qemux86 n/a n/a n/a n/a
syslog10 qemux86 n/a n/a n/a n/a
su01 qemux86 n/a n/a n/a n/a
cron02 qemux86 n/a n/a n/a n/a
cron_deny01 qemux86 n/a n/a n/a n/a
cron_allow01 qemux86 n/a n/a n/a n/a
cron_dirs_checks01 qemux86 n/a n/a n/a n/a
ld qemux86 n/a n/a n/a n/a
cron qemux86 n/a n/a n/a n/a
logrotate qemux86 n/a n/a n/a n/a
cpio qemux86 n/a n/a n/a n/a
unzip01 qemux86 n/a n/a n/a n/a
gzip01 qemux86 n/a n/a n/a n/a


1.1/M3

total: 28 (100%)

LTP cases status owner error msg comment bugzilla
gf02 NEW growfiles(gf02): 13903 growfiles.c/2144: 1 tlibio.c/1675 aio_write, aio_error = 1 Operation not permitted; random method 0200002 growfiles(gf02): 13903 growfiles.c/1679: 1 Hit max errors value of 1 http://bugzilla.pokylinux.org/show_bug.cgi?id=1138
gf05 NEW growfiles(gf02): 13903 growfiles.c/2144: 1 tlibio.c/1675 aio_write, aio_error = 1 Operation not permitted; random method 0200002 growfiles(gf02): 13903 growfiles.c/1679: 1 Hit max errors value of 1 http://bugzilla.pokylinux.org/show_bug.cgi?id=1138
gf07 NEW growfiles(gf02): 13903 growfiles.c/2144: 1 tlibio.c/1675 aio_write, aio_error = 1 Operation not permitted; random method 0200002 growfiles(gf02): 13903 growfiles.c/1679: 1 Hit max errors value of 1 http://bugzilla.pokylinux.org/show_bug.cgi?id=1138
gf09 NEW growfiles(gf02): 13903 growfiles.c/2144: 1 tlibio.c/1675 aio_write, aio_error = 1 Operation not permitted; random method 0200002 growfiles(gf02): 13903 growfiles.c/1679: 1 Hit max errors value of 1 http://bugzilla.pokylinux.org/show_bug.cgi?id=1138
gf19 NEW growfiles(gf02): 13903 growfiles.c/2144: 1 tlibio.c/1675 aio_write, aio_error = 1 Operation not permitted; random method 0200002 growfiles(gf02): 13903 growfiles.c/1679: 1 Hit max errors value of 1 http://bugzilla.pokylinux.org/show_bug.cgi?id=1138
quota_remount_test01 NAB Kevin Tian quota_remount_test01.sh: line 86: quotacheck: not found n/a live image doesn't contain quota utility
ioctl03 qemux86 n/a n/a n/a n/a
sysctl03 qemux86 n/a n/a n/a n/a
syslog01 qemux86 n/a n/a n/a n/a
syslog02 qemux86 n/a n/a n/a n/a
syslog03 qemux86 n/a n/a n/a n/a
syslog04 qemux86 n/a n/a n/a n/a
syslog05 qemux86 n/a n/a n/a n/a
syslog07 qemux86 n/a n/a n/a n/a
syslog08 qemux86 n/a n/a n/a n/a
syslog09 qemux86 n/a n/a n/a n/a
syslog10 qemux86 n/a n/a n/a n/a
su01 qemux86 n/a n/a n/a n/a
cron02 qemux86 n/a n/a n/a n/a
cron_deny01 qemux86 n/a n/a n/a n/a
cron_allow01 qemux86 n/a n/a n/a n/a
cron_dirs_checks01 qemux86 n/a n/a n/a n/a
ld NEW n/a n/a n/a http://bugzilla.pokylinux.org/show_bug.cgi?id=1162
file qemux86 n/a n/a n/a n/a
cron qemux86 n/a n/a n/a n/a
logrotate qemux86 n/a n/a n/a n/a
cpio qemux86 n/a n/a n/a n/a
unzip01 qemux86 n/a n/a n/a n/a
gzip01 qemux86 n/a n/a n/a n/a


1.1/M2

total: 28 (100%)

LTP cases status owner error msg comment bugzilla
gf02 NEW growfiles(gf02): 13903 growfiles.c/2144: 1 tlibio.c/1675 aio_write, aio_error = 1 Operation not permitted; random method 0200002 growfiles(gf02): 13903 growfiles.c/1679: 1 Hit max errors value of 1 http://bugzilla.pokylinux.org/show_bug.cgi?id=1138
gf05 NEW growfiles(gf02): 13903 growfiles.c/2144: 1 tlibio.c/1675 aio_write, aio_error = 1 Operation not permitted; random method 0200002 growfiles(gf02): 13903 growfiles.c/1679: 1 Hit max errors value of 1 http://bugzilla.pokylinux.org/show_bug.cgi?id=1138
gf07 NEW growfiles(gf02): 13903 growfiles.c/2144: 1 tlibio.c/1675 aio_write, aio_error = 1 Operation not permitted; random method 0200002 growfiles(gf02): 13903 growfiles.c/1679: 1 Hit max errors value of 1 http://bugzilla.pokylinux.org/show_bug.cgi?id=1138
gf09 NEW growfiles(gf02): 13903 growfiles.c/2144: 1 tlibio.c/1675 aio_write, aio_error = 1 Operation not permitted; random method 0200002 growfiles(gf02): 13903 growfiles.c/1679: 1 Hit max errors value of 1 http://bugzilla.pokylinux.org/show_bug.cgi?id=1138
gf19 NEW growfiles(gf02): 13903 growfiles.c/2144: 1 tlibio.c/1675 aio_write, aio_error = 1 Operation not permitted; random method 0200002 growfiles(gf02): 13903 growfiles.c/1679: 1 Hit max errors value of 1 http://bugzilla.pokylinux.org/show_bug.cgi?id=1138
quota_remount_test01 NAB Kevin Tian quota_remount_test01.sh: line 86: quotacheck: not found n/a live image doesn't contain quota utility
ioctl03 qemux86 n/a n/a n/a n/a
sysctl03 qemux86 n/a n/a n/a n/a
syslog01 qemux86 n/a n/a n/a n/a
syslog02 qemux86 n/a n/a n/a n/a
syslog03 qemux86 n/a n/a n/a n/a
syslog04 qemux86 n/a n/a n/a n/a
syslog05 qemux86 n/a n/a n/a n/a
syslog07 qemux86 n/a n/a n/a n/a
syslog08 qemux86 n/a n/a n/a n/a
syslog09 qemux86 n/a n/a n/a n/a
syslog10 qemux86 n/a n/a n/a n/a
su01 qemux86 n/a n/a n/a n/a
cron02 qemux86 n/a n/a n/a n/a
cron_deny01 qemux86 n/a n/a n/a n/a
cron_allow01 qemux86 n/a n/a n/a n/a
cron_dirs_checks01 qemux86 n/a n/a n/a n/a
ld qemux86 n/a n/a n/a n/a
file qemux86 n/a n/a n/a n/a
cron qemux86 n/a n/a n/a n/a
logrotate qemux86 n/a n/a n/a n/a
cpio qemux86 n/a n/a n/a n/a
unzip01 qemux86 n/a n/a n/a n/a
gzip01 qemux86 n/a n/a n/a n/a

1.1/M1

total: 30 (100%)

LTP cases status owner error msg comment bugzilla
gf02 NEW growfiles(gf02): 13903 growfiles.c/2144: 1 tlibio.c/1675 aio_write, aio_error = 1 Operation not permitted; random method 0200002 growfiles(gf02): 13903 growfiles.c/1679: 1 Hit max errors value of 1 http://bugzilla.pokylinux.org/show_bug.cgi?id=1138
gf05 NEW growfiles(gf02): 13903 growfiles.c/2144: 1 tlibio.c/1675 aio_write, aio_error = 1 Operation not permitted; random method 0200002 growfiles(gf02): 13903 growfiles.c/1679: 1 Hit max errors value of 1 http://bugzilla.pokylinux.org/show_bug.cgi?id=1138
gf07 NEW growfiles(gf02): 13903 growfiles.c/2144: 1 tlibio.c/1675 aio_write, aio_error = 1 Operation not permitted; random method 0200002 growfiles(gf02): 13903 growfiles.c/1679: 1 Hit max errors value of 1 http://bugzilla.pokylinux.org/show_bug.cgi?id=1138
gf09 NEW growfiles(gf02): 13903 growfiles.c/2144: 1 tlibio.c/1675 aio_write, aio_error = 1 Operation not permitted; random method 0200002 growfiles(gf02): 13903 growfiles.c/1679: 1 Hit max errors value of 1 http://bugzilla.pokylinux.org/show_bug.cgi?id=1138
gf19 NEW growfiles(gf02): 13903 growfiles.c/2144: 1 tlibio.c/1675 aio_write, aio_error = 1 Operation not permitted; random method 0200002 growfiles(gf02): 13903 growfiles.c/1679: 1 Hit max errors value of 1 http://bugzilla.pokylinux.org/show_bug.cgi?id=1138
mtest06_2 NAB Kevin Tian main(): mmap(): Cannot allocate memory The case needs more than 1GB memory
quota_remount_test01 NAB Kevin Tian quota_remount_test01.sh: line 86: quotacheck: not found n/a live image doesn't contain quota utility
ioctl03 qemux86 n/a n/a n/a n/a
sysctl03 qemux86 n/a n/a n/a n/a
syslog01 qemux86 n/a n/a n/a n/a
syslog02 qemux86 n/a n/a n/a n/a
syslog03 qemux86 n/a n/a n/a n/a
syslog04 qemux86 n/a n/a n/a n/a
syslog05 qemux86 n/a n/a n/a n/a
syslog07 qemux86 n/a n/a n/a n/a
syslog08 qemux86 n/a n/a n/a n/a
syslog09 qemux86 n/a n/a n/a n/a
syslog10 qemux86 n/a n/a n/a n/a
mtest06 qemux86 n/a n/a n/a n/a
su01 qemux86 n/a n/a n/a n/a
cron02 qemux86 n/a n/a n/a n/a
cron_deny01 qemux86 n/a n/a n/a n/a
cron_allow01 qemux86 n/a n/a n/a n/a
cron_dirs_checks01 qemux86 n/a n/a n/a n/a
ld qemux86 n/a n/a n/a n/a
file qemux86 n/a n/a n/a n/a
cron qemux86 n/a n/a n/a n/a
logrotate qemux86 n/a n/a n/a n/a
cpio qemux86 n/a n/a n/a n/a
unzip01 qemux86 n/a n/a n/a n/a
gzip01 qemux86 n/a n/a n/a n/a

1.0/M2

total: 29 (100%)

  • LTP: 0
  • NAB: 1
  • Fixed: 0
  • Duplicated: 28
  • pending: 0
  • not started: 0

similarity: 28 (96.00%):

       quota_remount_test01 
LTP cases status owner error msg lsb comment bugzilla
quota_remount_test01 NAB Kevin Tian quota_remount_test01.sh: line 86: quotacheck: not found n/a atom-pc live image doesn't contain quota utility n/a
ioctl03 qemux86 n/a n/a n/a n/a n/a
lchown02 qemux86 n/a n/a n/a n/a n/a
lchown02_16 qemux86 n/a n/a n/a n/a n/a
sysctl03 qemux86 n/a n/a n/a n/a n/a
syslog01 qemux86 n/a n/a n/a n/a n/a
syslog02 qemux86 n/a n/a n/a n/a n/a
syslog03 qemux86 n/a n/a n/a n/a n/a
syslog04 qemux86 n/a n/a n/a n/a n/a
syslog05 qemux86 n/a n/a n/a n/a n/a
syslog07 qemux86 n/a n/a n/a n/a n/a
syslog08 qemux86 n/a n/a n/a n/a n/a
syslog09 qemux86 n/a n/a n/a n/a n/a
syslog10 qemux86 n/a n/a n/a n/a n/a
mtest06 qemux86 n/a n/a n/a n/a n/a
su01 qemux86 n/a n/a n/a n/a n/a
cron02 qemux86 n/a n/a n/a n/a n/a
cron_deny01 qemux86 n/a n/a n/a n/a n/a
cron_allow01 qemux86 n/a n/a n/a n/a n/a
cron_dirs_checks01 qemux86 n/a n/a n/a n/a n/a
ld qemux86 n/a n/a n/a n/a n/a
ldd qemux86 n/a n/a n/a n/a n/a
file qemux86 n/a n/a n/a n/a n/a
tar qemux86 n/a n/a n/a n/a n/a
cron qemux86 n/a n/a n/a n/a n/a
logrotate qemux86 n/a n/a n/a n/a n/a
cpio qemux86 n/a n/a n/a n/a n/a
unzip01 qemux86 n/a n/a n/a n/a n/a
gzip01 qemux86 n/a n/a n/a n/a n/a
Personal tools