Bug Triage

From Yocto Project
(Difference between revisions)
Jump to: navigation, search
(Old Milestone)
(Old Milestone)
Line 176: Line 176:
 
   |status=!(RESOLVED,VERIFIED,CLOSED)
 
   |status=!(RESOLVED,VERIFIED,CLOSED)
 
   |milestone= !(1.5.2, 1.6.1, 1.7, 1.7 M1, 1.7 M2, 1.7 M3, 1.7 M4, 1.7 M5, Q1, Q2, Q3, Q4, future)
 
   |milestone= !(1.5.2, 1.6.1, 1.7, 1.7 M1, 1.7 M2, 1.7 M3, 1.7 M4, 1.7 M5, Q1, Q2, Q3, Q4, future)
 +
  |priority=!(undefined)
 
   |columns=id,summary,from,to,status,severity,priority,milestone
 
   |columns=id,summary,from,to,status,severity,priority,milestone
 
   |sort=milestone
 
   |sort=milestone

Revision as of 17:55, 9 April 2014

Contents

Goal

The output of the bug triage meeting should be that all bugs have an owner, a target milestone, and a priority.

Prior to the meeting, each Product Owner should review their Weekly New and High Bugs and be ready with any opens. An example open would be a bug that may need to change Products.

Roles

  • Call facilitator: Jessica Zhang
    • Ensure we keep to the agenda, don't rathole on bug resolution, and stay within our time block.


Agenda

  • Opens
    • Collect opens
    • Discuss opens
  • Review Queries
    • State number and owner
    • Owner makes any modifications
    • Assign owner, target milestone, and priority.


Bug Criteria

  • Priority-Severity
    • High-Critical: Two Week
    • High: Milestone
    • Medium: Nice to have for milestone, must have for release


Bug Triage Searches

Non-Prioritized Bugs

IDSummary (55 tasks) SeverityPMilestoneAssigneeStatusWhiteboardE
8336Problem when upgrading a package which depends on a new package (old issue #32)minorUndecided1.0Alejandro del CastilloNEW
8337Make opkg translatable (old issue #42)enhancementUndecided---Alejandro del CastilloNEW
8338ManpagesenhancementUndecided---Alejandro del CastilloNEW
8339Manpages (old issue #56)enhancementUndecided1.0Alejandro del CastilloNEW
8340libopkg needs a better error reporting mechanism (old issue #63)enhancementUndecided0.4Alejandro del CastilloNEW
8341Allow installation of a specified version of a package (old issue #76)enhancementUndecided0.3.2Alejandro del CastilloNEW
8342[internalsolv] Opkg fails to attempt all satisfying dependencies after installing the first one fails (old issue #85)minorUndecided0.4Alejandro del CastilloNEW
8343Downgrade to Prefer (old issue #111)enhancementUndecided0.4Alejandro del CastilloNEW
8344update-alternatives: Support change of link path during upgrade (old issue #113)normalUndecided0.4Alejandro del CastilloNEW
8345Install package(s) only after download of all needed packages. (old issue #116)enhancementUndecided0.4Alejandro del CastilloNEW
8346Check for package list update before downloading (old issue #117)enhancementUndecided1.0Alejandro del CastilloNEW
8347Review performance of algorithms using pkg_vec (old issue #120)enhancementUndecided1.0Alejandro del CastilloNEW
8349dist-upgrade feature (old issue #126)enhancementUndecided1.0Alejandro del CastilloNEW
8350Customisable uid/gid translation during installation (old issue #129)enhancementUndecided0.4Alejandro del CastilloNEW
8351double entries in the info file (old issue #142)normalUndecided0.3.2Alejandro del CastilloNEW
8352Needs a more detailed error message if an upgarde is not possible (old issue #143)normalUndecided0.4Alejandro del CastilloNEW
8353Add multiple compression algorithms support (old issue #148)enhancementUndecided0.4Alejandro del CastilloNEW
8355Not possible to build static opkg 0.3 (old issue #158)normalUndecided0.4Alejandro del CastilloNEW
8356Opkg flag always returns successminorUndecided0.4Alejandro del CastilloNEW
8357Add comman line option to skip package signature check (old issue #161)normalUndecided0.4Alejandro del CastilloNEW
8359[internalsolv] --force-removal-of-dependent-packages does not remove packages depending on the removed package (old issue #163)normalUndecided0.4Alejandro del CastilloNEW
8360[internalsolv] Packages fail to install when Recommends can't be installed (old issue #165)normalUndecided0.4Alejandro del CastilloNEW
8362[internalsolv] With circular dependencies, all installed packages are marked as autoinstalled (old issue #167)minorUndecided0.3.2Alejandro del CastilloNEW
8537Feature request: new libopkg APIenhancementUndecided0.4Alejandro del CastilloNEW
8564Deprecated OpenSSL signing supportnormalUndecided---Alejandro del CastilloNEW
8565Add global preinst/postinst hooks to opkgenhancementUndecided---Alejandro del CastilloNEW
8598--offline-root works only when i install using ipk isntead of package namenormalUndecided---Alejandro del CastilloNEW
8599when i use force downgrade option i have to give full ipk pathnormalUndecided---Alejandro del CastilloNEW
8601[internalsolv] entry of a package which is not installed and it does not let other package get installed on which it is dependentnormalUndecided0.3.2Alejandro del CastilloNEW
8912[internalsolv] opkg remove --autoremove' does not fully uninstall product.normalUndecided---Alejandro del CastilloNEW
8931replaces field does not support version constrainsmajorUndecided0.3.2Alejandro del CastilloNEW
8946opkg install does not appear to fail on file overwritemajorUndecided0.4Alejandro del CastilloNEW
8947opkg conffile resolution cannot detect unmodified conffiles modified in upgraded packagemajorUndecided---Alejandro del CastilloNEW
8948Implement *.md5sums (or equivalent)enhancementUndecided---Alejandro del CastilloNEW
8972failed to add I2C device MSFT8000:00 from ACPI on MinnowBoard MaxnormalUndecided---He, TimIN PROGRESS DESIGN COMPLETE
9060If an install succeeds despite broken deps due to --force-depends, it still outputs a diagnostic that makes it look like it failednormalUndecided---Alejandro del CastilloNEW
9073When local path for src/gz is provided and temp directory is also provided opkg creates mutiple copies of debian packagesmajorUndecided---Alejandro del CastilloNEW
9238opkg-make-index reformats package description when generating repo index from package control filenormalUndecided--- NEW
9348Opkg requires root privileges for all operationsmajorUndecided---Alejandro del CastilloNEW
9372Ptest for acl hang because of lack of two user bin and daemoncriticalUndecided---Alexandru GeorgescuNEW
9373ptest for perl hangcriticalUndecided---Alexandru GeorgescuNEW
9392When running testimage test_syslog_startup_config failed getting test log string not found output grep: /var/log/test error messagenormalUndecided---Francisco PedrazaNEEDINFO
9405running testimage dmesg test_parseLogs failednormalUndecided---Saul WoldNEEDINFO
9434Running testimage test_parselogs failed getting the following error message failed to retrieve link info, disabling eDP on Minnowboard Max 32 and 64normalUndecided2.1 M4California SullivanNEEDINFO
9456opkg-build does not return error when Version is missing from control filenormalUndecided0.3.2Alejandro del CastilloNEW
9557opkg fails to parse feeds if package name isn't the first item in a package sectionnormalUndecided0.3.2Alejandro del CastilloNEW
9582Replace toasterconf.json with Django fixturesnormalUndecided2.2Michael WoodNEW14
9583Refactor Toaster database schemanormalUndecidedFutureToaster default assigneeNEW
9594Toaster is not showing properly image files for buildsnormalUndecided---Toaster default assigneeNEW
9595Extensible sdk: error early if tasks to be ran cannot be provided from sstatenormalUndecided---Ross BurtonNEW
9596Build "minimal" extensible SDK installers instead of "full" onesenhancementUndecided---Beth FlanaganNEW
9598SSTATE_MIRRORS should not be on the list of restricted "Bitbake variables"normalUndecided---Toaster default assigneeNEW
9601meta-qt5 Krogoth Branch Building Error During 'do_qa_staging'normalUndecided---Benjamin EsquivelNEW
9602Run automated tests on alternative C librariesnormalUndecided---Aníbal LimónNEW
9603bitbake -c listtasks <target> return errorsnormalUndecided---Richard PurdieNEW
 55       

Non-Targeted Bugs

Low bugs not included.

IDSummary (28 tasks) SeverityPMilestoneAssigneeStatusWhiteboardE
8165[libsolv] opkg_list_upgradable_cmd() does not work with an external solver enabled.normalMedium---Alejandro del CastilloNEW
8337Make opkg translatable (old issue #42)enhancementUndecided---Alejandro del CastilloNEW
8338ManpagesenhancementUndecided---Alejandro del CastilloNEW
8564Deprecated OpenSSL signing supportnormalUndecided---Alejandro del CastilloNEW
8565Add global preinst/postinst hooks to opkgenhancementUndecided---Alejandro del CastilloNEW
8598--offline-root works only when i install using ipk isntead of package namenormalUndecided---Alejandro del CastilloNEW
8599when i use force downgrade option i have to give full ipk pathnormalUndecided---Alejandro del CastilloNEW
8912[internalsolv] opkg remove --autoremove' does not fully uninstall product.normalUndecided---Alejandro del CastilloNEW
8947opkg conffile resolution cannot detect unmodified conffiles modified in upgraded packagemajorUndecided---Alejandro del CastilloNEW
8948Implement *.md5sums (or equivalent)enhancementUndecided---Alejandro del CastilloNEW
8972failed to add I2C device MSFT8000:00 from ACPI on MinnowBoard MaxnormalUndecided---He, TimIN PROGRESS DESIGN COMPLETE
9060If an install succeeds despite broken deps due to --force-depends, it still outputs a diagnostic that makes it look like it failednormalUndecided---Alejandro del CastilloNEW
9073When local path for src/gz is provided and temp directory is also provided opkg creates mutiple copies of debian packagesmajorUndecided---Alejandro del CastilloNEW
9238opkg-make-index reformats package description when generating repo index from package control filenormalUndecided--- NEW
9348Opkg requires root privileges for all operationsmajorUndecided---Alejandro del CastilloNEW
9372Ptest for acl hang because of lack of two user bin and daemoncriticalUndecided---Alexandru GeorgescuNEW
9373ptest for perl hangcriticalUndecided---Alexandru GeorgescuNEW
9392When running testimage test_syslog_startup_config failed getting test log string not found output grep: /var/log/test error messagenormalUndecided---Francisco PedrazaNEEDINFO
9405running testimage dmesg test_parseLogs failednormalUndecided---Saul WoldNEEDINFO
9586document and verify production setup for jenkins ci interactionnormalMedium---Michael WoodNEW
9594Toaster is not showing properly image files for buildsnormalUndecided---Toaster default assigneeNEW
9595Extensible sdk: error early if tasks to be ran cannot be provided from sstatenormalUndecided---Ross BurtonNEW
9596Build "minimal" extensible SDK installers instead of "full" onesenhancementUndecided---Beth FlanaganNEW
9597swtbot initial implementation so that we can automate testing of the pluginnormalMedium---brian averyNEW
9598SSTATE_MIRRORS should not be on the list of restricted "Bitbake variables"normalUndecided---Toaster default assigneeNEW
9601meta-qt5 Krogoth Branch Building Error During 'do_qa_staging'normalUndecided---Benjamin EsquivelNEW
9602Run automated tests on alternative C librariesnormalUndecided---Aníbal LimónNEW
9603bitbake -c listtasks <target> return errorsnormalUndecided---Richard PurdieNEW
 28       

New This Week

IDSummary (47 tasks) SeverityPMilestoneAssigneeStatusWhiteboardE
9560Add Yocto Project Hands-on kernel lab for yocto 2.1 (krogoth) to Yocto websitenormalMedium+Q2Jeff Osier-MixonACCEPTED
9561[Mars] Minimum required Java version is 1.7 for Eclipse Mars (4.5)normalMedium2.1.1Tim OrlingACCEPTED0.2
9563yocto-kernel script should use argparse instead of optparse libraryenhancementMedium+2.2 M1 ACCEPTED
9564yocto-layer script should use argparse instead of optparse libraryenhancementMedium+2.2 M1 ACCEPTED
9572sudoku-savant tarball not found when SDK testing on core-image-satonormalMedium+2.2 M1Leonardo Sandoval GonzalezACCEPTED
9573openssh, subversion and ghostscript URLs fail on do_checkuri testnormalMedium+2.2 M1Leonardo Sandoval GonzalezACCEPTED1
9579[jethro] perf build failure with linux-yocto_3.19normalMedium+2.0.2Tom ZanussiACCEPTED
9565Add copy dir and delete files, dir to sshcontrolenhancementMedium2.2 M1Mariano LopezIN PROGRESS REVIEW1
9576Extensible SDK test output needs to include preparing_build_system.log on failureenhancementMedium+2.2 M1Leonardo Sandoval GonzalezIN PROGRESS REVIEW
9581CVE-2016-2107, CVE-2016-2108, CVE-2016-2105, CVE-2016-2106, CVE-2016-2109, CVE-2016-2176majorHigh2.2 M1Jussi KukkonenIN PROGRESS REVIEW
9557opkg fails to parse feeds if package name isn't the first item in a package sectionnormalUndecided0.3.2Alejandro del CastilloNEW
9558Documentation for 1.7.3 is missingnormalMedium+Q2Jeff Osier-MixonNEW
9559test reporting tool planenhancementHigh2.2 M1Benjamin EsquivelNEW
9562[Neon] Minimum required Java version is 1.8 for Eclipse Neon (4.6)normalMedium2.2Tim OrlingNEW0.2
9566devtool documentation is duplicated in dev and sdk manualsnormalMedium+2.2 M2Scott RifenbarkNEW
9567bitbake's FetchLatestVersion fail when running bitbake-selftestcriticalHigh2.2 M1Richard PurdieNEW
9568bbexample recipe fails to build unless PARALLEL_MAKE is disablednormalMedium2.2Joshua LockNEW
9569Add extract package function to the package managersenhancementMedium2.2 M1Mariano LopezNEW
9570Need a simple way of configuring Zephyr development environment at start of docker sessionnormalMedium2.2 M1Todor MinchevNEW
9571Allow CROPS to install host tools in specified locationnormalMedium2.2 M1Todor MinchevNEW
9574[devtool] can't update gdbnormalMedium2.2Paul EggletonNEW
9575Test SDK EXT failed on core-image-sato for MIPS architecturecriticalMedium+2.2 M1Robert YangNEW
9577gen-lockedsig-cache fails when populating sdk ext on PPC architecturenormalMedium+2.2 M1Robert YangNEW
9578INHIBIT_PACKAGE_STRIP breaks -dbgnormalMedium2.2Stephano CetolaNEW
9580Missing package dependency in quick start guide for FedoranormalMedium2.2Scott RifenbarkNEW
9582Replace toasterconf.json with Django fixturesnormalUndecided2.2Michael WoodNEW14
9583Refactor Toaster database schemanormalUndecidedFutureToaster default assigneeNEW
9584upgrade toaster to Python3normalMedium+2.2 M1Ed BartoshNEW
9585verify/fix eventreplaynormalMedium2.2Ed BartoshNEW
9586document and verify production setup for jenkins ci interactionnormalMedium---Michael WoodNEW
95874.1.x: gpio-pca953x.c fails to compile without CONFIG_ACPInormalMedium2.2Saul WoldNEW
9588Create a method for describing builds and desired output. aka a build descriptorenhancementHigh2.2 M1Randy WittNEW5
9589Create a script for consuming a "build descriptor"enhancementMedium+2.2 M1Randy WittNEW5.34
9590Cannot update Zephyr project configenhancementMedium2.2Todor MinchevNEW
9591Zephyr project configuration should allow kernel and app to be in different folder hierachiesenhancementMedium2.2Todor MinchevNEW
9592Add a mechanism for creating build appliance as a container imageenhancementHigh2.2 M1Randy WittNEW4
9593Enable workspace folder to be changedenhancementMedium2.2Todor MinchevNEW
9594Toaster is not showing properly image files for buildsnormalUndecided---Toaster default assigneeNEW
9595Extensible sdk: error early if tasks to be ran cannot be provided from sstatenormalUndecided---Ross BurtonNEW
9596Build "minimal" extensible SDK installers instead of "full" onesenhancementUndecided---Beth FlanaganNEW
9597swtbot initial implementation so that we can automate testing of the pluginnormalMedium---brian averyNEW
9598SSTATE_MIRRORS should not be on the list of restricted "Bitbake variables"normalUndecided---Toaster default assigneeNEW
9599Reduce bundle overheads by not depending on os-core when generating bundle sysrootsenhancementMedium+2.2 M1Joshua LockNEW3
9601meta-qt5 Krogoth Branch Building Error During 'do_qa_staging'normalUndecided---Benjamin EsquivelNEW
9602Run automated tests on alternative C librariesnormalUndecided---Aníbal LimónNEW
9603bitbake -c listtasks <target> return errorsnormalUndecided---Richard PurdieNEW
9600Hide readme file from other artifacts listenhancementUndecided---Toaster default assigneeRESOLVED
 47      33.74

High Bugs

IDSummary (23 tasks) SeverityPMilestoneAssigneeStatusWhiteboardE
8647Script to analyse what areas a patch changes and what tests need runningenhancementHigh2.2Leonardo Sandoval GonzalezACCEPTED13
7583Gather and allow reporting all types of errors, not just task failuresenhancementHigh2.2 M1Aníbal LimónNEW5
9293bitbake: Add support for trigger event on errors like exceptionsenhancementHigh2.2 M1Aníbal LimónIN PROGRESS DESIGN
9517Move to Bootstrap 3enhancementHigh2.2 M1Belen Barros PenaNEW
9559test reporting tool planenhancementHigh2.2 M1Benjamin EsquivelNEW
9394bootstrap v2 License is not compatible with bitbake/toaster license.criticalHigh2.2 M1brian averyNEW
9298Autobuilder enable KVM on the cluster for x86, x86-64enhancementHigh2.2 M1Beth FlanaganNEW4.5
9340Improve tooling around BuildLog and SWAT processenhancementHigh2.2 M1Joshua LockIN PROGRESS IMPLEMENTATION5
9581CVE-2016-2107, CVE-2016-2108, CVE-2016-2105, CVE-2016-2106, CVE-2016-2109, CVE-2016-2176majorHigh2.2 M1Jussi KukkonenIN PROGRESS REVIEW
9457patchtest: security check on incoming patchesenhancementHigh2.2 M1Leonardo Sandoval GonzalezACCEPTED
9131Prelink breaks fork IFUNCmajorHigh2.2 M1Mark HatleIN PROGRESS IMPLEMENTATION10
4078A method to validate the contents of changes to recipes, configuration files and classesenhancementHigh2.2 M1Michael HalsteadNEEDINFONIR 04/24, 05/015
4431Set up buildhistory-web for autobuilderenhancementHigh2.2 M1Michael HalsteadACCEPTED3
7658patchwork: provide means of recording additional patch statusesenhancementHigh2.2 M1Michael HalsteadNEEDINFONIR 04/24, 05/014
8648Automatic testing of incoming patchesenhancementHigh2.2 M1Michael HalsteadNEEDINFONIR 04/24, 05/0110
8649Script to assemble patches for autobuilder testingenhancementHigh2.2 M1Michael HalsteadNEEDINFONIR 04/24, 05/0115
9130Update OE patchwork instanceenhancementHigh2.2 M1Michael HalsteadNEW
9112pseudo connection startup/reworkenhancementHigh2.2 M1SeebsNEW
9588Create a method for describing builds and desired output. aka a build descriptorenhancementHigh2.2 M1Randy WittNEW5
9592Add a mechanism for creating build appliance as a container imageenhancementHigh2.2 M1Randy WittNEW4
7518Build multiple machines in the same bitbake invocationenhancementHigh2.2 M1Richard PurdieNEW15
9567bitbake's FetchLatestVersion fail when running bitbake-selftestcriticalHigh2.2 M1Richard PurdieNEW
9383Move to LSB 5enhancementHigh2.2 M2Ross BurtonNEW3
 23       

Medium+ Bugs !(Future,1.7)

IDSummary (104 tasks) SeverityPMilestoneAssigneeStatusWhiteboardE
7469SDL package cannot be found on OpenSUSE 13.2normalMedium+1.6.4Juro BystrickyIN PROGRESS REVIEW2
7641CVE-2014-9365 python: failure to validate certificates in the HTTP client with TLS (PEP 476)normalMedium+1.7.4Armin KusterACCEPTED5
8487PTEST image does not install on hdd on 1.8.1normalMedium+1.7.4Armin KusterIN PROGRESS IMPLEMENTATION1
9353yocto-bsp: script using different kernel than the one given when creating bspnormalMedium+2.0.2 IN PROGRESS REVIEW0.5
8028Garbage in SDK manifest filenormalMedium+2.0.2Mariano LopezIN PROGRESS REVIEW3
7991qemuppc bootup failure with oe-core toolchain (with systemd)normalMedium+2.0.2Mark HatleIN PROGRESS IMPLEMENTATION
8092Implementation of the function glXChooseFBConfig in the libGL.so does not match OpenGL documentationnormalMedium+2.0.2Otavio SalvadorWaitForUpstream
9579[jethro] perf build failure with linux-yocto_3.19normalMedium+2.0.2Tom ZanussiACCEPTED
8877WebKitGTK+ Security AdvisoriesnormalMedium+2.0.2ytaoNEW
9302Failed to start qemu with toolchain sysrootnormalMedium+2.1.1brian averyNEW
9362Failed to run and debug a project to qemux86 in EclipsenormalMedium+2.1.1brian averyNEW3
9472[NO USB support ] Beaglebone black latest yoctomajorMedium+2.1.1Saul WoldACCEPTED
9520test_parselogs failed on udevd[342] inotify_add_watch /dev/loop when running test imagenormalMedium+2.1.1Saul WoldNEW
9105[MARS] Cannot install eclipse-poky pluginnormalMedium+2.1.1Tim OrlingIN PROGRESS IMPLEMENTATION1.5
8192python3.4.3 os.fork and os.waitpidminorMedium+2.2Alejandro HernandezACCEPTED15
9133Eclipse plugin testing integrate into ABnormalMedium+2.2Aníbal LimónNEW5
7968empty page states for no information in the databasenormalMedium+2.2Belen Barros PenaNEWGUI design pending5
1989Default module selections need attentionminorMedium+2.2Bruce AshfieldIN PROGRESS IMPLEMENTATION4
8037External link to recipe file links to non-existing page when recipe information comes from a buildnormalMedium+2.2David ReynaIN PROGRESS IMPLEMENTATION5
8440Toaster has some issues when showing builds that fail at the build request stagenormalMedium+2.2Elliot SmithIN PROGRESS REVIEWGUI design available8
5319Need a test to verify firstboot postinst script ordernormalMedium+2.2Jose Perez CNEW43
8576QemuRunner logging for qemu start failure does not log anything to the console in oe-selftestmajorMedium+2.2Jose Perez CNEW2
9352External modules fail to build when kernel is reused from sstatenormalMedium+2.2Martin JansaNEEDINFONIR 05/01
8078useradd.bbclass: useradd_preinst not run when rebuilding on second MACHINEmajorMedium+2.2Maxin B. JohnACCEPTED3
9124Location of kernel sources is incorrectnormalMedium+2.2Tom ZanussiIN PROGRESS REVIEWNIR 03/27, 04/03, 04/10, 04/17, 04/24 - 3 March 2016: NEEDINFO2
8210Should be able to restart a crashed vnc servernormalMedium+2.2Tracy GraydonNEW3
8142avahi daemon fails to start on systemd while testing core-image-satonormalMedium+2.2 M1Aníbal LimónACCEPTED5
8748qemu86-64 with corei7-64 did not support gcc optimization level 3 '-O3' very wellnormalMedium+2.2 M1Aníbal LimónNEW
8771test_smart_channel_add (oeqa.runtime.smart.SmartRepoTest) failed in AutobuildernormalMedium+2.2 M1Aníbal LimónIN PROGRESS DESIGN5
9555Create Toaster Docker containernormalMedium+2.2 M1brian averyNEW1.5
8668lttng-tools ptest output confuses QA analysisnormalMedium+2.2 M1dengkeIN PROGRESS REVIEW
9584upgrade toaster to Python3normalMedium+2.2 M1Ed BartoshNEW
9536oe-selftest: test_sstate_noop_samesigs failed due qmmp LICENSE_FLAGS_WHITELISTnormalMedium+2.2 M1Plauchu EdwinNEW1
9397[Autobuilder] - public WIC buildset artifactsnormalMedium+2.2 M1Beth FlanaganNEW0.5
9476Switch production error reporting web to filter on production-yocto-autobuildernormalMedium+2.2 M1Beth FlanaganNEW1
8443Builds that failed at the build request stage need a custom dashboardnormalMedium+2.2 M1Elliot SmithIN PROGRESS IMPLEMENTATIONLook at 84403
9506bitbake-layers: show-layers throws exception when can't find layer in bblayers.confnormalMedium+2.2 M1 IN PROGRESS DESIGN
8245dmesg qa check: fbcon_init: detected unhandled fb_set_par error (timeout case)normalMedium+2.2 M1Jianxun ZhangIN PROGRESS REVIEW0.1
9452[meta-swupd] update to latest swupd and adapt to changesnormalMedium+2.2 M1Joshua LockNEW2
9249patchwork: test that CVE patches contain the proper formattingnormalMedium+2.2 M1Leonardo Sandoval GonzalezACCEPTED1
9572sudoku-savant tarball not found when SDK testing on core-image-satonormalMedium+2.2 M1Leonardo Sandoval GonzalezACCEPTED
9573openssh, subversion and ghostscript URLs fail on do_checkuri testnormalMedium+2.2 M1Leonardo Sandoval GonzalezACCEPTED1
8570problems with gdk-pixbuf and pango loading on multilibnormalMedium+2.2 M1Robert YangNEW2
8879opkg-utils is built when build lib32-imagemajorMedium+2.2 M1Robert YangIN PROGRESS IMPLEMENTATION5
9474epiphany doesn't work on ARMnormalMedium+2.2 M1Robert YangIN PROGRESS REVIEW1
9575Test SDK EXT failed on core-image-sato for MIPS architecturecriticalMedium+2.2 M1Robert YangNEW
9577gen-lockedsig-cache fails when populating sdk ext on PPC architecturenormalMedium+2.2 M1Robert YangNEW
9064do_unpack does not wipe old source treemajorMedium+2.2 M1Markus LehtonenIN PROGRESS REVIEW1
9351Issues using bitbake with externalsrc and gitnormalMedium+2.2 M1Markus LehtonenNEW
9507Misleading error message when conf/bblayers has problemsnormalMedium+2.2 M1Markus LehtonenNEW
9425Custom image cannot be downloaded until after it is builtnormalMedium+2.2 M1Michael WoodIN PROGRESS REVIEW4
9455When I try to make a new project toaster cries "Fields missing: projectversion"normalMedium+2.2 M1Michael WoodIN PROGRESS IMPLEMENTATION4
9038extensible sdk - generates empty manifests/needs file with what is installednormalMedium+2.2 M1Paul EggletonNEW2
9083Extensible SDK: SDK installation ERROR: Unexpected tasks left over to be executednormalMedium+2.2 M1Paul EggletonACCEPTED1
9177Failed to install jethro eSDK image from AutobuildermajorMedium+2.2 M1Paul EggletonNEW1
9301Extensible SDK: failed to run sdk-update: checksum mismatch for uninativenormalMedium+2.2 M1Paul EggletonACCEPTED
9505SDKs no longer provide opkg packaging datamajorMedium+2.2 M1Paul EggletonIN PROGRESS REVIEW
9317pseudo: incorrect xattr semantic for hardlinksnormalMedium+2.2 M1SeebsACCEPTED
8616arm64's multilib SDK is brokenmajorMedium+2.2 M1Chen QiIN PROGRESS REVIEW3
8642The "32" is a broken symlink in aarch64's mutilib SDKnormalMedium+2.2 M1Chen QiACCEPTED3
9513Failed to install sdk_ext for i686normalMedium+2.2 M1Randy WittNEEDINFO
8273openjade-native doesn't remove from sysroot correctlynormalMedium+2.2 M1Ross BurtonNEW1
8555Reading shlibs providers sometimes failsnormalMedium+2.2 M1Ross BurtonNEW2
8988test_rpm_query_nonroot (oeqa.runtime.rpm.RpmInstallRemoveTest) - Failed to create new usernormalMedium+2.2 M1Ross BurtonNEWJethro Backport1
9104ffmpeg libraries are missing -dbg packagingnormalMedium+2.2 M1Ross BurtonNEW5
9242Relocate segments in native binaries when restoring from sstatenormalMedium+2.2 M1Ross BurtonNEW3
9281Changing SDK_OS hits warnings unless you wipe tmpnormalMedium+2.2 M1Ross BurtonNEW1
9342Vet subprocess callsnormalMedium+2.2 M1Ross BurtonNEW2
9490IMAGE_GEN_DEBUGFS = "1" does not work when PACKAGE_CLASSES = "package_ipkg"normalMedium+2.2 M1Ross BurtonACCEPTED2
9508cross-localedef-native_2.22 fails to build on aarch64 hostnormalMedium+2.2 M1Ross BurtonIN PROGRESS REVIEW1
9528dbus-test: installs libtool wrapper for binariesnormalMedium+2.2 M1Ross BurtonIN PROGRESS REVIEW1
9554Add section for on-target debuggingnormalMedium+2.2 M1Ross BurtonNEW2
9369Extensible SDK: oe-selftest test does not test that update actually worksnormalMedium+2.2 M1Stephano CetolaIN PROGRESS DESIGN2
9535Generated SDK environment files use 'source' to load additional environment filesnormalMedium+2.2 M1Stephano CetolaIN PROGRESS REVIEW1
8525selftest needs to control distro configurationnormalMedium+2.2 M1Bill RandleACCEPTED3
9285Failed to build gobject-introspection for qemumips64 on i686 hostsnormalMedium+2.2 M2Alexander KanavinNEW1
9286Failed to build gst-player for qemuarm64 on Fedora23 i686normalMedium+2.2 M2Alexander KanavinNEW3
7095Can't install kernel-dev and kernel-devsrc togethernormalMedium+2.2 M2Bruce AshfieldIN PROGRESS IMPLEMENTATION4
9475db locking - Nothing happens when you click the "Create custom image" buttonnormalMedium+2.2 M2Elliot SmithIN PROGRESS IMPLEMENTATION15
9416rpm: tmpfile creation failsnormalMedium+2.2 M2Markus LehtonenACCEPTED
9499license.bbclass find_license_files does not process LICENSE_pn variables correctlynormalMedium+2.2 M2Markus LehtonenNEW
5470bitbake-layers cannot be used with memory resident bitbake runningnormalMedium+2.2 M2Paul EggletonIN PROGRESS IMPLEMENTATION5
8884Locked signature warning is shown even if package can be fetched from SSTATE_MIRRORSnormalMedium+2.2 M2Paul EggletonNEW1
9532useradd / extrausers chain pseudo, causing stack overflows (segfaults)normalMedium+2.2 M2SeebsNEW
8508Remove knowledge of MACHINE from distutils3normalMedium+2.2 M2Ross BurtonNEW3
9287Failed to build nativesdk-glibc for qemumips and qemumips64 on Fedora 23 i686normalMedium+2.2 M2Ross BurtonNEW1
9440SERIAL_CONSOLES_CHECK doesn't work if kernel console name and device node name differnormalMedium+2.2 M2Ross BurtonNEW1
9509Backport binutils bugfix: fix build of webkitgtk4 on aarch64normalMedium+2.2 M2Ross BurtonNEW1
9510gcc-cross-initial parallel make problem / build break (found on aarch64)normalMedium+2.2 M2Ross BurtonNEW2
9566devtool documentation is duplicated in dev and sdk manualsnormalMedium+2.2 M2Scott RifenbarkNEW
9491Enable explicit removal of support packages when not needednormalMedium+2.2 M2Stephano CetolaACCEPTED
7828Impossible to add a new image type in ToasternormalMedium+2.2 M2Sujith HACCEPTEDGUI design available4
8435some layers have duplicate entries for recipesnormalMedium+2.2 M3Paul EggletonNEW1
8578opkg-make-index skips some packages so the package index is not up to date during rootfs generationnormalMedium+2.2 M4Robert YangNEW5
6868Add support for 4gb DDR3 configurationnormalMedium+A3 ReleaseDavid AndersIN PROGRESS DESIGN COMPLETE
6865I2S support on LSE needs clock sourcenormalMedium+A4 ReleaseDavid AndersIN PROGRESS DESIGN COMPLETE
6927I2C Controller Intermittently Timeout and Lost ArbitrationmajorMedium+A4 ReleaseDavid AndersIN PROGRESS DESIGN COMPLETE
7719HDMI not working with TFP-401 DVI based devicesmajorMedium+A4 ReleaseDavid AndersACCEPTED
9223Add a note about Hob's deprecation to the Build Appliance and Hob project pagesnormalMedium+Q1Jeff Osier-MixonNEW
9331searching on google almost always returns some outdated linknormalMedium+Q2Jeff Osier-MixonNEW
94701.8.1. documentation missing from the websitenormalMedium+Q2Jeff Osier-MixonNEW
9558Documentation for 1.7.3 is missingnormalMedium+Q2Jeff Osier-MixonNEW
9560Add Yocto Project Hands-on kernel lab for yocto 2.1 (krogoth) to Yocto websitenormalMedium+Q2Jeff Osier-MixonACCEPTED
9522Documentation isn't cachablenormalMedium+Q2Michael HalsteadNEW
 104       

Medium+ Enhancements by Owner !(Future,1.7)

IDSummary (118 tasks) SeverityPMilestoneAssigneeStatusWhiteboardE
 0       
Aníbal Limón
8480Extendable structure for test controller to support kinds of image flash methods and communication methods with DUTenhancementMedium+2.2Aníbal LimónNEW7
8962AUH: Add support for meta-intelenhancementMedium+2.2Aníbal LimónNEW3
9088Extensible SDK add tests for devtoolenhancementMedium+2.2Aníbal LimónNEW3
9090extensible sdk test compatibility with sdkenhancementMedium+2.2Aníbal LimónNEW1
9132Toaster integrate testing into AB/buildbotenhancementMedium+2.2 M1Aníbal LimónIN PROGRESS IMPLEMENTATION5
9299Enable Tracing boot and process times in testing imagesenhancementMedium+2.2 M2Aníbal LimónNEW5
 6       
Belen Barros Pena
6640Customise BitBake and layer versions in a projectenhancementMedium+2.3Belen Barros PenaNEWGUI design pending7
 1       
Benjamin Esquivel
6319Automated storage and graphing of build performance metricsenhancementMedium+2.2Benjamin EsquivelNEW5
 1       
Bruce Ashfield
9466enhance kernel configuration audit to include reasons for missing configs, and required config checkingenhancementMedium+2.2 M2Bruce AshfieldIN PROGRESS DESIGN COMPLETE7
8179It should be possible to disable kernel features using config fragmentsenhancementMedium+2.2 M3Bruce AshfieldIN PROGRESS IMPLEMENTATION10
 2       
California Sullivan
8773refactor yocto-kernel-cache common-pc / intel-common scc/cfg file to reduce delta & overlapenhancementMedium+2.2 M1California SullivanACCEPTED11
 1       
Ed Bartosh
9414add support for bmap-toolsenhancementMedium+2.2 M1Ed BartoshIN PROGRESS REVIEW
9412Implement python 3 support for wicenhancementMedium+2.2 M2Ed BartoshIN PROGRESS REVIEW5
9413bmap-tools support for wicenhancementMedium+2.2 M2Ed BartoshIN PROGRESS REVIEW2
9556The EFI bootloaders should deploy startup.nsh for wicenhancementMedium+2.2 M2Ed BartoshNEW
 4       
Plauchu Edwin
7561Port beaglebone BSP to use xf86-video-modesettingsenhancementMedium+2.2 M1Plauchu EdwinIN PROGRESS IMPLEMENTATION1
 1       
Beth Flanagan
9335[Autobuilder] Add support for display bitbake log errors in buildbot pageenhancementMedium+2.2 M1Beth FlanaganIN PROGRESS DESIGN4
9450Add automated runtime tests that use the musl libc rather than glibcenhancementMedium+2.2 M1Beth FlanaganNEW2
9460Provide a way to automate testing of meta-mingw and meta-darwin layers.enhancementMedium+2.2 M2Beth FlanaganNEW3
 3       
Elliot Smith
9439Verify that the REST API works with httpsenhancementMedium+2.2 M1Elliot SmithIN PROGRESS REVIEW1
 1       
 
8938oe-selftest: refactor command line arguments so usage is simplerenhancementMedium+2.2 ACCEPTED3
9563yocto-kernel script should use argparse instead of optparse libraryenhancementMedium+2.2 M1 ACCEPTED
9564yocto-layer script should use argparse instead of optparse libraryenhancementMedium+2.2 M1 ACCEPTED
 3       
Jeff Osier-Mixon
9222Create a notification styleenhancementMedium+Q1Jeff Osier-MixonNEW
 1       
Jianxun Zhang
8761[RMC]: Handle machine specific kernel command line differencesenhancementMedium+2.2 M1Jianxun ZhangIN PROGRESS IMPLEMENTATION15
9292Update Graphic recipes with candidate versions in planned Graphic Stack 2016Q1 ReleaseenhancementMedium+2.2 M1Jianxun ZhangACCEPTED0.1
 2       
jingwang
8482Support multi-nodes interoperability testingenhancementMedium+2.2jingwangNEW
8530runexported.py parameter support for: -m <machine arch>enhancementMedium+2.2 M1jingwangIN PROGRESS IMPLEMENTATION1
8531runexported.py parameter support for: -f <manifest>enhancementMedium+2.2 M1jingwangNEW
8533runexported.py parameter support for: -x <xunit>enhancementMedium+2.2 M1jingwangNEW
 4       
Jose Lamego
7654patchwork: ensure superseded patches are marked as suchenhancementMedium+2.2 M1Jose LamegoIN PROGRESS IMPLEMENTATION2
8704patchwork: support history tracking of patch statusenhancementMedium+2.2 M1Jose LamegoIN PROGRESS REVIEW3
8714Patchwork frontend page for incoming patch testingenhancementMedium+2.2 M1Jose LamegoNEWGUI design pending6
8715Update patchwork / build status page on patch test build completionenhancementMedium+2.2 M1Jose LamegoACCEPTED2
8717patchwork: keep build page up-to-date with important patch status changesenhancementMedium+2.2 M1Jose LamegoNEW2
 5       
Jose Perez C
4528boot time should be tracked for systemd and SysVinitenhancementMedium+2.2Jose Perez CNEW2
5369Create test plan to do performance analysis of x32 runtimeenhancementMedium+2.2Jose Perez CNEW
5477Check for any performance degradations with gcc security flags enabledenhancementMedium+2.2Jose Perez CIN PROGRESS IMPLEMENTATION2
5478test build time performance degradations with gcc security flags enabledenhancementMedium+2.2Jose Perez CIN PROGRESS IMPLEMENTATION2
6296Add support for runtime performance tests to image_testsenhancementMedium+2.2Jose Perez CNEW2
7376oe-selftest doesn't run lib/oe/tests/*enhancementMedium+2.2Jose Perez CIN PROGRESS DESIGN3
4144Runtime performance testingenhancementMedium+2.2 M2Jose Perez CNEW2
4527create a Runtime performance test layer to enable runtime performance testsenhancementMedium+2.2 M2Jose Perez CNEW
6359Include QA tests for kernel-dev manual tasksenhancementMedium+2.2 M3Jose Perez CNEWNIR 04/1010
 9       
Joshua Lock
9449[meta-swupd] Add libarchive backend to swupd-server to improve runtime of do_swupd_updateenhancementMedium+2.2 M1Joshua LockNEW5
9493Support dummy/empty bundlesenhancementMedium+2.2 M1Joshua LockIN PROGRESS IMPLEMENTATION1
9527Implement initial support for a stateless OSenhancementMedium+2.2 M1Joshua LockNEW10
9599Reduce bundle overheads by not depending on os-core when generating bundle sysrootsenhancementMedium+2.2 M1Joshua LockNEW3
8699offer a way to use sstate-object hashes as dependencies of builds/packagesenhancementMedium+2.2 M2Joshua LockACCEPTED4
9538Review common security hardening flags and expand security_flags.incenhancementMedium+2.2 M2Joshua LockNEW10
 6       
Jussi Kukkonen
8489Update DirectFB to git?enhancementMedium+2.2Jussi KukkonenNEW1
3169Implement Shuku proposalenhancementMedium+2.2 M1Jussi KukkonenIN PROGRESS IMPLEMENTATION15
8640Remove vala from oe-core?enhancementMedium+2.2 M1Jussi KukkonenACCEPTED2
 3       
Leonardo Sandoval Gonzalez
8433Add test for package postinstsenhancementMedium+2.2Leonardo Sandoval GonzalezNEW4
8493Automate manual BSP test casesenhancementMedium+2.2Leonardo Sandoval GonzalezNEW5
8505Add Bluetooth testing suiteenhancementMedium+2.2Leonardo Sandoval GonzalezNEW5
8506Add WiFi testing suiteenhancementMedium+2.2Leonardo Sandoval GonzalezNEW5
8507Add NFC testing suiteenhancementMedium+2.2Leonardo Sandoval GonzalezNEW5
8716Build summary page for incoming patch testingenhancementMedium+2.2 M1Leonardo Sandoval GonzalezNEWGUI design pending4
9244patchtest-oe: Create tests to validate recipes, classes or config filesenhancementMedium+2.2 M1Leonardo Sandoval GonzalezACCEPTED
9401patchtest: show assertion messages on summaryenhancementMedium+2.2 M1Leonardo Sandoval GonzalezACCEPTED1
9403patchtest-oe: show the solution on the assertion messageenhancementMedium+2.2 M1Leonardo Sandoval GonzalezACCEPTED1
9576Extensible SDK test output needs to include preparing_build_system.log on failureenhancementMedium+2.2 M1Leonardo Sandoval GonzalezIN PROGRESS REVIEW
 10       
Robert Yang
8880Need better allarch multilib sanity or automated QA testsenhancementMedium+2.2 M1Robert YangNEW5
9454improve on why a recipe is builtenhancementMedium+2.2 M1Robert YangNEW10
9391refactor syslinux.bbclass, grub-efi.bbclass and gummiboot.bbclassenhancementMedium+2.2 M2Robert YangNEW10
 3       
Mariano Lopez
7515Add CVE testing toolenhancementMedium+2.2Mariano LopezIN PROGRESS REVIEW10
7850Handle native and target test dependency binaries in build test and export testenhancementMedium+2.2 M1Mariano LopezIN PROGRESS DESIGN10
8384Exported tests needs a test suiteenhancementMedium+2.2 M1Mariano LopezNEW2
8478Decoupling export test with Yocto build environmentenhancementMedium+2.2 M1Mariano LopezNEW5
8481Generate test tar balls for export testenhancementMedium+2.2 M1Mariano LopezIN PROGRESS REVIEW5
8536support un-extracted package (e.g. rpm) as one type of test binariesenhancementMedium+2.2 M1Mariano LopezIN PROGRESS REVIEW5
8694Add support for multiple binaries in one testenhancementMedium+2.2 M1Mariano LopezIN PROGRESS IMPLEMENTATION5
9432Add test for exported test functionalityenhancementMedium+2.2 M1Mariano LopezNEW3
9515update-rcd class should add build dependencies if requiredenhancementMedium+2.2 M2Mariano LopezNEW1
 9       
Markus Lehtonen
8974Add eSDK benchmarkingenhancementMedium+2.2 M1Markus LehtonenNEW2
9377Enable automated build performance testing in AutobuilderenhancementMedium+2.2 M1Markus LehtonenNEW
9338Support building optimised Python (with profile-opt make target)enhancementMedium+2.2 M2Markus LehtonenNEW
 3       
Michael Wood
9519Consolidate used API into it's own viewenhancementMedium+2.2 M2Michael WoodNEW
8132Implement deleting custom imagesenhancementMedium+2.2 M3Michael WoodNEWGUI design available4
 2       
Michael Halstead
7981Set up procedure for layer index database upgradesenhancementMedium+2.2 M1Michael HalsteadIN PROGRESS REVIEW2
 1       
Paul Eggleton
6432Document an example SDK usage workflowenhancementMedium+2.2 M1Paul EggletonACCEPTED2
6437Document how to set up the Yocto Project for production workenhancementMedium+2.2 M1Paul EggletonACCEPTED2
8657extensible SDK: improve handling for sanity checksenhancementMedium+2.2 M1Paul EggletonNEW1
9537recipetool: support node.js code outside of npmenhancementMedium+2.2 M1Paul EggletonNEW
7683Provide means of turning a recipe change into a bbappendenhancementMedium+2.2 M2Paul EggletonNEW4
9361Failed to reconfigure a project in Eclipse with eSDKenhancementMedium+2.2 M2Paul EggletonNEW3
9387Extensible SDK: add image customisation functionalityenhancementMedium+2.2 M2Paul EggletonNEW5
 7       
Randy Witt
9004Produce container image providing extensible SDKenhancementMedium+2.2 M1Randy WittNEW4
9502Add a way to build container images using oe-coreenhancementMedium+2.2 M1Randy WittNEW3
9589Create a script for consuming a "build descriptor"enhancementMedium+2.2 M1Randy WittNEW5.34
 3       
Richard Purdie
3433Create Interactive bitbake commandline modeenhancementMedium+2.2Richard PurdieNEW15
7555make oe-init-build-env-memres default for 2.2enhancementMedium+2.2Richard PurdieNEW3
2398make bitbake work using python 3.xenhancementMedium+2.2 M1Richard PurdieIN PROGRESS IMPLEMENTATION
5534Bitbake resident server autoloading/unloadingenhancementMedium+2.2 M1Richard PurdieACCEPTED3
8554Support for self-contained "baremetal" CPU meta-layersenhancementMedium+2.2 M1Richard PurdieNEW3
9037Consider alternate methods for maintain Yocto releases after 1yrenhancementMedium+2.2 M1Richard PurdieNEW1
9255Allow rootfs tasks to run in parallel with rpmenhancementMedium+2.2 M1Richard PurdieNEW0.5
6428Improve the ability to isolate changes that have caused a rebuildenhancementMedium+2.2 M2Richard PurdieNEW5
 8       
Ross Burton
4634BitBake default 'dirs' in exec_func (${B}) causes build failuresenhancementMedium+2.2 M1Ross BurtonNEW5
8548Document best practises/style guide for selftest tests and update testsenhancementMedium+2.2 M1Ross BurtonNEW2
9261Can't distinguish between delayed and failed postinstenhancementMedium+2.2 M1Ross BurtonNEW3
6803Comprehensive large file supportenhancementMedium+2.2 M2Ross BurtonNEW5
9448Add mechanism for running image level QA checksenhancementMedium+2.2 M2Ross BurtonNEW1
6707Add ptest for curlenhancementMedium+2.2 M3Ross BurtonNEW3
6862input subsystem testingenhancementMedium+2.2 M3Ross BurtonNEW5
8584Enable building API documentationenhancementMedium+2.2 M3Ross BurtonNEW10
8851Add bashism checks for shell script functionsenhancementMedium+2.2 M3Ross BurtonIN PROGRESS IMPLEMENTATION5
 9       
Saul Wold
6362Runtime machine configurationenhancementMedium+2.2Saul WoldACCEPTED10
 1       
Scott Rifenbark
9481Add example to "5.23. Debugging With the GNU Project Debugger (GDB) Remotely"enhancementMedium+2.2 M1Scott RifenbarkNEW
 1       
Stephano Cetola
8318Avoid unnecessary package feed churn due to packages rebuildingenhancementMedium+2.2Stephano CetolaACCEPTED4
 1       
Tim Orling
4209Extend our developer experience to enable system and app development on Windows or MacOSenhancementMedium+2.2Tim OrlingNEWThis is a placeholder bug for Eclipse for non Linux platform bug, the estimate will be reflected in the blocking bugs25
7820Replace Hob with Toaster in EclipseenhancementMedium+2.2Tim OrlingIN PROGRESS IMPLEMENTATION10
 2       
Bill Randle
8532runexported.py parameter support for: -a <tag>enhancementMedium+2.2 M1Bill RandleACCEPTED1
8534need export manifest files to SDK package under /conf/test/ folders of every layerenhancementMedium+2.2 M1Bill RandleIN PROGRESS REVIEW0.5
8535export the test scripts under all layers' ./lib/oeqaenhancementMedium+2.2 M1Bill RandleIN PROGRESS REVIEW1
8724Automate information collection for runtime errorsenhancementMedium+2.2 M1Bill RandleACCEPTED45
 4       
He Zhe
6945kernel-dev: multiple kernel buildenhancementMedium+2.2 M1He ZheIN PROGRESS REVIEW4
 1       


Medium Bugs by Owner !(Future,1.7)

IDSummary (415 tasks) SeverityPMilestoneAssigneeStatusWhiteboardE
 0       
Andreas Fenkart
8809gcc 5.2: armv5te: vsprintf appends unwanted ' ' spacesnormalMedium2.2Andreas FenkartNEEDINFO
 1       
Alejandro del Castillo
8166[libsolv] libsolv's upgrade will not automatically remove orphaned dependantsenhancementMedium0.3.2Alejandro del CastilloNEW
8163opkg don't resume big upgrades (old issue #17)normalMedium1.0Alejandro del CastilloNEW
8165[libsolv] opkg_list_upgradable_cmd() does not work with an external solver enabled.normalMedium---Alejandro del CastilloNEW
 3       
Alejandro Hernandez
8613udev-extraconf: automount does not work with systemd >= 219normalMedium1.8.2Alejandro HernandezNEWCheck 2.0 also
7254PATCHRESOLVE's devshell opens up multiple new terminalsminorMedium2.2Alejandro HernandezIN PROGRESS DESIGN7
8730separate code generating python manifest file from manifest information and improve the manifest generationnormalMedium2.2Alejandro HernandezNEW4
9461upm PACKACGECONFIG fails to enable either python or nodejsnormalMedium2.2Alejandro HernandezACCEPTED
8397ROOTLESS_X should be used as default for Poky BSPnormalMedium2.2 M1Alejandro HernandezACCEPTED3
 5       
Alexander Kanavin
6020should libmad be replaced with libmpg123 as the default mp3 decoder?enhancementMedium2.2Alexander KanavinNEW5
9212rework oe-core's handling of python and sysrootsnormalMedium2.2Alexander KanavinNEW10
9486security_flags.inc has many exception packages compiled without -PIE security flagnormalMedium2.2Alexander KanavinNEW
9489security_flags.inc has exception packages compiled without any -fstack-protectornormalMedium2.2Alexander KanavinNEW
 4       
Alexandru Roman
9484Port QA UI tests to Toaster's Django+Selenium frameworknormalMedium2.2 M1Alexandru RomanNEW25
 1       
Aníbal Limón
8667populate_sdk task fails when Debian packaging used in FIDOnormalMedium1.8.2Aníbal LimónACCEPTED
9349Jethro build fails for core-image-x11 with package_debnormalMedium2.0.2Aníbal LimónIN PROGRESS DESIGN2
6996cyclic symlinks in rootfs cause user-space qemu to infinite loop on startupnormalMedium2.2Aníbal LimónNEW10
7490AUH: Add testing support - master bugenhancementMedium2.2Aníbal LimónNEW3
7494AUH: Parallelize running bitbake inside AUH scriptenhancementMedium2.2Aníbal LimónNEW5
7557distrodata/distro_check should use BPNenhancementMedium2.2Aníbal LimónNEW2
8156lib/bb/fetch2/svn.py should support latest_versionstring()enhancementMedium2.2Aníbal LimónNEW1
8727fetcher: should not log errors but pass them for handlingnormalMedium2.2Aníbal LimónNEW2
8735AUH: Use tinfoil instead of parse the recipe itselfenhancementMedium2.2Aníbal LimónNEW5
9211base.bbclass: insufficient error handling for LIC_FILES_CHKSUMnormalMedium2.2Aníbal LimónNEW
9546Resolve string formatting issues in leafpad (or its replacement)normalMedium2.2Aníbal LimónNEW1.5
9547Resolve string formatting issues in libusernormalMedium2.2Aníbal LimónNEW1.5
9548Resolve string formatting issues in ltpnormalMedium2.2Aníbal LimónNEW1.5
9017Sync and Upgrade AB configurationenhancementMedium2.2 M1Aníbal LimónNEW4
7588devtool: improve devtool build outputenhancementMedium2.2 M2Aníbal LimónNEW5
 15       
Belen Barros Pena
6238delete projects/builds through the toaster UIenhancementMedium2.2Belen Barros PenaNEWGUI design pending2
7744Improve messaging in empty states when Toaster does not have any layer informationenhancementMedium2.2Belen Barros PenaNEWGUI design pending3
8034typeahead search cneeds words to indicate it is constrained to the added layers.normalMedium2.2Belen Barros PenaNEW2
6233Design model for project owner / userenhancementMedium2.3Belen Barros PenaACCEPTEDGUI design pending4
6701Provide an option to select layers from different branches within a Toaster projectenhancementMedium2.3Belen Barros PenaNEWGUI design pending7
 5       
Benjamin Esquivel
7202Test for linux-dummyenhancementMedium2.2Benjamin EsquivelIN PROGRESS REVIEW1
8504Identify and add if needed BSP test cases specific to meta-intelenhancementMedium2.2Benjamin EsquivelNEW5
 2       
brian avery
7972lsof needed by start/stop toaster script but not needed on system to run Yocto builds.normalMedium2.2brian averyNEW2
8189Variable history shows full paths to files inside the /bitbake directorynormalMedium2.2brian averyNEW2
9597swtbot initial implementation so that we can automate testing of the pluginnormalMedium---brian averyNEW
 3       
Bruce Ashfield
7096Document how to use initramfs featuresenhancementMedium2.2Bruce AshfieldIN PROGRESS DESIGN2
9480linux-yocto: make it work with arm big endianenhancementMedium2.2Bruce AshfieldACCEPTED7
8289kernel_configme step should use "oldnoconfig" instead of "allnoconfig" when silently upgrading user defconfignormalMedium2.2 M1Bruce AshfieldIN PROGRESS DESIGN COMPLETE4
8743configme --allnoconfig breaks defconfig generated with kconfig / make savedefconfignormalMedium2.2 M1Bruce AshfieldIN PROGRESS IMPLEMENTATION3
3420Audit *-standard.scc and move non-hardware items up into standard.sccenhancementMedium2.2 M2Bruce AshfieldIN PROGRESS DESIGN6
6022kernel-dev: How do I know which features are available for KERNEL_FEATURES ?enhancementMedium2.2 M2Bruce AshfieldACCEPTED2
6630linux-yocto: kernel-dev package does not include target arch scripts binariesenhancementMedium2.2 M2Bruce AshfieldIN PROGRESS IMPLEMENTATION3
6767kernel version mismatched on some BSPsminorMedium2.2 M2Bruce AshfieldIN PROGRESS IMPLEMENTATION2
7418Perf/kernel-devsrc racenormalMedium2.2 M2Bruce AshfieldIN PROGRESS DESIGN3
7646KBUILD_DEFCONFIG does not work if config file is created as a result of patch to be appliednormalMedium2.2 M3Bruce AshfieldIN PROGRESS IMPLEMENTATION3
8970test_kernel_module fails with AssertionError: 137 != 0 : cd /usr/src/kernel && make scriptsnormalMedium2.2 M3Bruce AshfieldACCEPTED5
9125arm64 dmesg test fails show dmi Firmware registration failednormalMedium2.2 M3Bruce AshfieldACCEPTED2
9069perf: missing python modules for scripts in 'perf report'normalMedium2.2 M4Bruce AshfieldIN PROGRESS REVIEW3
 13       
California Sullivan
9267test_parselogs (oeqa.runtime.parselogs.ParseLogsTest) failed on NUC 6i5SYH, firmware load for i915/skl_guc_ver4.bin failednormalMedium2.1 M4California SullivanACCEPTED3
9406dmesg test_parseLogs failed corei7-64 on NUC error BAR 14 and 15normalMedium2.1 M4California SullivanACCEPTED2
9462Boot and install from USB failed getting a xhci_hcd error after booting kernel panic is displayedmajorMedium2.1.1California SullivanACCEPTED3
7267unable to switch SPI SS to active-high in a board filenormalMedium2.2California SullivanACCEPTED3
9202[Test Case 898] Piglit 3D testing NUC (6i5SYH) s getting stuck when running script.normalMedium2.2California SullivanWaitForUpstream3
9271[Test Case 1059] test_parselogs (oeqa.runtime.parselogs.ParseLogsTest)minorMedium2.2California SullivanACCEPTED3
9525Make install prompt available on all consolesenhancementMedium2.2California SullivanNEW4
 7       
Cristina Agurida
8961sudoku-savant does not get downloaded correctlynormalMedium2.0.2Cristina AguridaNEW
 1       
Daniel Istrate
6370QA/oe-selftest: add test suite for recipe testingenhancementMedium2.2Daniel IstrateIN PROGRESS REVIEW10
8332Add a broken recipe for testing purposesenhancementMedium2.2Daniel IstrateNEW2
 2       
David Anders
6866No GPIO controlled LED availablenormalMediumA4 ReleaseDavid AndersIN PROGRESS DESIGN COMPLETE
6869MinnowMax can not be powered via LSEnormalMediumA4 ReleaseDavid AndersIN PROGRESS DESIGN COMPLETE
7027Connecting HDMI cable to the Minnowboard Max doesn't get the monitor ONnormalMediumA4 ReleaseDavid AndersIN PROGRESS IMPLEMENTATION
6727Feature request: provide an option to configure any of the HDR26 GPIO_S5[2:0] pins for wakeenhancementMediumProduction ReleaseDavid AndersIN PROGRESS DESIGN
 4       
David_Wei
6532uEFI Networking booting lacks clear indication of what's going onnormalMediumA1 ReleaseDavid_WeiIN PROGRESS IMPLEMENTATION
6867No GPIO controlled "Reset" JumpernormalMediumA4 ReleaseDavid_WeiIN PROGRESS DESIGN COMPLETE
6182Currently takes more then 2 secs to get the the EFI. Need <.5 sec.normalMediumProduction ReleaseDavid_WeiIN PROGRESS DESIGN
 3       
dengke
8810Some strace ptests failnormalMedium2.1 M4dengkeACCEPTED3
8742nativesdk-coreutils: a lot of warningsnormalMedium2.2dengkeIN PROGRESS REVIEW
 2       
Darren Hart
7682acpitz-virtual-0 thermal device always returns 26.8 deg CnormalMediumProduction ReleaseDarren HartIN PROGRESS REVIEW
 1       
Ed Bartosh
7973stopping toaster kills ALL django apps running on the machine.normalMedium2.2Ed BartoshNEW2
8719Ensure bootable images can be supported by wic for all reference BSPsenhancementMedium2.2Ed BartoshIN PROGRESS DESIGN
8806Refactor localhostbecontrollernormalMedium2.2Ed BartoshNEW20
8886Toaster thinks do_shared_workdir is a shared state tasknormalMedium2.2Ed BartoshNEW3
8918Change the way we handle queued buildsnormalMedium2.2Ed BartoshNEW
9076The detection of the image type is incorrectly matching a wrong typenormalMedium2.2Ed BartoshIN PROGRESS IMPLEMENTATION3
9099Create sparse images with wicenhancementMedium2.2Ed BartoshIN PROGRESS REVIEW5
9235oe-init-build-env: to receive an argument/variable for appending to local.confenhancementMedium2.2Ed BartoshIN PROGRESS REVIEW
9518Rationalise the directory structure generated by ToasterenhancementMedium2.2Ed BartoshNEW
9585verify/fix eventreplaynormalMedium2.2Ed BartoshNEW
 10       
 
7572SOURCE_DEBUG_ENABLE fails on .76 MinnowMaxmajorMediumProduction Release IN PROGRESS REVIEW
 1       
Plauchu Edwin
8200Add acl to default DISTRO_FEATURES?enhancementMedium2.2Plauchu EdwinNEW1
9549Resolve string formatting issues in makedevsnormalMedium2.2Plauchu EdwinNEW1.5
9550Resolve string formatting issues in statnormalMedium2.2Plauchu EdwinNEW1.5
9551Resolve string formatting issues in unzipnormalMedium2.2Plauchu EdwinNEW1.5
9552Resolve string formatting issues in zipnormalMedium2.2Plauchu EdwinNEW1.5
7909RRS: Track patches and Upstream-Status informationenhancementMedium2.2 M1Plauchu EdwinNEW5
8133RRS should handle upstream repositories without version tagsenhancementMedium2.2 M1Plauchu EdwinIN PROGRESS DESIGNGUI design available2
8400rrs: add the cause of an unknown recipe versionenhancementMedium2.2 M1Plauchu EdwinNEW3
8943add a function hook that would process upstream and recipe versionsenhancementMedium2.2 M1Plauchu EdwinNEW
9081RRS should respect DEFAULT_PREFERENCE when multiple versions of the same recipe are availablenormalMedium2.2 M1Plauchu EdwinIN PROGRESS DESIGN2
9204Cleanup should be made after testing smartnormalMedium2.2 M1Plauchu EdwinNEW1
 11       
Beth Flanagan
8044Stop building lsb-qt3 imagesnormalMedium2.2Beth FlanaganNEEDINFONIR 04/17, 4/24, 05/012
8158INCOMPATIBLE_LICENSES has unexpected results with GNU librariesnormalMedium2.2Beth FlanaganNEW10
7693Convert Autobuilder docs to docbookenhancementMedium2.2 M1Beth FlanaganNEW5
8760Autobuilder additional task log availabilitynormalMedium2.2 M1Beth FlanaganNEW2
9018Extend existing AutoBuilder script to schedule buildsenhancementMedium2.2 M1Beth FlanaganACCEPTED3
8193add wiki reporting to public ABenhancementMedium2.2 M2Beth FlanaganNEW3
8841COPY_LIC_DIRS should use beginline and endline from LIC_FILES_CHKSUMenhancementMedium2.2 M2Beth FlanaganNEW1
9315nightly-world & nightly-world-lsb failed at PublishingArtifactsnormalMedium2.2 M2Beth FlanaganNEW2
 8       
Elliot Smith
8188The variable history is missing the layer namenormalMedium2.2Elliot SmithNEW10
8190The 'set in file' filters in the BitBake variables table seem to return the wrong informationnormalMedium2.2Elliot SmithNEW6
8363Assess which non-ToasterTable pages need refactoring and howenhancementMedium2.2Elliot SmithNEW2
8556Toaster: bitbake variables image_fstypes not being passed to build proceesnormalMedium2.2Elliot SmithNEW15
8563Improve detection and presentation of build artifactsenhancementMedium2.2Elliot SmithNEW5
9023Improve the content of the "other artifacts" sectionenhancementMedium2.2Elliot SmithNEWGUI design available4
9395Cleanly support unicode throughout ToasterenhancementMedium2.2Elliot SmithNEW15
9485Fix typeaheads for Bootstrap 3normalMedium2.2Elliot SmithNEW3
9494Custom images created from the build history pages fail to buildnormalMedium2.2Elliot SmithNEW3
9498Progress bar not behaving correctly on mysqlnormalMedium2.2Elliot SmithNEW10
9500In multitarget builds, Toaster shows software recipes in the list of imagesnormalMedium2.2Elliot SmithNEW4
9514Builds of software recipes should not show a "New custom image" buttonnormalMedium2.2Elliot SmithNEW2
9530Arrows in directory structure do not expand directoriesnormalMedium2.2Elliot SmithNEW
8515In analysis mode, if you interrupt the bitbake build, toaster erroneously reports a successful buildnormalMedium2.2 M1Elliot SmithIN PROGRESS REVIEW5
9011Default sorting for recipes page not showing properlyminorMedium2.2 M1Elliot SmithIN PROGRESS REVIEW0.5
9159if recipe = git, 18 pages shownnormalMedium2.2 M1Elliot SmithIN PROGRESS REVIEW0.5
9441Enable back web analyticsnormalMedium2.2 M2Elliot SmithNEW2
 17       
Francisco Pedraza
8502Store BSPs Firmware and HW info for BSP test casesenhancementMedium2.2Francisco PedrazaNEW2
 1       
Hongxu Jia
7600syslinux: port extX support patches to syslinux communityenhancementMedium2.2 M2Hongxu JiaIN PROGRESS IMPLEMENTATION15
8832pTest - bash tests fail for 2.1_M1.rc1normalMedium2.2 M2Hongxu JiaNEW
7018archiver missing tasks between do_unpack and do_patchnormalMedium2.2 M3Hongxu JiaIN PROGRESS REVIEW3
7149rpm: print which pkgname for warningenhancementMedium2.2 M3Hongxu JiaNEW5
8446fix .pyc/.pyo buildpaths issueenhancementMedium2.2 M3Hongxu JiaNEW5
8784IMAGE_LINGUAS did not support multilib correctlynormalMedium2.2 M3Hongxu JiaACCEPTED
9169add fix_buildpaths.bbclass to fix build pathenhancementMedium2.2 M3Hongxu JiaNEW
6420Detect and error when required packages are not producedenhancementMedium2.2 M4Hongxu JiaNEW5
 8       
 
8321yocto-bsp script should use argparse instead of optparse libraryenhancementMedium2.2 ACCEPTED2
9407bitbake reports log_check warning without stating in which log/recipe the problem occurrednormalMedium2.2 NEW3
8919Code coverage: add ability to create coverage-based test exclusion reportsenhancementMedium2.2 M1 NEW6
8921Code coverage: add ability to create missing 'coverage area' reportsenhancementMedium2.2 M1 NEW5
9534oe-selftest --list-tests output format assumes 150 character wide terminalnormalMedium2.2 M1 NEW
 5       
Ivan Rouzanov
7396MBI should be removed from DSDTnormalMediumProduction ReleaseIvan RouzanovIN PROGRESS REVIEW
 1       
Jeff Osier-Mixon
8707Clarification needed about branch names and point releasesnormalMediumQ1Jeff Osier-MixonIN PROGRESS REVIEW
 1       
Jianxun Zhang
5351genericx86 auth.err getty[615]: tcgetattr: Input/outputnormalMedium2.2Jianxun ZhangNEW2
9205Add functionality to the formfactor to check for keyboard and/or touchscreenenhancementMedium2.2Jianxun ZhangIN PROGRESS REVIEW0.1
9419Enabling systemd-boot to replace gummibootenhancementMedium2.2 M1Jianxun ZhangIN PROGRESS IMPLEMENTATION8
 3       
jingwang
8483Compatible to run generic pyunit test cases by test runnerenhancementMedium2.2 M1jingwangIN PROGRESS DESIGN
 1       
Jose Lamego
7823Convert Eclipse projects to Yocto recipes with devtoolenhancementMedium2.2Jose LamegoIN PROGRESS DESIGNGUI design available1
8874Create a new Yocto recipe from an existing Eclipse project using devtoolnormalMedium2.2Jose LamegoNEW5
9389oeqa: split configuration from the codeenhancementMedium2.2 M1Jose LamegoNEW2
7824Add functionality to modify existing Yocto recipes with devtoolenhancementMedium2.2 M2Jose LamegoACCEPTED5
8873Create an appropriate Yocto Project Workspace from an existing Eclipse projectenhancementMedium2.2 M2Jose LamegoNEW5
9390oeqa: don't write anything to local.conf or bblayers.confenhancementMedium2.2 M2Jose LamegoNEW10
 6       
Jose Perez C
7526add test for checking if fontcache is created inside an imageenhancementMedium2.2Jose Perez CNEW1
8087eglibc patch bugnormalMedium2.2Jose Perez CNEW2
8146ptest - some test cases are failing for aclnormalMedium2.2Jose Perez CNEW2
9280[Test Case 1059], when running testimage several test cases for test smart failed on WIC imagenormalMedium2.2 M1Jose Perez CNEEDINFONIR 04/10, 4/17, 04/24, 05/01
 4       
Joshua Lock
9483"Testing URL" hangs foreverminorMedium2.0.2Joshua LockIN PROGRESS REVIEW
1882Verify and document package feed creation for each package management backendnormalMedium2.2Joshua LockACCEPTED5
9115Added packages filter seems to show the wrong package listnormalMedium2.2Joshua LockACCEPTED4
9297Toaster: Simplify building extensible SDKenhancementMedium2.2Joshua LockNEWGUI design pending
9488security_flags.inc does not use format string vulnerability prevention flagsnormalMedium2.2Joshua LockIN PROGRESS REVIEW1
9539Resolve string formatting issues in busyboxnormalMedium2.2Joshua LockNEW3
9540Resolve string formatting issues in console-toolsnormalMedium2.2Joshua LockNEW1.5
9541Resolve string formatting issues in cmakenormalMedium2.2Joshua LockNEW2
9542Resolve string formatting issues in expectnormalMedium2.2Joshua LockNEW1.5
9543Resolve string formatting issues in gccnormalMedium2.2Joshua LockNEW4
9544Resolve string formatting issues in gettextnormalMedium2.2Joshua LockNEW1.5
9545Resolve string formatting issues in kexec-toolsnormalMedium2.2Joshua LockNEW1.5
9568bbexample recipe fails to build unless PARALLEL_MAKE is disablednormalMedium2.2Joshua LockNEW
9224[meta-swupd] Try to speed up update generation by parallelising calls to swupd_make_packenhancementMedium2.2 M1Joshua LockNEW1
9321[meta-swupd] Enhancements for use within a continuous integration systemenhancementMedium2.2 M1Joshua LockIN PROGRESS DESIGN4
9322[meta-swupd] Improve the algorithm for determining previous versionenhancementMedium2.2 M1Joshua LockNEW1.5
9325[meta-swupd] Copy only required bundle contents, rather than copying the entire mega image and then pruning unwanted filesenhancementMedium2.2 M1Joshua LockIN PROGRESS IMPLEMENTATION1
9187[meta-swupd] implement generic versions of the update helper scripts in oe-swupd-helpersnormalMedium2.2 M2Joshua LockNEW3
9188[meta-swupd] Remove hard-coded paths from swupd-clientnormalMedium2.2 M2Joshua LockNEW2
9189[meta-swupd] Creates a lot of duplicate filesenhancementMedium2.2 M2Joshua LockNEW1
9190[meta-swupd] Try to consolidate OS_VERSION and DISTRO_VERSIONnormalMedium2.2 M2Joshua LockNEW0.5
9511Provide support for swupd manifest includesenhancementMedium2.2 M2Joshua LockNEW
9192[meta-swupd] Support virtual images generated from a virtual recipenormalMedium2.2 M3Joshua LockNEW5
 23       
Juro Bystricky
9357nativesdk-python3 does not buildnormalMedium2.0.2Juro BystrickyIN PROGRESS REVIEW
3898kernel menuconfig unusablenormalMedium2.2Juro BystrickyWaitForUpstream
8072Document using Build Appliance using Virtual BoxenhancementMedium2.2Juro BystrickyIN PROGRESS DESIGN15 Jan 2016: NEEDINFO1
8074Graphic display using Virtual Box differs from VMwarenormalMedium2.2Juro BystrickyIN PROGRESS REVIEW1
9442Please add virtio console to qemux86-64.confenhancementMedium2.2 M1Juro BystrickyACCEPTED
 5       
Jussi Kukkonen
9473bind: CVE-2016-2088 (jethro)majorMedium2.0.2Jussi KukkonenNEW0.5
1985matchbox-panel doesn't build battery status appletenhancementMedium2.2Jussi KukkonenNEW5
2646Windows switching failurenormalMedium2.2Jussi KukkonenIN PROGRESS IMPLEMENTATION0.5
6077piglit depends on libx11enhancementMedium2.2Jussi KukkonenACCEPTED2
6378libfakekey patch to allow shift-ed version of symbol not already in keymapnormalMedium2.2Jussi KukkonenNEW1
8380multiple pointer devices in qemunormalMedium2.2Jussi KukkonenACCEPTED2
8586multilib build includes 32bit connman without good reasonnormalMedium2.2Jussi KukkonenIN PROGRESS REVIEW1
8643GTK+3 depends on libepoxy which depends on eglnormalMedium2.2Jussi KukkonenACCEPTED3
9350As a developer, I want a global variable exist for choosing the default SSL/TLS provider.enhancementMedium2.2Jussi KukkonenNEW
9356piglit needs to be updated to run newer testsnormalMedium2.2Jussi KukkonenNEW
9365Remove xtscal in preference of xinput-calibratorenhancementMedium2.2Jussi KukkonenNEW
9523openssl: dangling libcrypto.a symlinknormalMedium2.2Jussi KukkonenNEW
9524Drop libxsettings-clientenhancementMedium2.2Jussi KukkonenNEW
9082Display network information on log-in screensenhancementMedium2.2 M1Jussi KukkonenACCEPTED0.5
 14       
Jussi Laako
9176Default u-boot script is not able boot from eMMC on BeagleBone BlacknormalMedium2.1 M4Jussi LaakoNEW
 1       
Christopher Larson
6372Feature request: recipe hook for source tree preparationenhancementMedium2.2Christopher LarsonNEW
7670Proposal: make TOPDIR or BUILDDIR available to the devshellenhancementMedium2.2Christopher LarsonIN PROGRESS REVIEW
7671Feature request: integrate task-level exports supportenhancementMedium2.2Christopher LarsonNEW
7958Implement shallow git clone functionalityenhancementMedium2.2Christopher LarsonIN PROGRESS IMPLEMENTATION2
8402LAYERDIR is used as-is in BBFILE_PATTERN, when it should be regex escapedminorMedium2.2Christopher LarsonNEW
 5       
Leonardo Sandoval Gonzalez
3276PulseAudio isn't testedenhancementMedium2.2Leonardo Sandoval GonzalezNEW
5399Sharing PR server between builders with different metadataenhancementMedium2.2Leonardo Sandoval GonzalezNEW9
5654Add EFI to qemux86 and qemux86-64enhancementMedium2.2Leonardo Sandoval GonzalezWaitForUpstream5
9070Add test that locales are workingenhancementMedium2.2Leonardo Sandoval GonzalezNEW
9080Autobuilder/oe-selftest: Have a way to specify a which oe-self tests get run on a forced AB jobnormalMedium2.2Leonardo Sandoval GonzalezNEW2
9085Build QA Warnings: add a test for unlisted dependenciesnormalMedium2.2Leonardo Sandoval GonzalezNEW2
9129Enhance Test Suite scanning and executionenhancementMedium2.2Leonardo Sandoval GonzalezNEW4
9140Eclipse plugin testing enable work on other distrosenhancementMedium2.2Leonardo Sandoval GonzalezNEW
6618Make the layer name searchable and show item page when search returns only one resultenhancementMedium2.2 M1Leonardo Sandoval GonzalezIN PROGRESS REVIEW2
7724useradd.bbclass users cannot be safely referred to by dependent recipes due to sstate-induced race with base-passwdmajorMedium2.2 M1Leonardo Sandoval GonzalezIN PROGRESS IMPLEMENTATIONTC needed7
7855Show blacklist information in layer indexenhancementMedium2.2 M1Leonardo Sandoval GonzalezIN PROGRESS REVIEWGUI design available2
9120The patch file is not applied to linux-yocto by yocto-kernel add patch commandnormalMedium2.2 M1Leonardo Sandoval GonzalezIN PROGRESS REVIEW2
9308patchtest: improve signal handling when the process is interruptedenhancementMedium2.2 M1Leonardo Sandoval GonzalezACCEPTED
8455Add tests to empty imageminorMedium2.2 M2Leonardo Sandoval GonzalezNEW3
8676devtool: extend oe-selftest testing for devtool upgradeenhancementMedium2.2 M2Leonardo Sandoval GonzalezACCEPTED2
 15       
Libertad
8497Continuous Toaster exploratory testingenhancementMedium2.2LibertadNEW
8678Testing coverage of non-poky Toaster setupenhancementMedium2.2LibertadNEW1
 2       
Robert Yang
4827runqemu shouldn't hard-code machine knowledgeenhancementMedium2.2Robert YangACCEPTED3
6120perf top command does not work on QemuPPCnormalMedium2.2Robert YangACCEPTED5
7436kbd build racenormalMedium2.2Robert YangIN PROGRESS DESIGN1
8740LTP and LSB NG casesnormalMedium2.2Robert YangIN PROGRESS REVIEW
9217Many unsolveable QA warnings from build-deps and file-rdepsnormalMedium2.2Robert YangNEW
9404Smart will remove RECOMMENDS during a remove commandnormalMedium2.2Robert YangNEW
7610[Multilib] Can't install 64bit packages to 32bit rootfsenhancementMedium2.2 M1Robert YangACCEPTED10
8592smart: make it can understand MLPREFIXenhancementMedium2.2 M1Robert YangNEW10
9048Failed to build iptables with extensible sdk on Fedora 23 i686normalMedium2.2 M1Robert YangACCEPTED
9408create-pull-request: auto push the branch if not presentenhancementMedium2.2 M1Robert YangNEW3
9409create-pull-request: add the ability to read env varenhancementMedium2.2 M1Robert YangNEW2
9410create-pull-request: automatically add the subject when there is only one patchenhancementMedium2.2 M1Robert YangNEW2
9436lib/bb/fetch2/git.py: print more friendly errors messages when failedlib/bb/fetch2/git.pyenhancementMedium2.2 M1Robert YangNEW3
9512insane.bbclass: package_qa_check_license -> do_qa_populate_licnormalMedium2.2 M1Robert YangIN PROGRESS IMPLEMENTATION5
9495Can't boot efi image (iso or vmdk) in virtualboxnormalMedium2.2 M2Robert YangNEW
7984RPM backend does not honor package overrides for PACKAGE_ARCHnormalMedium2.2 M3Robert YangNEW5
8967Need a way to cleanup DEPENDS and RDEPENDSenhancementMedium2.2 M3Robert YangNEW5
9423devshell: export CONFIGUREOPTS to envenhancementMedium2.2 M3Robert YangNEW5
7950gcc-cross-canadian-i586 doesn't work PREFERRED_VERSIONnormalMedium2.2 M4Robert YangIN PROGRESS REVIEW2
 19       
Ming Liu
9233As a developer, I want initramfs bundled kernel could be installed into rootfsnormalMedium2.2Ming LiuIN PROGRESS REVIEW
 1       
Mang Guo
9062Firmware - Upgrade to UDK2015normalMediumProduction ReleaseMang GuoIN PROGRESS DESIGN COMPLETE
 1       
Marcel Holtmann
6679Trusted Execution Engine (TXE) exposed over PCInormalMediumProduction ReleaseMarcel HoltmannIN PROGRESS REVIEW
 1       
Mariano Lopez
9294Error Reporting Tool: Add a 'solutions' relationship to the error entriesenhancementMedium2.2Mariano LopezNEWGUI design pending
8650RRS: track ptest-enabled and potentially ptest-enabled statusenhancementMedium2.2 M1Mariano LopezACCEPTEDGUI design available3
9565Add copy dir and delete files, dir to sshcontrolenhancementMedium2.2 M1Mariano LopezIN PROGRESS REVIEW1
9569Add extract package function to the package managersenhancementMedium2.2 M1Mariano LopezNEW
9468Export Tests execution (Runexport.py) execution log needs improvementsenhancementMedium2.2 M2Mariano LopezNEW3
 5       
Mark Hatle
8779update-alternatives.bbclass automatic renaming doesn't happen in sysrootsnormalMedium2.2Mark HatleNEW
9208createrepo fails to correctly update the repodata, image generation then failsnormalMedium2.2Mark HatleNEW
 2       
Markus Lehtonen
6926Create yocto-bsp testsuiteenhancementMedium2.2Markus LehtonenNEW15
 1       
Maxin B. John
8471ptest - some valgrind ptests fail on 2.0.rc1normalMedium2.2Maxin B. JohnACCEPTED2
9107Update spdx.bbclass to work with FOSSology 3.0.0 releasenormalMedium2.2Maxin B. JohnACCEPTED
 2       
Michael Wood
7502Show image information if rootfs files are generatednormalMedium2.2Michael WoodNEW4
8051Importing layer fails silently if the layer name already existsnormalMedium2.2Michael WoodNEW2
8131All builds page "Errors"/"Warnings" filters doesn't worknormalMedium2.2Michael WoodACCEPTED4
8275Toaster: Suitable message and build box does not appear in build tab for a project with no buildsnormalMedium2.2Michael WoodNEW4
8456Add feature to add layers to Toaster from external sourceenhancementMedium2.2Michael WoodNEW
8952Changes to the revision of an imported layer are not savednormalMedium2.2Michael WoodNEW
8953Toaster ignores the subdirectory when cloning imported layersnormalMedium2.2Michael WoodNEW
9184Cannot delete layer from toaster databaseenhancementMedium2.2Michael WoodNEWGUI design pending
9274Port oe build selftest tests to django test frameworknormalMedium2.2 M1Michael WoodIN PROGRESS REVIEW4
9093Hide scary errors while importing recipe information from the layer indexnormalMedium2.2 M3Michael WoodNEW2
9097Remove validation messages when layers checkout directory and build directory are correctly setnormalMedium2.2 M3Michael WoodNEW4
9164The toaster-custom-images layer should not show like any other layer, and should not be removablenormalMedium2.2 M4Michael WoodNEWGUI design available4
9586document and verify production setup for jenkins ci interactionnormalMedium---Michael WoodNEW
 13       
Michael Halstead
6683Produce a script to automate release preparation tasksmajorMedium2.2Michael HalsteadNEW3
8162patchwork: clear out the superseded and already merged patchesenhancementMedium2.2 M1Michael HalsteadNEWNIR 03/27, 04/03, 04/10, 04/17, 04/244
 2       
Mike Wu
9063Firmware - Support for Capsule update mechanismnormalMediumProduction ReleaseMike WuIN PROGRESS DESIGN COMPLETE
 1       
Paul Eggleton
5057Conflict when building SDK for image containing dropbear and openssh-sftp-servernormalMedium2.2Paul EggletonACCEPTEDRelease Note4
5546Optimise away meta-oe X init mechanismenhancementMedium2.2Paul EggletonACCEPTED2
6128Incorrect wildcard unpack behaviour in fetchernormalMedium2.2Paul EggletonNEW2
6129Local directories unpack to a different location than local filesnormalMedium2.2Paul EggletonNEW2
6626Add an example for debugging software with the corresponding -dbg packagenormalMedium2.2Paul EggletonNEW1
6661devtool: add ability to submit changes for reviewenhancementMedium2.2Paul EggletonNEW10
6972breaks build of software using cmake packages due to hardcoded pathsnormalMedium2.2Paul EggletonNEW1
7142cmake.bbclass fails when rebuilding after MACHINE changesnormalMedium2.2Paul EggletonNEW3
7240Add declaration of image output file globs for ToasterenhancementMedium2.2Paul EggletonNEW1
7336buildhistory-diff reports recipe-wide changes per-subpackageenhancementMedium2.2Paul EggletonNEW1
7617devtool: detect need to re-run configureenhancementMedium2.2Paul EggletonNEW3
7636recipetool: basic spec file conversionenhancementMedium2.2Paul EggletonNEW
7637devtool: add: interactive recipe creationenhancementMedium2.2Paul EggletonNEW5
7792Layer compatible branches expansionenhancementMedium2.2Paul EggletonNEW5
7852bitbake-layers layerindex-fetch doesn't respect branch (-b|--branch) optionnormalMedium2.2Paul EggletonIN PROGRESS DESIGN1
8278devtool: update compressed patches gracefullynormalMedium2.2Paul EggletonNEW0.5
8325devtool modify could handle patch failure more usefullynormalMedium2.2Paul EggletonNEW3
8582Error message not in log filenormalMedium2.2Paul EggletonNEW2
8594devtool: provide easy means of moving a recipe in the workspace to a real layerenhancementMedium2.2Paul EggletonNEW3
8703PATCHTOOL = git, triggers error user.name/user.email unsetnormalMedium2.2Paul EggletonIN PROGRESS IMPLEMENTATION0.5
8732Branch Support for BuildhistoryenhancementMedium2.2Paul EggletonNEW2
8840Failure to build 32 bit eSDK on a 64 bit hostenhancementMedium2.2Paul EggletonNEW4
9220buildhistory should track native recipesenhancementMedium2.2Paul EggletonNEW2
9360devtool: update-recipe ignores SRC_URI_appendnormalMedium2.2Paul EggletonNEW4
9367Extensible SDK: avoid double invocation of bitbake on installenhancementMedium2.2Paul EggletonNEW4
9479Extensible SDK breaks if python-dependent items added to TOOLCHAIN_HOST_TASKnormalMedium2.2Paul EggletonNEW2
9574[devtool] can't update gdbnormalMedium2.2Paul EggletonNEW
8223bbwarn warnings during do_rootfs printed twiceminorMedium2.2 M1Paul EggletonIN PROGRESS IMPLEMENTATION1
9257extensible SDK: need an easy way of installing toolchainsnormalMedium2.2 M1Paul EggletonNEW1
 29       
Chen Qi
8939Lots of [host-user-contaminated] warningnormalMedium1.4.5Chen QiACCEPTED
8812Some util-linux ptests failnormalMedium2.1 M4Chen QiACCEPTED2
8834pTest - attr test fail ln -s fnormalMedium2.1 M4Chen QiACCEPTED2
9053pTest - util-linux (NUC) failed tested on NUC 5425WYK for YP 2.1_M2.rc1normalMedium2.1 M4Chen QiACCEPTED2
9055pTest - acl (NUC) failed tested on NUC 5425WYK for YP 2.1_M2.rc1normalMedium2.1 M4Chen QiACCEPTED2
4420No init scripts in core-image-sato with systemd if 'sysvinit' is not in DISTRO_FEATURESenhancementMedium2.2Chen QiIN PROGRESS IMPLEMENTATION10
5359[Yocto 1.5] su - USER -c 'COMMAND' env variable issuenormalMedium2.2Chen QiNEW
5427Extend and tidy up layer sanity checkingenhancementMedium2.2Chen QiIN PROGRESS REVIEW5
6016CrossTap has issues on running scheduler script against qemuppcnormalMedium2.2Chen QiNEW5
6132Have persistent log data (/var/log)enhancementMedium2.2Chen QiIN PROGRESS REVIEW4
6660Compare sstate packages within SDK publishing toolenhancementMedium2.2Chen QiACCEPTED6
7710devtool: deploy-target: interact with target packaging where availableenhancementMedium2.2Chen QiIN PROGRESS DESIGN10
8314warn when ALTERNATIVE_PRIORITY are the sameenhancementMedium2.2Chen QiNEW10
 13       
Khem Raj
6882Can't log in to successfully built mipsel virtual imagemajorMedium1.6.4Khem RajACCEPTED
8870uclibc fails to build occasionallynormalMedium2.2Khem RajNEW
9417Bring clang/llvm compiler infrastructure to OE-CoreenhancementMedium2.2Khem RajNEW
 3       
Randy Witt
5866Reproducible builds: identical binariesenhancementMedium2.2Randy WittNEW5
8560xserver fails with xf86OpenConsole: Cannot open /dev/tty0 (No such file or directory)normalMedium2.2Randy WittNEW2
8789extensible SDK: command disable devtool subcommands based on capabilitiesenhancementMedium2.2Randy WittNEW2
8928extensible SDK - add a way to prepare the sdk for offline usageenhancementMedium2.2Randy WittNEW3
9173extensible sdk: Create a way that sstate will automatically be removed after setsceneenhancementMedium2.2Randy WittNEW1
9503Add a way to add docker metadata to container imagesenhancementMedium2.2Randy WittNEW3
9504knotty doesn't delete lines if the number of output lines is larger than then number of lines in the terminalnormalMedium2.2Randy WittNEW2
7552Generated SDK has "expect" headers in wrong locationnormalMedium2.2 M3Randy WittNEW1
 8       
Randy MacLeod
3388perf: enable man pages for basic 'help' functionalitynormalMedium2.2Randy MacLeodACCEPTED2
7314Audit all recipes for proper CONFFILES assignmentenhancementMedium2.2Randy MacLeodNEW
 2       
Richard Purdie
4143Support real-time logging when using bitbake interactivelyenhancementMedium2.2Richard PurdieNEW5
4389kernel: Remove "make scripts" requirement for module building from SDK/on targetenhancementMedium2.2Richard PurdieACCEPTED5
5280For tested hosts, we should use a wild card or other translations to group compatible sstate-cache (and other items)enhancementMedium2.2Richard PurdieNEW3
5395Nativesdk postinstalls directory issues.normalMedium2.2Richard PurdieNEW5
7298packagegroups are not rebuilt when rdependency pkg name changesnormalMedium2.2Richard PurdieNEW5
7846devshell cannot be kept open across rebuildsenhancementMedium2.2Richard PurdieNEW1
7877Depending on the error found, inconsistent line reported.normalMedium2.2Richard PurdieNEW3
7879Depending on the name of a recipe, the build succeeds or fails.normalMedium2.2Richard PurdieNEW3
7960Feature Request: to enable poky to support building multilib native commandsenhancementMedium2.2Richard PurdieNEW5
7985Variable typing support within BitBakeenhancementMedium2.2Richard PurdieNEW15
8161Can't use "\" characters in SRC_URI entries - not even escapednormalMedium2.2Richard PurdieNEW2
8173Wrong dynamic loader because of missing -mfloat-abi=hard in LDFLAGS (in scons)normalMedium2.2Richard PurdieNEW2
8805Detect and warn people naming functions something_remove_somethingnormalMedium2.2Richard PurdieNEW1
8828pTest - lttng-tools tests fail for 2.1_M1.rc1normalMedium2.2Richard PurdieNEW3
9061git fetcher inconsistency for working with PREMIRRORS.normalMedium2.2Richard PurdieNEW5
9175Remove os.chdir from fetch/unpack logicenhancementMedium2.2Richard PurdieNEW5
9272BBCLASSEXTEND="cross" overrides do_install()normalMedium2.2Richard PurdieNEW1
9279Issue with PREFERRED_PROVIDER interaction with overridesnormalMedium2.2Richard PurdieNEW1
9251Need flowchart style documentation showing progress of tasks and what they touch in a setscene vs non setscene setting.enhancementMedium2.2 M1Richard PurdieNEW1
 19       
LiRongQing
7554Ownership issue in package contentsmajorMedium2.2LiRongQingACCEPTED
 1       
Ross Burton
9158Cannot build openjdk-8 on fido due to missing autotools patchnormalMedium1.8.2Ross BurtonNEW1
2415connman doesn't provide a 3g configuration utilityenhancementMedium2.2Ross BurtonNEW5
3488Enable Mesa's llvmpipe?enhancementMedium2.2Ross BurtonACCEPTED2
5322Global DNS fallback mechanism not present in poky distroenhancementMedium2.2Ross BurtonACCEPTED3
6278runqemu without /etc/resolv.confenhancementMedium2.2Ross BurtonNEW3
6700systemd's resolved conflicts with connmanenhancementMedium2.2Ross BurtonNEW2
7010systemd-serialgetty cannot create a serial-getty@.service that is not enablednormalMedium2.2Ross BurtonNEWBackport to 1.7.31
7054OprofileUI needs to be updated to reflect new oprofile functionalitynormalMedium2.2Ross BurtonACCEPTED2
7800systemd.bbclass doesn't check for services in systemd/user/ directoryenhancementMedium2.2Ross BurtonNEW3
8064ptest fails tracker bugnormalMedium2.2Ross BurtonNEW
8302sstate_create_package fails to chmod filenormalMedium2.2Ross BurtonNEW1
8430inaccurate 'du' usage in Image::_get_rootfs_sizeenhancementMedium2.2Ross BurtonACCEPTED1
8454archiver.bbclass does not create subfolder per licensenormalMedium2.2Ross BurtonNEW1
8593The head files of ncurses installing into sysroot seems different in multiple times compilationnormalMedium2.2Ross BurtonNEW2
8688busybox syslog not update-alternatives awarenormalMedium2.2Ross BurtonNEW2
9110Move some oe-pkgdata-util logic into lib/oeenhancementMedium2.2Ross BurtonNEW2
9119ptest fails tracker bug (Cont.)normalMedium2.2Ross BurtonNEW
9171Consider limiting the scope of depchains to runtime depsnormalMedium2.2Ross BurtonNEW5
9207Need to fix prelink to iterate mulitlibsnormalMedium2.2Ross BurtonNEW4
9213Enable thumb for ARM buildsnormalMedium2.2Ross BurtonNEW1
9259The rpm database costs lots of disk space after install a packagenormalMedium2.2Ross BurtonNEW3
9288depexp does not show bitbake errorsnormalMedium2.2Ross BurtonNEW1
9346Rename COMPRESS_CMD_* to IMAGE_POSTPROCESS_*?enhancementMedium2.2 M1Ross BurtonNEW1
7136Default PACKAGES value prevents packaging of prebuilt shared librariesnormalMedium2.2 M2Ross BurtonNEW1
6142we need general documentation on Systemd vs SysV related issuesenhancementMedium2.2 M4Ross BurtonNEEDINFONIR 05/011
 25       
Saul Wold
7459Implement the use of host USB devices on Linux for qemu machinesenhancementMedium2.2Saul WoldNEW3
95874.1.x: gpio-pca953x.c fails to compile without CONFIG_ACPInormalMedium2.2Saul WoldNEW
 2       
YONG LI
9347drivers/gpio/gpio-pca953x.c in Kernel 4.x does not support the PCAL9535 IC on Galileo Gen 2 boardsnormalMedium2.1 M4YONG LINEW
7255The CPU is very hot if break into EFI shellnormalMediumProduction ReleaseYONG LIIN PROGRESS REVIEW
 2       
Lu_Shifei
6723hpet: number irqs doesn't agree with number of timersnormalMediumProduction ReleaseLu_ShifeiIN PROGRESS DESIGN
 1       
Scott Rifenbark
9264Remove mentions of oprofilenormalMedium2.1 M4Scott RifenbarkIN PROGRESS REVIEW15 April 2016: IN PROGRESS REVIEW2
9380The manual does not mention automatically added version restrictionsnormalMedium2.2Scott RifenbarkNEW04 April 2016: NEEDINFO1
9553INHIBIT_PACKAGE_STRIP docs need to be expandednormalMedium2.2Scott RifenbarkNEW
9580Missing package dependency in quick start guide for FedoranormalMedium2.2Scott RifenbarkNEW
7718target:task syntax not mentioned in --helpminorMedium2.2 M1Scott RifenbarkNEW0.5
3442Eclipse-plugin for Windows should be documentedenhancementMedium2.2 M4Scott RifenbarkACCEPTED04 May 2015 - ACCEPTED3
7477runqemu should support running poky tinyenhancementMedium2.2 M4Scott RifenbarkNEW2
7546Streamline application development manualenhancementMedium2.2 M4Scott RifenbarkACCEPTED09 April 2015: ACCEPTED3
8596Document proper way of adding a userspace header for the kernelenhancementMedium2.2 M4Scott RifenbarkACCEPTED1
8631Fully document sysroot populationenhancementMedium2.2 M4Scott RifenbarkNEW3
8909Mention standard fetcher options also in fetcher seaction (not only in SRC_URI in the glossary)enhancementMedium2.2 M4Scott RifenbarkACCEPTED2
9001bootimg.bbclass does not ducument GRUB boot lodader supportnormalMedium2.2 M4Scott RifenbarkNEW27 Jan 2016: NEEDINFO2
9376Enhance descriptions for kernel tasks in the reference manual.enhancementMedium2.2 M4Scott RifenbarkNEW10
9451Document a cookbook procedure on how to change kernel versionnormalMedium2.2 M4Scott RifenbarkNEW2
 14       
Stephano Cetola
9497systemd usersnormalMedium2.2Stephano CetolaIN PROGRESS DESIGN1
9578INHIBIT_PACKAGE_STRIP breaks -dbgnormalMedium2.2Stephano CetolaNEW
9529sysvinit: inittab labels for consoles need to be restricted to 4 charactersenhancementMedium2.2 M2Stephano CetolaIN PROGRESS REVIEW
 3       
Stephen K Jolley
78833G/4G mobile hardware supportenhancementMedium2.2Stephen K JolleyACCEPTED0.1
 1       
Sujith H
7005Toaster UI - two or more projects having the same name can be createdenhancementMedium2.2 M1Sujith HIN PROGRESS REVIEWGUI design available1
 1       
He, Tim
7497Add "save" option back to the boot ordering screennormalMediumProduction ReleaseHe, TimACCEPTED
 1       
Tim Orling
9561[Mars] Minimum required Java version is 1.7 for Eclipse Mars (4.5)normalMedium2.1.1Tim OrlingACCEPTED0.2
7819Support multi-image debuggingenhancementMedium2.2Tim OrlingNEW5
9562[Neon] Minimum required Java version is 1.8 for Eclipse Neon (4.6)normalMedium2.2Tim OrlingNEW0.2
 3       
Toaster default assignee
9418Support using existing OE setupsenhancementMedium2.3Toaster default assigneeNEW
 1       
Todor Minchev
9590Cannot update Zephyr project configenhancementMedium2.2Todor MinchevNEW
9591Zephyr project configuration should allow kernel and app to be in different folder hierachiesenhancementMedium2.2Todor MinchevNEW
9593Enable workspace folder to be changedenhancementMedium2.2Todor MinchevNEW
9570Need a simple way of configuring Zephyr development environment at start of docker sessionnormalMedium2.2 M1Todor MinchevNEW
9571Allow CROPS to install host tools in specified locationnormalMedium2.2 M1Todor MinchevNEW
 5       
Tom Zanussi
6156[crosstap] no trace message output on qemuarmnormalMedium2.2Tom ZanussiACCEPTED5
9531Need a proper way to fix mismatched arch generated with bare-bone kernel recipenormalMedium2.2Tom ZanussiNEW
5520poky-tiny enhancementsenhancementMedium2.2 M2Tom ZanussiNEW40
 3       
Tracy Graydon
6284Random package/image builder (fuzzy build)enhancementMedium2.2Tracy GraydonNEW4
6288YoctoBot: Send successful notices with links.enhancementMedium2.2Tracy GraydonNEW3
6469Host system profiler tool.enhancementMedium2.2Tracy GraydonNEW10
7568Create an image to run regular build tests for no-X11 caseenhancementMedium2.2Tracy GraydonNEW3
7695Automated QA tests for the autobuilderenhancementMedium2.2Tracy GraydonNEW5
7963Release process needs to generate correct toasterconf.json files for tar.gz releasesnormalMedium2.2Tracy GraydonNEW1
6287Release scripts for BSPs/images.enhancementMedium2.2 M1Tracy GraydonNEW5
7476Improve license manifest descriptionenhancementMedium2.2 M1Tracy GraydonNEW2
 8       
 
9075buildhistory-diff does not work if the build history is stored in a Git submodulenormalMedium2.2 NEEDINFONIR 04/17, 04/24, 05/012
 1       
Unassigned
6234Implement model for project owner / userenhancementMedium2.3UnassignedNEW2
 1       
Vaduva Alexandru
7067Integrate 'grsecurity' package inside meta-cglenhancementMedium2.1Vaduva AlexandruNEW2
 1       
John 'Warthog9' Hawley
6533uEFI Network booting should be default to last prioritynormalMediumA1 ReleaseJohn 'Warthog9' HawleyIN PROGRESS REVIEW
6719Gummiboot "Reboot Into Firmware Interface" does not worknormalMediumProduction ReleaseJohn 'Warthog9' HawleyIN PROGRESS REVIEW
9300AFTER POWER ON, LED(D1)ON BUT LED(D2)flickernormalMediumProduction ReleaseJohn 'Warthog9' HawleyNEEDINFO
 3       
Bill Randle
8656ptest - perl tests fail for genericx86-64 on NUC - 2.0.rc3normalMedium2.2Bill RandleNEW
9424systemd tmpfiles.d warnings (volatile, resolv.conf)minorMedium2.2 M1Bill RandleIN PROGRESS REVIEW
 2       

Other High Bugs

IDSummary (23 tasks) SeverityPMilestoneAssigneeStatusWhiteboardE
8647Script to analyse what areas a patch changes and what tests need runningenhancementHigh2.2Leonardo Sandoval GonzalezACCEPTED13
4078A method to validate the contents of changes to recipes, configuration files and classesenhancementHigh2.2 M1Michael HalsteadNEEDINFONIR 04/24, 05/015
4431Set up buildhistory-web for autobuilderenhancementHigh2.2 M1Michael HalsteadACCEPTED3
7518Build multiple machines in the same bitbake invocationenhancementHigh2.2 M1Richard PurdieNEW15
7583Gather and allow reporting all types of errors, not just task failuresenhancementHigh2.2 M1Aníbal LimónNEW5
7658patchwork: provide means of recording additional patch statusesenhancementHigh2.2 M1Michael HalsteadNEEDINFONIR 04/24, 05/014
8648Automatic testing of incoming patchesenhancementHigh2.2 M1Michael HalsteadNEEDINFONIR 04/24, 05/0110
8649Script to assemble patches for autobuilder testingenhancementHigh2.2 M1Michael HalsteadNEEDINFONIR 04/24, 05/0115
9112pseudo connection startup/reworkenhancementHigh2.2 M1SeebsNEW
9130Update OE patchwork instanceenhancementHigh2.2 M1Michael HalsteadNEW
9131Prelink breaks fork IFUNCmajorHigh2.2 M1Mark HatleIN PROGRESS IMPLEMENTATION10
9293bitbake: Add support for trigger event on errors like exceptionsenhancementHigh2.2 M1Aníbal LimónIN PROGRESS DESIGN
9298Autobuilder enable KVM on the cluster for x86, x86-64enhancementHigh2.2 M1Beth FlanaganNEW4.5
9340Improve tooling around BuildLog and SWAT processenhancementHigh2.2 M1Joshua LockIN PROGRESS IMPLEMENTATION5
9394bootstrap v2 License is not compatible with bitbake/toaster license.criticalHigh2.2 M1brian averyNEW
9457patchtest: security check on incoming patchesenhancementHigh2.2 M1Leonardo Sandoval GonzalezACCEPTED
9517Move to Bootstrap 3enhancementHigh2.2 M1Belen Barros PenaNEW
9559test reporting tool planenhancementHigh2.2 M1Benjamin EsquivelNEW
9567bitbake's FetchLatestVersion fail when running bitbake-selftestcriticalHigh2.2 M1Richard PurdieNEW
9581CVE-2016-2107, CVE-2016-2108, CVE-2016-2105, CVE-2016-2106, CVE-2016-2109, CVE-2016-2176majorHigh2.2 M1Jussi KukkonenIN PROGRESS REVIEW
9588Create a method for describing builds and desired output. aka a build descriptorenhancementHigh2.2 M1Randy WittNEW5
9592Add a mechanism for creating build appliance as a container imageenhancementHigh2.2 M1Randy WittNEW4
9383Move to LSB 5enhancementHigh2.2 M2Ross BurtonNEW3
 23       

Major or Critical

IDSummary (35 tasks) SeverityPMilestoneAssigneeStatusWhiteboardE
8931replaces field does not support version constrainsmajorUndecided0.3.2Alejandro del CastilloNEW
8946opkg install does not appear to fail on file overwritemajorUndecided0.4Alejandro del CastilloNEW
6882Can't log in to successfully built mipsel virtual imagemajorMedium1.6.4Khem RajACCEPTED
9473bind: CVE-2016-2088 (jethro)majorMedium2.0.2Jussi KukkonenNEW0.5
9462Boot and install from USB failed getting a xhci_hcd error after booting kernel panic is displayedmajorMedium2.1.1California SullivanACCEPTED3
9472[NO USB support ] Beaglebone black latest yoctomajorMedium+2.1.1Saul WoldACCEPTED
6683Produce a script to automate release preparation tasksmajorMedium2.2Michael HalsteadNEW3
7554Ownership issue in package contentsmajorMedium2.2LiRongQingACCEPTED
8078useradd.bbclass: useradd_preinst not run when rebuilding on second MACHINEmajorMedium+2.2Maxin B. JohnACCEPTED3
8576QemuRunner logging for qemu start failure does not log anything to the console in oe-selftestmajorMedium+2.2Jose Perez CNEW2
9394bootstrap v2 License is not compatible with bitbake/toaster license.criticalHigh2.2 M1brian averyNEW
9567bitbake's FetchLatestVersion fail when running bitbake-selftestcriticalHigh2.2 M1Richard PurdieNEW
9575Test SDK EXT failed on core-image-sato for MIPS architecturecriticalMedium+2.2 M1Robert YangNEW
7724useradd.bbclass users cannot be safely referred to by dependent recipes due to sstate-induced race with base-passwdmajorMedium2.2 M1Leonardo Sandoval GonzalezIN PROGRESS IMPLEMENTATIONTC needed7
8616arm64's multilib SDK is brokenmajorMedium+2.2 M1Chen QiIN PROGRESS REVIEW3
8879opkg-utils is built when build lib32-imagemajorMedium+2.2 M1Robert YangIN PROGRESS IMPLEMENTATION5
9064do_unpack does not wipe old source treemajorMedium+2.2 M1Markus LehtonenIN PROGRESS REVIEW1
9131Prelink breaks fork IFUNCmajorHigh2.2 M1Mark HatleIN PROGRESS IMPLEMENTATION10
9177Failed to install jethro eSDK image from AutobuildermajorMedium+2.2 M1Paul EggletonNEW1
9505SDKs no longer provide opkg packaging datamajorMedium+2.2 M1Paul EggletonIN PROGRESS REVIEW
9581CVE-2016-2107, CVE-2016-2108, CVE-2016-2105, CVE-2016-2106, CVE-2016-2109, CVE-2016-2176majorHigh2.2 M1Jussi KukkonenIN PROGRESS REVIEW
6927I2C Controller Intermittently Timeout and Lost ArbitrationmajorMedium+A4 ReleaseDavid AndersIN PROGRESS DESIGN COMPLETE
7719HDMI not working with TFP-401 DVI based devicesmajorMedium+A4 ReleaseDavid AndersACCEPTED
5331error play video via gstreamer with "mfw_isink"criticalMediumFutureOtavio SalvadorNEW
4155i.MX6: VPU plugins for GStreamer do not work with appsinkmajorMediumFutureOtavio SalvadorIN PROGRESS REVIEW
6806Smart failure when running bitbake over and overmajorMediumFutureRobert YangACCEPTED5
7945Toaster startup script assumes it's in a git repositorymajorMediumFutureToaster default assigneeNEW2
8391vncserver setup/tear down not concurrency safemajorMediumFuturebrian averyACCEPTED8
8893do_cleanall: Function failed: Network access disabled through BB_NO_NETWORKmajorMedium+FutureRobert YangIN PROGRESS IMPLEMENTATION5
7572SOURCE_DEBUG_ENABLE fails on .76 MinnowMaxmajorMediumProduction Release IN PROGRESS REVIEW
9372Ptest for acl hang because of lack of two user bin and daemoncriticalUndecided---Alexandru GeorgescuNEW
9373ptest for perl hangcriticalUndecided---Alexandru GeorgescuNEW
8947opkg conffile resolution cannot detect unmodified conffiles modified in upgraded packagemajorUndecided---Alejandro del CastilloNEW
9073When local path for src/gz is provided and temp directory is also provided opkg creates mutiple copies of debian packagesmajorUndecided---Alejandro del CastilloNEW
9348Opkg requires root privileges for all operationsmajorUndecided---Alejandro del CastilloNEW
 35       

1.4 & 1.5 Enhancements !(1.4.1, 1.4.2, 1.4.3, 1.5, 1.5.1, 1.5.2)

IDSummarySeverityPMilestoneAssigneeStatusWhiteboardE
 0       

1.6 Enhancement List !

IDSummarySeverityPMilestoneAssigneeStatusWhiteboardE
 0       

1.7 Enhancement List! (no Low's & Medium's )

IDSummary (155 tasks) SeverityPMilestoneAssigneeStatusWhiteboardE
2398make bitbake work using python 3.xenhancementMedium+2.2 M1Richard PurdieIN PROGRESS IMPLEMENTATION
3169Implement Shuku proposalenhancementMedium+2.2 M1Jussi KukkonenIN PROGRESS IMPLEMENTATION15
3433Create Interactive bitbake commandline modeenhancementMedium+2.2Richard PurdieNEW15
4078A method to validate the contents of changes to recipes, configuration files and classesenhancementHigh2.2 M1Michael HalsteadNEEDINFONIR 04/24, 05/015
4144Runtime performance testingenhancementMedium+2.2 M2Jose Perez CNEW2
4209Extend our developer experience to enable system and app development on Windows or MacOSenhancementMedium+2.2Tim OrlingNEWThis is a placeholder bug for Eclipse for non Linux platform bug, the estimate will be reflected in the blocking bugs25
4284Presenting information provided by the diffsigs toolenhancementMedium+FutureUnassignedNEW5
4431Set up buildhistory-web for autobuilderenhancementHigh2.2 M1Michael HalsteadACCEPTED3
4527create a Runtime performance test layer to enable runtime performance testsenhancementMedium+2.2 M2Jose Perez CNEW
4528boot time should be tracked for systemd and SysVinitenhancementMedium+2.2Jose Perez CNEW2
4634BitBake default 'dirs' in exec_func (${B}) causes build failuresenhancementMedium+2.2 M1Ross BurtonNEW5
5369Create test plan to do performance analysis of x32 runtimeenhancementMedium+2.2Jose Perez CNEW
5477Check for any performance degradations with gcc security flags enabledenhancementMedium+2.2Jose Perez CIN PROGRESS IMPLEMENTATION2
5478test build time performance degradations with gcc security flags enabledenhancementMedium+2.2Jose Perez CIN PROGRESS IMPLEMENTATION2
5534Bitbake resident server autoloading/unloadingenhancementMedium+2.2 M1Richard PurdieACCEPTED3
6296Add support for runtime performance tests to image_testsenhancementMedium+2.2Jose Perez CNEW2
6319Automated storage and graphing of build performance metricsenhancementMedium+2.2Benjamin EsquivelNEW5
6359Include QA tests for kernel-dev manual tasksenhancementMedium+2.2 M3Jose Perez CNEWNIR 04/1010
6362Runtime machine configurationenhancementMedium+2.2Saul WoldACCEPTED10
6428Improve the ability to isolate changes that have caused a rebuildenhancementMedium+2.2 M2Richard PurdieNEW5
6432Document an example SDK usage workflowenhancementMedium+2.2 M1Paul EggletonACCEPTED2
6437Document how to set up the Yocto Project for production workenhancementMedium+2.2 M1Paul EggletonACCEPTED2
6640Customise BitBake and layer versions in a projectenhancementMedium+2.3Belen Barros PenaNEWGUI design pending7
6707Add ptest for curlenhancementMedium+2.2 M3Ross BurtonNEW3
6803Comprehensive large file supportenhancementMedium+2.2 M2Ross BurtonNEW5
6862input subsystem testingenhancementMedium+2.2 M3Ross BurtonNEW5
6945kernel-dev: multiple kernel buildenhancementMedium+2.2 M1He ZheIN PROGRESS REVIEW4
7376oe-selftest doesn't run lib/oe/tests/*enhancementMedium+2.2Jose Perez CIN PROGRESS DESIGN3
7515Add CVE testing toolenhancementMedium+2.2Mariano LopezIN PROGRESS REVIEW10
7518Build multiple machines in the same bitbake invocationenhancementHigh2.2 M1Richard PurdieNEW15
7555make oe-init-build-env-memres default for 2.2enhancementMedium+2.2Richard PurdieNEW3
7561Port beaglebone BSP to use xf86-video-modesettingsenhancementMedium+2.2 M1Plauchu EdwinIN PROGRESS IMPLEMENTATION1
7583Gather and allow reporting all types of errors, not just task failuresenhancementHigh2.2 M1Aníbal LimónNEW5
7654patchwork: ensure superseded patches are marked as suchenhancementMedium+2.2 M1Jose LamegoIN PROGRESS IMPLEMENTATION2
7658patchwork: provide means of recording additional patch statusesenhancementHigh2.2 M1Michael HalsteadNEEDINFONIR 04/24, 05/014
7683Provide means of turning a recipe change into a bbappendenhancementMedium+2.2 M2Paul EggletonNEW4
7820Replace Hob with Toaster in EclipseenhancementMedium+2.2Tim OrlingIN PROGRESS IMPLEMENTATION10
7850Handle native and target test dependency binaries in build test and export testenhancementMedium+2.2 M1Mariano LopezIN PROGRESS DESIGN10
7981Set up procedure for layer index database upgradesenhancementMedium+2.2 M1Michael HalsteadIN PROGRESS REVIEW2
8132Implement deleting custom imagesenhancementMedium+2.2 M3Michael WoodNEWGUI design available4
8179It should be possible to disable kernel features using config fragmentsenhancementMedium+2.2 M3Bruce AshfieldIN PROGRESS IMPLEMENTATION10
8318Avoid unnecessary package feed churn due to packages rebuildingenhancementMedium+2.2Stephano CetolaACCEPTED4
8337Make opkg translatable (old issue #42)enhancementUndecided---Alejandro del CastilloNEW
8338ManpagesenhancementUndecided---Alejandro del CastilloNEW
8339Manpages (old issue #56)enhancementUndecided1.0Alejandro del CastilloNEW
8340libopkg needs a better error reporting mechanism (old issue #63)enhancementUndecided0.4Alejandro del CastilloNEW
8341Allow installation of a specified version of a package (old issue #76)enhancementUndecided0.3.2Alejandro del CastilloNEW
8343Downgrade to Prefer (old issue #111)enhancementUndecided0.4Alejandro del CastilloNEW
8345Install package(s) only after download of all needed packages. (old issue #116)enhancementUndecided0.4Alejandro del CastilloNEW
8346Check for package list update before downloading (old issue #117)enhancementUndecided1.0Alejandro del CastilloNEW
8347Review performance of algorithms using pkg_vec (old issue #120)enhancementUndecided1.0Alejandro del CastilloNEW
8349dist-upgrade feature (old issue #126)enhancementUndecided1.0Alejandro del CastilloNEW
8350Customisable uid/gid translation during installation (old issue #129)enhancementUndecided0.4Alejandro del CastilloNEW
8353Add multiple compression algorithms support (old issue #148)enhancementUndecided0.4Alejandro del CastilloNEW
8384Exported tests needs a test suiteenhancementMedium+2.2 M1Mariano LopezNEW2
8433Add test for package postinstsenhancementMedium+2.2Leonardo Sandoval GonzalezNEW4
8478Decoupling export test with Yocto build environmentenhancementMedium+2.2 M1Mariano LopezNEW5
8480Extendable structure for test controller to support kinds of image flash methods and communication methods with DUTenhancementMedium+2.2Aníbal LimónNEW7
8481Generate test tar balls for export testenhancementMedium+2.2 M1Mariano LopezIN PROGRESS REVIEW5
8482Support multi-nodes interoperability testingenhancementMedium+2.2jingwangNEW
8489Update DirectFB to git?enhancementMedium+2.2Jussi KukkonenNEW1
8493Automate manual BSP test casesenhancementMedium+2.2Leonardo Sandoval GonzalezNEW5
8505Add Bluetooth testing suiteenhancementMedium+2.2Leonardo Sandoval GonzalezNEW5
8506Add WiFi testing suiteenhancementMedium+2.2Leonardo Sandoval GonzalezNEW5
8507Add NFC testing suiteenhancementMedium+2.2Leonardo Sandoval GonzalezNEW5
8530runexported.py parameter support for: -m <machine arch>enhancementMedium+2.2 M1jingwangIN PROGRESS IMPLEMENTATION1
8531runexported.py parameter support for: -f <manifest>enhancementMedium+2.2 M1jingwangNEW
8532runexported.py parameter support for: -a <tag>enhancementMedium+2.2 M1Bill RandleACCEPTED1
8533runexported.py parameter support for: -x <xunit>enhancementMedium+2.2 M1jingwangNEW
8534need export manifest files to SDK package under /conf/test/ folders of every layerenhancementMedium+2.2 M1Bill RandleIN PROGRESS REVIEW0.5
8535export the test scripts under all layers' ./lib/oeqaenhancementMedium+2.2 M1Bill RandleIN PROGRESS REVIEW1
8536support un-extracted package (e.g. rpm) as one type of test binariesenhancementMedium+2.2 M1Mariano LopezIN PROGRESS REVIEW5
8537Feature request: new libopkg APIenhancementUndecided0.4Alejandro del CastilloNEW
8548Document best practises/style guide for selftest tests and update testsenhancementMedium+2.2 M1Ross BurtonNEW2
8554Support for self-contained "baremetal" CPU meta-layersenhancementMedium+2.2 M1Richard PurdieNEW3
8565Add global preinst/postinst hooks to opkgenhancementUndecided---Alejandro del CastilloNEW
8584Enable building API documentationenhancementMedium+2.2 M3Ross BurtonNEW10
8640Remove vala from oe-core?enhancementMedium+2.2 M1Jussi KukkonenACCEPTED2
8647Script to analyse what areas a patch changes and what tests need runningenhancementHigh2.2Leonardo Sandoval GonzalezACCEPTED13
8648Automatic testing of incoming patchesenhancementHigh2.2 M1Michael HalsteadNEEDINFONIR 04/24, 05/0110
8649Script to assemble patches for autobuilder testingenhancementHigh2.2 M1Michael HalsteadNEEDINFONIR 04/24, 05/0115
8657extensible SDK: improve handling for sanity checksenhancementMedium+2.2 M1Paul EggletonNEW1
8694Add support for multiple binaries in one testenhancementMedium+2.2 M1Mariano LopezIN PROGRESS IMPLEMENTATION5
8699offer a way to use sstate-object hashes as dependencies of builds/packagesenhancementMedium+2.2 M2Joshua LockACCEPTED4
8704patchwork: support history tracking of patch statusenhancementMedium+2.2 M1Jose LamegoIN PROGRESS REVIEW3
8714Patchwork frontend page for incoming patch testingenhancementMedium+2.2 M1Jose LamegoNEWGUI design pending6
8715Update patchwork / build status page on patch test build completionenhancementMedium+2.2 M1Jose LamegoACCEPTED2
8716Build summary page for incoming patch testingenhancementMedium+2.2 M1Leonardo Sandoval GonzalezNEWGUI design pending4
8717patchwork: keep build page up-to-date with important patch status changesenhancementMedium+2.2 M1Jose LamegoNEW2
8724Automate information collection for runtime errorsenhancementMedium+2.2 M1Bill RandleACCEPTED45
8755Remote signing of RPM packagesenhancementMedium+FutureMarkus LehtonenIN PROGRESS REVIEW
8761[RMC]: Handle machine specific kernel command line differencesenhancementMedium+2.2 M1Jianxun ZhangIN PROGRESS IMPLEMENTATION15
8773refactor yocto-kernel-cache common-pc / intel-common scc/cfg file to reduce delta & overlapenhancementMedium+2.2 M1California SullivanACCEPTED11
8851Add bashism checks for shell script functionsenhancementMedium+2.2 M3Ross BurtonIN PROGRESS IMPLEMENTATION5
8880Need better allarch multilib sanity or automated QA testsenhancementMedium+2.2 M1Robert YangNEW5
8938oe-selftest: refactor command line arguments so usage is simplerenhancementMedium+2.2 ACCEPTED3
8948Implement *.md5sums (or equivalent)enhancementUndecided---Alejandro del CastilloNEW
8962AUH: Add support for meta-intelenhancementMedium+2.2Aníbal LimónNEW3
8974Add eSDK benchmarkingenhancementMedium+2.2 M1Markus LehtonenNEW2
9004Produce container image providing extensible SDKenhancementMedium+2.2 M1Randy WittNEW4
9037Consider alternate methods for maintain Yocto releases after 1yrenhancementMedium+2.2 M1Richard PurdieNEW1
9088Extensible SDK add tests for devtoolenhancementMedium+2.2Aníbal LimónNEW3
9090extensible sdk test compatibility with sdkenhancementMedium+2.2Aníbal LimónNEW1
9112pseudo connection startup/reworkenhancementHigh2.2 M1SeebsNEW
9130Update OE patchwork instanceenhancementHigh2.2 M1Michael HalsteadNEW
9132Toaster integrate testing into AB/buildbotenhancementMedium+2.2 M1Aníbal LimónIN PROGRESS IMPLEMENTATION5
9222Create a notification styleenhancementMedium+Q1Jeff Osier-MixonNEW
9244patchtest-oe: Create tests to validate recipes, classes or config filesenhancementMedium+2.2 M1Leonardo Sandoval GonzalezACCEPTED
9255Allow rootfs tasks to run in parallel with rpmenhancementMedium+2.2 M1Richard PurdieNEW0.5
9261Can't distinguish between delayed and failed postinstenhancementMedium+2.2 M1Ross BurtonNEW3
9292Update Graphic recipes with candidate versions in planned Graphic Stack 2016Q1 ReleaseenhancementMedium+2.2 M1Jianxun ZhangACCEPTED0.1
9293bitbake: Add support for trigger event on errors like exceptionsenhancementHigh2.2 M1Aníbal LimónIN PROGRESS DESIGN
9298Autobuilder enable KVM on the cluster for x86, x86-64enhancementHigh2.2 M1Beth FlanaganNEW4.5
9299Enable Tracing boot and process times in testing imagesenhancementMedium+2.2 M2Aníbal LimónNEW5
9335[Autobuilder] Add support for display bitbake log errors in buildbot pageenhancementMedium+2.2 M1Beth FlanaganIN PROGRESS DESIGN4
9338Support building optimised Python (with profile-opt make target)enhancementMedium+2.2 M2Markus LehtonenNEW
9340Improve tooling around BuildLog and SWAT processenhancementHigh2.2 M1Joshua LockIN PROGRESS IMPLEMENTATION5
9361Failed to reconfigure a project in Eclipse with eSDKenhancementMedium+2.2 M2Paul EggletonNEW3
9377Enable automated build performance testing in AutobuilderenhancementMedium+2.2 M1Markus LehtonenNEW
9383Move to LSB 5enhancementHigh2.2 M2Ross BurtonNEW3
9387Extensible SDK: add image customisation functionalityenhancementMedium+2.2 M2Paul EggletonNEW5
9391refactor syslinux.bbclass, grub-efi.bbclass and gummiboot.bbclassenhancementMedium+2.2 M2Robert YangNEW10
9401patchtest: show assertion messages on summaryenhancementMedium+2.2 M1Leonardo Sandoval GonzalezACCEPTED1
9403patchtest-oe: show the solution on the assertion messageenhancementMedium+2.2 M1Leonardo Sandoval GonzalezACCEPTED1
9412Implement python 3 support for wicenhancementMedium+2.2 M2Ed BartoshIN PROGRESS REVIEW5
9413bmap-tools support for wicenhancementMedium+2.2 M2Ed BartoshIN PROGRESS REVIEW2
9414add support for bmap-toolsenhancementMedium+2.2 M1Ed BartoshIN PROGRESS REVIEW
9432Add test for exported test functionalityenhancementMedium+2.2 M1Mariano LopezNEW3
9439Verify that the REST API works with httpsenhancementMedium+2.2 M1Elliot SmithIN PROGRESS REVIEW1
9448Add mechanism for running image level QA checksenhancementMedium+2.2 M2Ross BurtonNEW1
9449[meta-swupd] Add libarchive backend to swupd-server to improve runtime of do_swupd_updateenhancementMedium+2.2 M1Joshua LockNEW5
9450Add automated runtime tests that use the musl libc rather than glibcenhancementMedium+2.2 M1Beth FlanaganNEW2
9454improve on why a recipe is builtenhancementMedium+2.2 M1Robert YangNEW10
9457patchtest: security check on incoming patchesenhancementHigh2.2 M1Leonardo Sandoval GonzalezACCEPTED
9460Provide a way to automate testing of meta-mingw and meta-darwin layers.enhancementMedium+2.2 M2Beth FlanaganNEW3
9466enhance kernel configuration audit to include reasons for missing configs, and required config checkingenhancementMedium+2.2 M2Bruce AshfieldIN PROGRESS DESIGN COMPLETE7
9481Add example to "5.23. Debugging With the GNU Project Debugger (GDB) Remotely"enhancementMedium+2.2 M1Scott RifenbarkNEW
9493Support dummy/empty bundlesenhancementMedium+2.2 M1Joshua LockIN PROGRESS IMPLEMENTATION1
9502Add a way to build container images using oe-coreenhancementMedium+2.2 M1Randy WittNEW3
9515update-rcd class should add build dependencies if requiredenhancementMedium+2.2 M2Mariano LopezNEW1
9517Move to Bootstrap 3enhancementHigh2.2 M1Belen Barros PenaNEW
9519Consolidate used API into it's own viewenhancementMedium+2.2 M2Michael WoodNEW
9527Implement initial support for a stateless OSenhancementMedium+2.2 M1Joshua LockNEW10
9537recipetool: support node.js code outside of npmenhancementMedium+2.2 M1Paul EggletonNEW
9538Review common security hardening flags and expand security_flags.incenhancementMedium+2.2 M2Joshua LockNEW10
9556The EFI bootloaders should deploy startup.nsh for wicenhancementMedium+2.2 M2Ed BartoshNEW
9559test reporting tool planenhancementHigh2.2 M1Benjamin EsquivelNEW
9563yocto-kernel script should use argparse instead of optparse libraryenhancementMedium+2.2 M1 ACCEPTED
9564yocto-layer script should use argparse instead of optparse libraryenhancementMedium+2.2 M1 ACCEPTED
9576Extensible SDK test output needs to include preparing_build_system.log on failureenhancementMedium+2.2 M1Leonardo Sandoval GonzalezIN PROGRESS REVIEW
9588Create a method for describing builds and desired output. aka a build descriptorenhancementHigh2.2 M1Randy WittNEW5
9589Create a script for consuming a "build descriptor"enhancementMedium+2.2 M1Randy WittNEW5.34
9592Add a mechanism for creating build appliance as a container imageenhancementHigh2.2 M1Randy WittNEW4
9596Build "minimal" extensible SDK installers instead of "full" onesenhancementUndecided---Beth FlanaganNEW
9599Reduce bundle overheads by not depending on os-core when generating bundle sysrootsenhancementMedium+2.2 M1Joshua LockNEW3
 155       

NEEDINFO

IDSummary (15 tasks) RequesterAssigneeStatusSeverityPMilestone
9434Running testimage test_parselogs failed getting the following error message failed to retrieve link info, disabling eDP on Minnowboard Max 32 and 64Francisco PedrazaCalifornia SullivanNEEDINFOnormalUndecided2.1 M4
8044Stop building lsb-qt3 imagesBeth FlanaganBeth FlanaganNEEDINFOnormalMedium2.2
8809gcc 5.2: armv5te: vsprintf appends unwanted ' ' spacesAndreas FenkartAndreas FenkartNEEDINFOnormalMedium2.2
9075buildhistory-diff does not work if the build history is stored in a Git submodule  NEEDINFOnormalMedium2.2
9352External modules fail to build when kernel is reused from sstateMartin JansaMartin JansaNEEDINFOnormalMedium+2.2
7658patchwork: provide means of recording additional patch statusesPaul EggletonMichael HalsteadNEEDINFOenhancementHigh2.2 M1
8648Automatic testing of incoming patchesPaul EggletonMichael HalsteadNEEDINFOenhancementHigh2.2 M1
8649Script to assemble patches for autobuilder testingPaul EggletonMichael HalsteadNEEDINFOenhancementHigh2.2 M1
9280[Test Case 1059], when running testimage several test cases for test smart failed on WIC imageFrancisco PedrazaJose Perez CNEEDINFOnormalMedium2.2 M1
9513Failed to install sdk_ext for i686Yi ZhaoRandy WittNEEDINFOnormalMedium+2.2 M1
4078A method to validate the contents of changes to recipes, configuration files and classesMark HatleMichael HalsteadNEEDINFOenhancementHigh2.2 M1
6142we need general documentation on Systemd vs SysV related issuesScott RifenbarkRoss BurtonNEEDINFOenhancementMedium2.2 M4
9300AFTER POWER ON, LED(D1)ON BUT LED(D2)flickerkeralJohn 'Warthog9' HawleyNEEDINFOnormalMediumProduction Release
9392When running testimage test_syslog_startup_config failed getting test log string not found output grep: /var/log/test error messageFrancisco PedrazaFrancisco PedrazaNEEDINFOnormalUndecided---
9405running testimage dmesg test_parseLogs failedFrancisco PedrazaSaul WoldNEEDINFOnormalUndecided---
 15      

Old Milestone

IDSummary (750 tasks) RequesterAssigneeStatusSeverityPMilestone
8931replaces field does not support version constrainsAlejandro del CastilloAlejandro del CastilloNEWmajorUndecided0.3.2
8351double entries in the info file (old issue #142)Alejandro del CastilloAlejandro del CastilloNEWnormalUndecided0.3.2
9456opkg-build does not return error when Version is missing from control fileThomas De SchampheleireAlejandro del CastilloNEWnormalUndecided0.3.2
9557opkg fails to parse feeds if package name isn't the first item in a package sectionJosh PrewittAlejandro del CastilloNEWnormalUndecided0.3.2
8362[internalsolv] With circular dependencies, all installed packages are marked as autoinstalled (old issue #167)Alejandro del CastilloAlejandro del CastilloNEWminorUndecided0.3.2
8166[libsolv] libsolv's upgrade will not automatically remove orphaned dependantsEric YuAlejandro del CastilloNEWenhancementMedium0.3.2
8601[internalsolv] entry of a package which is not installed and it does not let other package get installed on which it is dependentjatin jainAlejandro del CastilloNEWnormalUndecided0.3.2
8341Allow installation of a specified version of a package (old issue #76)Alejandro del CastilloAlejandro del CastilloNEWenhancementUndecided0.3.2
8537Feature request: new libopkg APIJinAlejandro del CastilloNEWenhancementUndecided0.4
8350Customisable uid/gid translation during installation (old issue #129)Alejandro del CastilloAlejandro del CastilloNEWenhancementUndecided0.4
8352Needs a more detailed error message if an upgarde is not possible (old issue #143)Alejandro del CastilloAlejandro del CastilloNEWnormalUndecided0.4
8353Add multiple compression algorithms support (old issue #148)Alejandro del CastilloAlejandro del CastilloNEWenhancementUndecided0.4
8946opkg install does not appear to fail on file overwriteRichard TollertonAlejandro del CastilloNEWmajorUndecided0.4
8355Not possible to build static opkg 0.3 (old issue #158)Alejandro del CastilloAlejandro del CastilloNEWnormalUndecided0.4
8356Opkg flag always returns successAlejandro del CastilloAlejandro del CastilloNEWminorUndecided0.4
8357Add comman line option to skip package signature check (old issue #161)Alejandro del CastilloAlejandro del CastilloNEWnormalUndecided0.4
8359[internalsolv] --force-removal-of-dependent-packages does not remove packages depending on the removed package (old issue #163)Alejandro del CastilloAlejandro del CastilloNEWnormalUndecided0.4
8360[internalsolv] Packages fail to install when Recommends can't be installed (old issue #165)Alejandro del CastilloAlejandro del CastilloNEWnormalUndecided0.4
8340libopkg needs a better error reporting mechanism (old issue #63)Alejandro del CastilloAlejandro del CastilloNEWenhancementUndecided0.4
8342[internalsolv] Opkg fails to attempt all satisfying dependencies after installing the first one fails (old issue #85)Alejandro del CastilloAlejandro del CastilloNEWminorUndecided0.4
8343Downgrade to Prefer (old issue #111)Alejandro del CastilloAlejandro del CastilloNEWenhancementUndecided0.4
8344update-alternatives: Support change of link path during upgrade (old issue #113)Alejandro del CastilloAlejandro del CastilloNEWnormalUndecided0.4
8345Install package(s) only after download of all needed packages. (old issue #116)Alejandro del CastilloAlejandro del CastilloNEWenhancementUndecided0.4
8349dist-upgrade feature (old issue #126)Alejandro del CastilloAlejandro del CastilloNEWenhancementUndecided1.0
8163opkg don't resume big upgrades (old issue #17)Alejandro del CastilloAlejandro del CastilloNEWnormalMedium1.0
8336Problem when upgrading a package which depends on a new package (old issue #32)Alejandro del CastilloAlejandro del CastilloNEWminorUndecided1.0
8339Manpages (old issue #56)Alejandro del CastilloAlejandro del CastilloNEWenhancementUndecided1.0
8346Check for package list update before downloading (old issue #117)Alejandro del CastilloAlejandro del CastilloNEWenhancementUndecided1.0
8347Review performance of algorithms using pkg_vec (old issue #120)Alejandro del CastilloAlejandro del CastilloNEWenhancementUndecided1.0
8939Lots of [host-user-contaminated] warningPhil ReidChen QiACCEPTEDnormalMedium1.4.5
6882Can't log in to successfully built mipsel virtual imageCharles MacfarlaneKhem RajACCEPTEDmajorMedium1.6.4
7469SDL package cannot be found on OpenSUSE 13.2Mihail StanciuJuro BystrickyIN PROGRESS REVIEWnormalMedium+1.6.4
7641CVE-2014-9365 python: failure to validate certificates in the HTTP client with TLS (PEP 476)Sona SarmadiArmin KusterACCEPTEDnormalMedium+1.7.4
8487PTEST image does not install on hdd on 1.8.1Lucian MusatArmin KusterIN PROGRESS IMPLEMENTATIONnormalMedium+1.7.4
9100uclibc image fails to buildArmin KusterArmin KusterNEWnormalLow1.8.2
8667populate_sdk task fails when Debian packaging used in FIDOMartin TownsendAníbal LimónACCEPTEDnormalMedium1.8.2
9158Cannot build openjdk-8 on fido due to missing autotools patchHenry BruceRoss BurtonNEWnormalMedium1.8.2
8613udev-extraconf: automount does not work with systemd >= 219Frederico CadeteAlejandro HernandezNEWnormalMedium1.8.2
7814Weston fails to build with core-image-weston on imx6qsabresdThomas McGuireOtavio SalvadorNEWnormalLow1.8.2
9349Jethro build fails for core-image-x11 with package_debDimitrij GesterAníbal LimónIN PROGRESS DESIGNnormalMedium2.0.2
8092Implementation of the function glXChooseFBConfig in the libGL.so does not match OpenGL documentationIvan NOtavio SalvadorWaitForUpstreamnormalMedium+2.0.2
8877WebKitGTK+ Security AdvisoriesArmin KusterytaoNEWnormalMedium+2.0.2
9353yocto-bsp: script using different kernel than the one given when creating bsp  IN PROGRESS REVIEWnormalMedium+2.0.2
9357nativesdk-python3 does not buildJuro BystrickyJuro BystrickyIN PROGRESS REVIEWnormalMedium2.0.2
8961sudoku-savant does not get downloaded correctlySaul WoldCristina AguridaNEWnormalMedium2.0.2
9473bind: CVE-2016-2088 (jethro)Jussi KukkonenJussi KukkonenNEWmajorMedium2.0.2
9579[jethro] perf build failure with linux-yocto_3.19Frederico CadeteTom ZanussiACCEPTEDnormalMedium+2.0.2
9483"Testing URL" hangs foreverJinJoshua LockIN PROGRESS REVIEWminorMedium2.0.2
7991qemuppc bootup failure with oe-core toolchain (with systemd)Yang ShiMark HatleIN PROGRESS IMPLEMENTATIONnormalMedium+2.0.2
8028Garbage in SDK manifest filePaul EggletonMariano LopezIN PROGRESS REVIEWnormalMedium+2.0.2
7067Integrate 'grsecurity' package inside meta-cglVaduva AlexandruVaduva AlexandruNEWenhancementMedium2.1
9406dmesg test_parseLogs failed corei7-64 on NUC error BAR 14 and 15Francisco PedrazaCalifornia SullivanACCEPTEDnormalMedium2.1 M4
9264Remove mentions of oprofileRoss BurtonScott RifenbarkIN PROGRESS REVIEWnormalMedium2.1 M4
9267test_parselogs (oeqa.runtime.parselogs.ParseLogsTest) failed on NUC 6i5SYH, firmware load for i915/skl_guc_ver4.bin failedFrancisco PedrazaCalifornia SullivanACCEPTEDnormalMedium2.1 M4
8810Some strace ptests faildaweidengkeACCEPTEDnormalMedium2.1 M4
8812Some util-linux ptests faildaweiChen QiACCEPTEDnormalMedium2.1 M4
9434Running testimage test_parselogs failed getting the following error message failed to retrieve link info, disabling eDP on Minnowboard Max 32 and 64Francisco PedrazaCalifornia SullivanNEEDINFOnormalUndecided2.1 M4
8834pTest - attr test fail ln -s fAlexandru GeorgescuChen QiACCEPTEDnormalMedium2.1 M4
9176Default u-boot script is not able boot from eMMC on BeagleBone BlackJussi LaakoJussi LaakoNEWnormalMedium2.1 M4
9053pTest - util-linux (NUC) failed tested on NUC 5425WYK for YP 2.1_M2.rc1Francisco PedrazaChen QiACCEPTEDnormalMedium2.1 M4
9055pTest - acl (NUC) failed tested on NUC 5425WYK for YP 2.1_M2.rc1Francisco PedrazaChen QiACCEPTEDnormalMedium2.1 M4
9347drivers/gpio/gpio-pca953x.c in Kernel 4.x does not support the PCAL9535 IC on Galileo Gen 2 boardsYONG LIYONG LINEWnormalMedium2.1 M4
9105[MARS] Cannot install eclipse-poky pluginTeodor MadanTim OrlingIN PROGRESS IMPLEMENTATIONnormalMedium+2.1.1
9462Boot and install from USB failed getting a xhci_hcd error after booting kernel panic is displayedFrancisco PedrazaCalifornia SullivanACCEPTEDmajorMedium2.1.1
9520test_parselogs failed on udevd[342] inotify_add_watch /dev/loop when running test imageFrancisco PedrazaSaul WoldNEWnormalMedium+2.1.1
9472[NO USB support ] Beaglebone black latest yoctohiimsSaul WoldACCEPTEDmajorMedium+2.1.1
9561[Mars] Minimum required Java version is 1.7 for Eclipse Mars (4.5)Tim OrlingTim OrlingACCEPTEDnormalMedium2.1.1
9362Failed to run and debug a project to qemux86 in EclipseValentin Hanganbrian averyNEWnormalMedium+2.1.1
9302Failed to start qemu with toolchain sysrootValentin Hanganbrian averyNEWnormalMedium+2.1.1
8870uclibc fails to build occasionallyRoss BurtonKhem RajNEWnormalMedium2.2
9213Enable thumb for ARM buildsMartin JansaRoss BurtonNEWnormalMedium2.2
8087eglibc patch bugJoshua RogersJose Perez CNEWnormalMedium2.2
6155Merge testimage-auto into testimagePaul EggletonPaul EggletonNEWenhancementLow2.2
7557distrodata/distro_check should use BPNBeth FlanaganAníbal LimónNEWenhancementMedium2.2
5351genericx86 auth.err getty[615]: tcgetattr: Input/outputStoicescu CornelJianxun ZhangNEWnormalMedium2.2
8433Add test for package postinstsRoss BurtonLeonardo Sandoval GonzalezNEWenhancementMedium+2.2
9099Create sparse images with wicJoshua LockEd BartoshIN PROGRESS REVIEWenhancementMedium2.2
9503Add a way to add docker metadata to container imagesRandy WittRandy WittNEWenhancementMedium2.2
9550Resolve string formatting issues in statJoshua LockPlauchu EdwinNEWnormalMedium2.2
1598Add remote layer supportRichard PurdiePaul EggletonACCEPTEDenhancementLow2.2
9350As a developer, I want a global variable exist for choosing the default SSL/TLS provider.Ming LiuJussi KukkonenNEWenhancementMedium2.2
9217Many unsolveable QA warnings from build-deps and file-rdepsMartin JansaRobert YangNEWnormalMedium2.2
6156[crosstap] no trace message output on qemuarmYi ZhaoTom ZanussiACCEPTEDnormalMedium2.2
7837site.conf not acting as implied by docs.brian averyRichard PurdieNEWnormalLow2.2
5359[Yocto 1.5] su - USER -c 'COMMAND' env variable issueDavide SoldanChen QiNEWnormalMedium2.2
8938oe-selftest: refactor command line arguments so usage is simplerLeonardo Sandoval Gonzalez ACCEPTEDenhancementMedium+2.2
8727fetcher: should not log errors but pass them for handlingAníbal LimónAníbal LimónNEWnormalMedium2.2
9504knotty doesn't delete lines if the number of output lines is larger than then number of lines in the terminalRandy WittRandy WittNEWnormalMedium2.2
9551Resolve string formatting issues in unzipJoshua LockPlauchu EdwinNEWnormalMedium2.2
7142cmake.bbclass fails when rebuilding after MACHINE changesRoss BurtonPaul EggletonNEWnormalMedium2.2
1882Verify and document package feed creation for each package management backendJoshua Lock - DisabledJoshua LockACCEPTEDnormalMedium2.2
9070Add test that locales are workingRoss BurtonLeonardo Sandoval GonzalezNEWenhancementMedium2.2
8874Create a new Yocto recipe from an existing Eclipse project using devtoolJose LamegoJose LamegoNEWnormalMedium2.2
9220buildhistory should track native recipesRoss BurtonPaul EggletonNEWenhancementMedium2.2
8131All builds page "Errors"/"Warnings" filters doesn't workCristina AguridaMichael WoodACCEPTEDnormalMedium2.2
7846devshell cannot be kept open across rebuildsIgor StoppaRichard PurdieNEWenhancementMedium2.2
7568Create an image to run regular build tests for no-X11 caseTracy GraydonTracy GraydonNEWenhancementMedium2.2
5369Create test plan to do performance analysis of x32 runtimeSaul WoldJose Perez CNEWenhancementMedium+2.2
8440Toaster has some issues when showing builds that fail at the build request stageBelen Barros PenaElliot SmithIN PROGRESS REVIEWnormalMedium+2.2
8730separate code generating python manifest file from manifest information and improve the manifest generation Alejandro HernandezNEWnormalMedium2.2
9552Resolve string formatting issues in zipJoshua LockPlauchu EdwinNEWnormalMedium2.2
1985matchbox-panel doesn't build battery status appletPaul EggletonJussi KukkonenNEWenhancementMedium2.2
7174AUH can't tell when MACHINE is set with = in local.conf and thus multi-machine build won't workPaul EggletonAníbal LimónACCEPTEDnormalLow2.2
1989Default module selections need attentionPaul EggletonBruce AshfieldIN PROGRESS IMPLEMENTATIONminorMedium+2.2
9352External modules fail to build when kernel is reused from sstateMartin JansaMartin JansaNEEDINFOnormalMedium+2.2
9404Smart will remove RECOMMENDS during a remove commandJate SujjavanichRobert YangNEWnormalMedium2.2
5383verbose do_fetch (12% 107MB 96.2KB/s 2:11:52 ETA)Keller EricPaul EggletonIN PROGRESS IMPLEMENTATIONenhancementLow2.2
8732Branch Support for BuildhistoryRudolf J StreifPaul EggletonNEWenhancementMedium2.2
9553INHIBIT_PACKAGE_STRIP docs need to be expandedRoss BurtonScott RifenbarkNEWnormalMedium2.2
7202Test for linux-dummyPaul EggletonBenjamin EsquivelIN PROGRESS REVIEWenhancementMedium2.2
9233As a developer, I want initramfs bundled kernel could be installed into rootfsMing LiuMing LiuIN PROGRESS REVIEWnormalMedium2.2
9518Rationalise the directory structure generated by ToasterBelen Barros PenaEd BartoshNEWenhancementMedium2.2
7852bitbake-layers layerindex-fetch doesn't respect branch (-b|--branch) optionTrevor WoernerPaul EggletonIN PROGRESS DESIGNnormalMedium2.2
5395Nativesdk postinstalls directory issues.David NyströmRichard PurdieNEWnormalMedium2.2
9568bbexample recipe fails to build unless PARALLEL_MAKE is disabledHenry BruceJoshua LockNEWnormalMedium2.2
8735AUH: Use tinfoil instead of parse the recipe itselfAníbal LimónAníbal LimónNEWenhancementMedium2.2
9107Update spdx.bbclass to work with FOSSology 3.0.0 releaseMaxin B. JohnMaxin B. JohnACCEPTEDnormalMedium2.2
8656ptest - perl tests fail for genericx86-64 on NUC - 2.0.rc3Alexandru GeorgescuBill RandleNEWnormalMedium2.2
7240Add declaration of image output file globs for ToasterPaul EggletonPaul EggletonNEWenhancementMedium2.2
2415connman doesn't provide a 3g configuration utilityDarren HartRoss BurtonNEWenhancementMedium2.2
8556Toaster: bitbake variables image_fstypes not being passed to build proceesAlexandru RomanElliot SmithNEWnormalMedium2.2
9356piglit needs to be updated to run newer testsJianxun ZhangJussi KukkonenNEWnormalMedium2.2
9235oe-init-build-env: to receive an argument/variable for appending to local.confBenjamin EsquivelEd BartoshIN PROGRESS REVIEWenhancementMedium2.2
6238delete projects/builds through the toaster UIDavid ReynaBelen Barros PenaNEWenhancementMedium2.2
5399Sharing PR server between builders with different metadataMartin JansaLeonardo Sandoval GonzalezNEWenhancementMedium2.2
8454archiver.bbclass does not create subfolder per licensePascal BachRoss BurtonNEWnormalMedium2.2
8740LTP and LSB NG caseslixin.fnstRobert YangIN PROGRESS REVIEWnormalMedium2.2
9110Move some oe-pkgdata-util logic into lib/oeRoss BurtonRoss BurtonNEWenhancementMedium2.2
7254PATCHRESOLVE's devshell opens up multiple new terminalsAlejandro HernandezAlejandro HernandezIN PROGRESS DESIGNminorMedium2.2
2646Windows switching failureAlexandru PalalauJussi KukkonenIN PROGRESS IMPLEMENTATIONnormalMedium2.2
8560xserver fails with xf86OpenConsole: Cannot open /dev/tty0 (No such file or directory)brian averyRandy WittNEWnormalMedium2.2
8146ptest - some test cases are failing for aclAjay KumarJose Perez CNEWnormalMedium2.2
6258svn fetch uses last changed revision instead of revision on a svn branch.Balagopal AmbalakkatRichard PurdieACCEPTEDnormalLow2.2
7877Depending on the error found, inconsistent line reported.Igor StoppaRichard PurdieNEWnormalMedium2.2
9407bitbake reports log_check warning without stating in which log/recipe the problem occurredHeinz Wrobel NEWnormalMedium2.2
5427Extend and tidy up layer sanity checkingPaul EggletonChen QiIN PROGRESS REVIEWenhancementMedium2.2
8742nativesdk-coreutils: a lot of warningsRobert YangdengkeIN PROGRESS REVIEWnormalMedium2.2
9115Added packages filter seems to show the wrong package listBelen Barros PenaJoshua LockACCEPTEDnormalMedium2.2
9461upm PACKACGECONFIG fails to enable either python or nodejsAlejandro HernandezAlejandro HernandezACCEPTEDnormalMedium2.2
3043runqemu: Investigate and implement (if possible) a local firewall sanity checkSaul WoldAníbal LimónNEWenhancementLow2.2
6839Handle dev package with no main package more gracefullyPaul EggletonPaul EggletonNEWenhancementLow2.2
8563Improve detection and presentation of build artifactsBelen Barros PenaElliot SmithNEWenhancementMedium2.2
9360devtool: update-recipe ignores SRC_URI_appendPaul EggletonPaul EggletonNEWnormalMedium2.2
8886Toaster thinks do_shared_workdir is a shared state taskBelen Barros PenaEd BartoshNEWnormalMedium2.2
8156lib/bb/fetch2/svn.py should support latest_versionstring()Alexander KanavinAníbal LimónNEWenhancementMedium2.2
6278runqemu without /etc/resolv.confVolkerRoss BurtonNEWenhancementMedium2.2
9523openssl: dangling libcrypto.a symlinkPatrick OhlyJussi KukkonenNEWnormalMedium2.2
7879Depending on the name of a recipe, the build succeeds or fails.Igor StoppaRichard PurdieNEWnormalMedium2.2
8456Add feature to add layers to Toaster from external sourceMichael WoodMichael WoodNEWenhancementMedium2.2
8952Changes to the revision of an imported layer are not savedBelen Barros PenaMichael WoodNEWnormalMedium2.2
9119ptest fails tracker bug (Cont.)Stephen K JolleyRoss BurtonNEWnormalMedium2.2
7637devtool: add: interactive recipe creationPaul EggletonPaul EggletonNEWenhancementMedium2.2
7267unable to switch SPI SS to active-high in a board fileKevin SheltonCalifornia SullivanACCEPTEDnormalMedium2.2
8158INCOMPATIBLE_LICENSES has unexpected results with GNU librariesJussi KukkonenBeth FlanaganNEWnormalMedium2.2
6284Random package/image builder (fuzzy build)Beth FlanaganTracy GraydonNEWenhancementMedium2.2
9524Drop libxsettings-clientRoss BurtonJussi KukkonenNEWenhancementMedium2.2
78833G/4G mobile hardware supportCristian IorgaStephen K JolleyACCEPTEDenhancementMedium2.2
7617devtool: detect need to re-run configurePaul EggletonPaul EggletonNEWenhancementMedium2.2
8471ptest - some valgrind ptests fail on 2.0.rc1Alexandru GeorgescuMaxin B. JohnACCEPTEDnormalMedium2.2
8953Toaster ignores the subdirectory when cloning imported layersBelen Barros PenaMichael WoodNEWnormalMedium2.2
8248Toaster recipe page: missing empty stateAlexandru RomanElliot SmithNEWnormalLow2.2
7298packagegroups are not rebuilt when rdependency pkg name changesClemens LangRichard PurdieNEWnormalMedium2.2
3276PulseAudio isn't testedRoss BurtonLeonardo Sandoval GonzalezNEWenhancementMedium2.2
8161Can't use "\" characters in SRC_URI entries - not even escapedAndrei GherzanRichard PurdieNEWnormalMedium2.2
9525Make install prompt available on all consolesCalifornia SullivanCalifornia SullivanNEWenhancementMedium2.2
7900Dmesg error failed to setup card detect gpio on Minnow MaxCristina AguridaCalifornia SullivanACCEPTEDnormalLow2.2
7636recipetool: basic spec file conversionPaul EggletonPaul EggletonNEWenhancementMedium2.2
8480Extendable structure for test controller to support kinds of image flash methods and communication methods with DUT Aníbal LimónNEWenhancementMedium+2.2
8962AUH: Add support for meta-intelAníbal LimónAníbal LimónNEWenhancementMedium+2.2
8275Toaster: Suitable message and build box does not appear in build tab for a project with no buildsAlexandru RomanMichael WoodNEWnormalMedium2.2
9124Location of kernel sources is incorrectGeoffroy Van CutsemTom ZanussiIN PROGRESS REVIEWnormalMedium+2.2
9562[Neon] Minimum required Java version is 1.8 for Eclipse Neon (4.6)Tim OrlingTim OrlingNEWnormalMedium2.2
8678Testing coverage of non-poky Toaster setupBelen Barros PenaLibertadNEWenhancementMedium2.2
7314Audit all recipes for proper CONFFILES assignmentRandy MacLeodRandy MacLeodNEWenhancementMedium2.2
9365Remove xtscal in preference of xinput-calibratorSaul WoldJussi KukkonenNEWenhancementMedium2.2
6288YoctoBot: Send successful notices with links.Beth FlanaganTracy GraydonNEWenhancementMedium2.2
9574[devtool] can't update gdbSaul WoldPaul EggletonNEWnormalMedium2.2
8278devtool: update compressed patches gracefullyMarkus LehtonenPaul EggletonNEWnormalMedium2.2
9514Builds of software recipes should not show a "New custom image" buttonBelen Barros PenaElliot SmithNEWnormalMedium2.2
8688busybox syslog not update-alternatives awareSteffen SledzRoss BurtonNEWnormalMedium2.2
7336buildhistory-diff reports recipe-wide changes per-subpackageRoss BurtonPaul EggletonNEWenhancementMedium2.2
3388perf: enable man pages for basic 'help' functionalityTom ZanussiRandy MacLeodACCEPTEDnormalMedium2.2
9367Extensible SDK: avoid double invocation of bitbake on installPaul EggletonPaul EggletonNEWenhancementMedium2.2
8363Assess which non-ToasterTable pages need refactoring and howElliot SmithElliot SmithNEWenhancementMedium2.2
6296Add support for runtime performance tests to image_testsAlexandru GeorgescuJose Perez CNEWenhancementMedium+2.2
8576QemuRunner logging for qemu start failure does not log anything to the console in oe-selftestPaul EggletonJose Perez CNEWmajorMedium+2.2
8482Support multi-nodes interoperability testing jingwangNEWenhancementMedium+2.2
9129Enhance Test Suite scanning and executionAlex FrancoLeonardo Sandoval GonzalezNEWenhancementMedium2.2
7376oe-selftest doesn't run lib/oe/tests/*Ross BurtonJose Perez CIN PROGRESS DESIGNenhancementMedium+2.2
8380multiple pointer devices in qemuJussi KukkonenJussi KukkonenACCEPTEDnormalMedium2.2
6319Automated storage and graphing of build performance metricsRichard PurdieBenjamin EsquivelNEWenhancementMedium+2.2
7958Implement shallow git clone functionalityPaul EggletonChristopher LarsonIN PROGRESS IMPLEMENTATIONenhancementMedium2.2
8302sstate_create_package fails to chmod fileSaul WoldRoss BurtonNEWnormalMedium2.2
8779update-alternatives.bbclass automatic renaming doesn't happen in sysrootsDenys DmytriyenkoMark HatleNEWnormalMedium2.2
7670Proposal: make TOPDIR or BUILDDIR available to the devshellChristopher LarsonChristopher LarsonIN PROGRESS REVIEWenhancementMedium2.2
3433Create Interactive bitbake commandline modeSaul WoldRichard PurdieNEWenhancementMedium+2.2
9259The rpm database costs lots of disk space after install a packageYi ZhaoRoss BurtonNEWnormalMedium2.2
9479Extensible SDK breaks if python-dependent items added to TOOLCHAIN_HOST_TASKPaul EggletonPaul EggletonNEWnormalMedium2.2
9530Arrows in directory structure do not expand directoriesBelen Barros PenaElliot SmithNEWnormalMedium2.2
8582Error message not in log fileJuro BystrickyPaul EggletonNEWnormalMedium2.2
7960Feature Request: to enable poky to support building multilib native commandsOng Boon LeongRichard PurdieNEWenhancementMedium2.2
9578INHIBIT_PACKAGE_STRIP breaks -dbgRay KinsellaStephano CetolaNEWnormalMedium2.2
8314warn when ALTERNATIVE_PRIORITY are the sameRobert YangChen QiNEWenhancementMedium2.2
5477Check for any performance degradations with gcc security flags enabledAlexandru GeorgescuJose Perez CIN PROGRESS IMPLEMENTATIONenhancementMedium+2.2
7671Feature request: integrate task-level exports supportChristopher LarsonChristopher LarsonNEWenhancementMedium2.2
8703PATCHTOOL = git, triggers error user.name/user.email unsetgunnarxPaul EggletonIN PROGRESS IMPLEMENTATIONnormalMedium2.2
8173Wrong dynamic loader because of missing -mfloat-abi=hard in LDFLAGS (in scons)TasskjappRichard PurdieNEWnormalMedium2.2
6362Runtime machine configurationDarren HartSaul WoldACCEPTEDenhancementMedium+2.2
9480linux-yocto: make it work with arm big endianRobert YangBruce AshfieldACCEPTEDenhancementMedium2.2
9531Need a proper way to fix mismatched arch generated with bare-bone kernel recipeJianxun ZhangTom ZanussiNEWnormalMedium2.2
7963Release process needs to generate correct toasterconf.json files for tar.gz releasesAlexandru DamianTracy GraydonNEWnormalMedium2.2
9417Bring clang/llvm compiler infrastructure to OE-CoreKhem RajKhem RajNEWenhancementMedium2.2
8586multilib build includes 32bit connman without good reasonJussi KukkonenJussi KukkonenIN PROGRESS REVIEWnormalMedium2.2
7968empty page states for no information in the databaseAlexandru DamianBelen Barros PenaNEWnormalMedium+2.2
8489Update DirectFB to git?Ross BurtonJussi KukkonenNEWenhancementMedium+2.2
8318Avoid unnecessary package feed churn due to packages rebuildingPaul EggletonStephano CetolaACCEPTEDenhancementMedium+2.2
8789extensible SDK: command disable devtool subcommands based on capabilitiesPaul EggletonRandy WittNEWenhancementMedium2.2
5478test build time performance degradations with gcc security flags enabledAlexandru GeorgescuJose Perez CIN PROGRESS IMPLEMENTATIONenhancementMedium+2.2
7436kbd build raceRoss BurtonRobert YangIN PROGRESS DESIGNnormalMedium2.2
3488Enable Mesa's llvmpipe?Alexandru GeorgescuRoss BurtonACCEPTEDenhancementMedium2.2
6926Create yocto-bsp testsuiteTom ZanussiMarkus LehtonenNEWenhancementMedium2.2
6370QA/oe-selftest: add test suite for recipe testingStoicescu CornelDaniel IstrateIN PROGRESS REVIEWenhancementMedium2.2
7972lsof needed by start/stop toaster script but not needed on system to run Yocto builds.brian averybrian averyNEWnormalMedium2.2
9580Missing package dependency in quick start guide for FedoraHenry BruceScott RifenbarkNEWnormalMedium2.2
8493Automate manual BSP test casesAlexandru GeorgescuLeonardo Sandoval GonzalezNEWenhancementMedium+2.2
8321yocto-bsp script should use argparse instead of optparse libraryLeonardo Sandoval Gonzalez ACCEPTEDenhancementMedium2.2
8805Detect and warn people naming functions something_remove_somethingRoss BurtonRichard PurdieNEWnormalMedium2.2
9133Eclipse plugin testing integrate into ABAníbal LimónAníbal LimónNEWnormalMedium+2.2
7459Implement the use of host USB devices on Linux for qemu machinesCristian IorgaSaul WoldNEWenhancementMedium2.2
3898kernel menuconfig unusableTrevor WoernerJuro BystrickyWaitForUpstreamnormalMedium2.2
8402LAYERDIR is used as-is in BBFILE_PATTERN, when it should be regex escapedChristopher LarsonChristopher LarsonNEWminorMedium2.2
8188The variable history is missing the layer nameBelen Barros PenaElliot SmithNEWnormalMedium2.2
6372Feature request: recipe hook for source tree preparationChristopher LarsonChristopher LarsonNEWenhancementMedium2.2
8593The head files of ncurses installing into sysroot seems different in multiple times compilationYunming ShiRoss BurtonNEWnormalMedium2.2
7973stopping toaster kills ALL django apps running on the machine.brian averyEd BartoshNEWnormalMedium2.2
8497Continuous Toaster exploratory testingAlexandru GeorgescuLibertadNEWenhancementMedium2.2
9002Move directory scan logic out of toaster.bbclass into buildinfohelperElliot SmithElliot SmithNEWenhancementLow2.2
8325devtool modify could handle patch failure more usefullyPaul EggletonPaul EggletonNEWnormalMedium2.2
8806Refactor localhostbecontrollerMichael WoodEd BartoshNEWnormalMedium2.2
9140Eclipse plugin testing enable work on other distrosAníbal LimónLeonardo Sandoval GonzalezNEWenhancementMedium2.2
9380The manual does not mention automatically added version restrictions Scott RifenbarkNEWnormalMedium2.2
8430inaccurate 'du' usage in Image::_get_rootfs_sizeJean-François DagenaisRoss BurtonACCEPTEDenhancementMedium2.2
9271[Test Case 1059] test_parselogs (oeqa.runtime.parselogs.ParseLogsTest)Francisco PedrazaCalifornia SullivanACCEPTEDminorMedium2.2
8189Variable history shows full paths to files inside the /bitbake directoryBelen Barros Penabrian averyNEWnormalMedium2.2
6378libfakekey patch to allow shift-ed version of symbol not already in keymapFinnJussi KukkonenNEWnormalMedium2.2
8190The 'set in file' filters in the BitBake variables table seem to return the wrong informationBelen Barros PenaElliot SmithNEWnormalMedium2.2
9485Fix typeaheads for Bootstrap 3Elliot SmithElliot SmithNEWnormalMedium2.2
8594devtool: provide easy means of moving a recipe in the workspace to a real layerPaul EggletonPaul EggletonNEWenhancementMedium2.2
9582Replace toasterconf.json with Django fixturesBelen Barros PenaMichael WoodNEWnormalUndecided2.2
8502Store BSPs Firmware and HW info for BSP test casesAlexandru GeorgescuFrancisco PedrazaNEWenhancementMedium2.2
8326Build time counts the time a build spent queuedBelen Barros PenaElliot SmithNEWminorLow2.2
8809gcc 5.2: armv5te: vsprintf appends unwanted ' ' spacesAndreas FenkartAndreas FenkartNEEDINFOnormalMedium2.2
5546Optimise away meta-oe X init mechanismPaul EggletonPaul EggletonACCEPTEDenhancementMedium2.2
7695Automated QA tests for the autobuilderBeth FlanaganTracy GraydonNEWenhancementMedium2.2
4143Support real-time logging when using bitbake interactivelyJason WesselRichard PurdieNEWenhancementMedium2.2
6972breaks build of software using cmake packages due to hardcoded pathsMatthieu GallienPaul EggletonNEWnormalMedium2.2
9272BBCLASSEXTEND="cross" overrides do_install() Richard PurdieNEWnormalMedium2.2
9486security_flags.inc has many exception packages compiled without -PIE security flagElena ReshetovaAlexander KanavinNEWnormalMedium2.2
8504Identify and add if needed BSP test cases specific to meta-intelAlexandru GeorgescuBenjamin EsquivelNEWenhancementMedium2.2
8332Add a broken recipe for testing purposesCristian IorgaDaniel IstrateNEWenhancementMedium2.2
7982Have an option to exclude some packages from the SDK generationLaszlo PappRichard PurdieNEWenhancementLow2.2
7710devtool: deploy-target: interact with target packaging where availablePaul EggletonChen QiIN PROGRESS DESIGNenhancementMedium2.2
6996cyclic symlinks in rootfs cause user-space qemu to infinite loop on startupAlexandre TuleuAníbal LimónNEWnormalMedium2.2
9277Improve archiver testingMariano LopezMariano LopezNEWenhancementLow2.2
8192python3.4.3 os.fork and os.waitpid Alejandro HernandezACCEPTEDminorMedium+2.2
9075buildhistory-diff does not work if the build history is stored in a Git submodule  NEEDINFOnormalMedium2.2
9488security_flags.inc does not use format string vulnerability prevention flagsElena ReshetovaJoshua LockIN PROGRESS REVIEWnormalMedium2.2
9585verify/fix eventreplaybrian averyEd BartoshNEWnormalMedium2.2
6546Supporting use of local layers in ToasterBelen Barros PenaBelen Barros PenaNEWenhancementLow2.2
8505Add Bluetooth testing suiteAlexandru GeorgescuLeonardo Sandoval GonzalezNEWenhancementMedium+2.2
5654Add EFI to qemux86 and qemux86-64Jason WesselLeonardo Sandoval GonzalezWaitForUpstreamenhancementMedium2.2
7490AUH: Add testing support - master bugAníbal LimónAníbal LimónNEWenhancementMedium2.2
4209Extend our developer experience to enable system and app development on Windows or MacOSDave StewartTim OrlingNEWenhancementMedium+2.2
7010systemd-serialgetty cannot create a serial-getty@.service that is not enabledJoe BaloughRoss BurtonNEWnormalMedium2.2
9279Issue with PREFERRED_PROVIDER interaction with overridesChristopher LarsonRichard PurdieNEWnormalMedium2.2
9076The detection of the image type is incorrectly matching a wrong typeIgor StoppaEd BartoshIN PROGRESS IMPLEMENTATIONnormalMedium2.2
9489security_flags.inc has exception packages compiled without any -fstack-protectorElena ReshetovaAlexander KanavinNEWnormalMedium2.2
9539Resolve string formatting issues in busyboxJoshua LockJoshua LockNEWnormalMedium2.2
8506Add WiFi testing suiteAlexandru GeorgescuLeonardo Sandoval GonzalezNEWenhancementMedium+2.2
8828pTest - lttng-tools tests fail for 2.1_M1.rc1Alexandru GeorgescuRichard PurdieNEWnormalMedium2.2
7985Variable typing support within BitBakePaul EggletonRichard PurdieNEWenhancementMedium2.2
7494AUH: Parallelize running bitbake inside AUH scriptAníbal LimónAníbal LimónNEWenhancementMedium2.2
4389kernel: Remove "make scripts" requirement for module building from SDK/on targetBruce AshfieldRichard PurdieACCEPTEDenhancementMedium2.2
8200Add acl to default DISTRO_FEATURES?Ross BurtonPlauchu EdwinNEWenhancementMedium2.2
9078When changing SDKIMAGE_FEATURES to "dev-pkgs", some -dbg packages are still installedMark HatleRoss BurtonNEWenhancementLow2.2
9540Resolve string formatting issues in console-toolsJoshua LockJoshua LockNEWnormalMedium2.2
9435Toaster throws an exception for images that have files on the / levelbrian averyElliot SmithNEWnormalLow2.2
95874.1.x: gpio-pca953x.c fails to compile without CONFIG_ACPIGeorge McCollisterSaul WoldNEWnormalMedium2.2
6607Auto-detect client locale and use for date formattingPaul EggletonBelen Barros PenaNEWenhancementLow2.2
8507Add NFC testing suiteAlexandru GeorgescuLeonardo Sandoval GonzalezNEWenhancementMedium+2.2
9023Improve the content of the "other artifacts" sectionBelen Barros PenaElliot SmithNEWenhancementMedium2.2
5866Reproducible builds: identical binariesMartin JansaRandy WittNEWenhancementMedium2.2
9171Consider limiting the scope of depchains to runtime depsChristopher LarsonRoss BurtonNEWnormalMedium2.2
4420No init scripts in core-image-sato with systemd if 'sysvinit' is not in DISTRO_FEATURESRoss BurtonChen QiIN PROGRESS IMPLEMENTATIONenhancementMedium2.2
8210Should be able to restart a crashed vnc serverRoss BurtonTracy GraydonNEWnormalMedium+2.2
6469Host system profiler tool.Beth FlanaganTracy GraydonNEWenhancementMedium2.2
9080Autobuilder/oe-selftest: Have a way to specify a which oe-self tests get run on a forced AB jobBenjamin EsquivelLeonardo Sandoval GonzalezNEWnormalMedium2.2
9541Resolve string formatting issues in cmakeJoshua LockJoshua LockNEWnormalMedium2.2
8606Evaluate using connman-ui instead of connman-gnomeJussi KukkonenJussi KukkonenACCEPTEDenhancementLow2.2
6016CrossTap has issues on running scheduler script against qemuppcAlexandra SaftaChen QiNEWnormalMedium2.2
9173extensible sdk: Create a way that sstate will automatically be removed after setsceneRandy WittRandy WittNEWenhancementMedium2.2
7733Add an option to execute task for target and all of its dependent targetsPaul EggletonPaul EggletonNEWenhancementLow2.2
7502Show image information if rootfs files are generatedBelen Barros PenaMichael WoodNEWnormalMedium2.2
7054OprofileUI needs to be updated to reflect new oprofile functionalityMihail StanciuRoss BurtonACCEPTEDnormalMedium2.2
8222Elide dependency from -dev package on main package if there are no shared libraries in itPaul EggletonPaul EggletonNEWenhancementLow2.2
9542Resolve string formatting issues in expectJoshua LockJoshua LockNEWnormalMedium2.2
8612Add a locked sigs mode allowing locked task to rerunPaul EggletonRichard PurdieNEWenhancementLow2.2
6626Add an example for debugging software with the corresponding -dbg packageLaszlo PappPaul EggletonNEWnormalMedium2.2
8840Failure to build 32 bit eSDK on a 64 bit hostJuro BystrickyPaul EggletonNEWenhancementMedium2.2
8034typeahead search cneeds words to indicate it is constrained to the added layers.brian averyBelen Barros PenaNEWnormalMedium2.2
6020should libmad be replaced with libmpg123 as the default mp3 decoder?Cristian IorgaAlexander KanavinNEWenhancementMedium2.2
9175Remove os.chdir from fetch/unpack logicRoss BurtonRichard PurdieNEWenhancementMedium2.2
7744Improve messaging in empty states when Toaster does not have any layer informationBelen Barros PenaBelen Barros PenaNEWenhancementMedium2.2
7515Add CVE testing toolRoss BurtonMariano LopezIN PROGRESS REVIEWenhancementMedium+2.2
4528boot time should be tracked for systemd and SysVinitStoicescu CornelJose Perez CNEWenhancementMedium+2.2
9494Custom images created from the build history pages fail to buildBelen Barros PenaElliot SmithNEWnormalMedium2.2
9543Resolve string formatting issues in gccJoshua LockJoshua LockNEWnormalMedium2.2
9590Cannot update Zephyr project configHenry BruceTodor MinchevNEWenhancementMedium2.2
9202[Test Case 898] Piglit 3D testing NUC (6i5SYH) s getting stuck when running script.Francisco PedrazaCalifornia SullivanWaitForUpstreamnormalMedium2.2
8037External link to recipe file links to non-existing page when recipe information comes from a buildBelen Barros PenaDavid ReynaIN PROGRESS IMPLEMENTATIONnormalMedium+2.2
7792Layer compatible branches expansionPaul EggletonPaul EggletonNEWenhancementMedium2.2
7800systemd.bbclass doesn't check for services in systemd/user/ directoryPau Espin PedrolRoss BurtonNEWenhancementMedium2.2
8242Builds started from Toaster no longer show the 'queued' or 'checking out layers' stagesBelen Barros PenaElliot SmithNEWnormalLow2.2
9544Resolve string formatting issues in gettextJoshua LockJoshua LockNEWnormalMedium2.2
9591Zephyr project configuration should allow kernel and app to be in different folder hierachiesHenry BruceTodor MinchevNEWenhancementMedium2.2
8044Stop building lsb-qt3 imagesBeth FlanaganBeth FlanaganNEEDINFOnormalMedium2.2
6077piglit depends on libx11Otavio SalvadorJussi KukkonenACCEPTEDenhancementMedium2.2
7526add test for checking if fontcache is created inside an imageAlexandru GeorgescuJose Perez CNEWenhancementMedium2.2
4827runqemu shouldn't hard-code machine knowledgeRoss BurtonRobert YangACCEPTEDenhancementMedium2.2
7096Document how to use initramfs featuresPaul EggletonBruce AshfieldIN PROGRESS DESIGNenhancementMedium2.2
9288depexp does not show bitbake errorsGary ThomasRoss BurtonNEWnormalMedium2.2
9085Build QA Warnings: add a test for unlisted dependenciesBenjamin EsquivelLeonardo Sandoval GonzalezNEWnormalMedium2.2
9497systemd usersPatrick OhlyStephano CetolaIN PROGRESS DESIGNnormalMedium2.2
9545Resolve string formatting issues in kexec-toolsJoshua LockJoshua LockNEWnormalMedium2.2
6660Compare sstate packages within SDK publishing toolPaul EggletonChen QiACCEPTEDenhancementMedium2.2
8857Display number of search / filter results consistently across tablesBelen Barros PenaElliot SmithNEWnormalLow2.2
9205Add functionality to the formfactor to check for keyboard and/or touchscreenSaul WoldJianxun ZhangIN PROGRESS REVIEWenhancementMedium2.2
8051Importing layer fails silently if the layer name already existsBelen Barros PenaMichael WoodNEWnormalMedium2.2
6120perf top command does not work on QemuPPCCatalin ScrieciuRobert YangACCEPTEDnormalMedium2.2
9184Cannot delete layer from toaster databaseHenry BruceMichael WoodNEWenhancementMedium2.2
6128Incorrect wildcard unpack behaviour in fetcherPaul EggletonPaul EggletonNEWnormalMedium2.2
7819Support multi-image debuggingTodor MinchevTim OrlingNEWenhancementMedium2.2
5057Conflict when building SDK for image containing dropbear and openssh-sftp-serverIlovetogetspamedPaul EggletonACCEPTEDnormalMedium2.2
8918Change the way we handle queued buildsBelen Barros PenaEd BartoshNEWnormalMedium2.2
9088Extensible SDK add tests for devtoolAníbal LimónAníbal LimónNEWenhancementMedium+2.2
9498Progress bar not behaving correctly on mysqlMichael WoodElliot SmithNEWnormalMedium2.2
9546Resolve string formatting issues in leafpad (or its replacement)Joshua LockAníbal LimónNEWnormalMedium2.2
9593Enable workspace folder to be changedHenry BruceTodor MinchevNEWenhancementMedium2.2
6661devtool: add ability to submit changes for reviewPaul EggletonPaul EggletonNEWenhancementMedium2.2
8858We should keep sorting state in our tablesBelen Barros PenaElliot SmithNEWnormalLow2.2
9207Need to fix prelink to iterate mulitlibsRichard PurdieRoss BurtonNEWnormalMedium2.2
8064ptest fails tracker bugAlexandru GeorgescuRoss BurtonNEWnormalMedium2.2
8072Document using Build Appliance using Virtual BoxJuro BystrickyJuro BystrickyIN PROGRESS DESIGNenhancementMedium2.2
6129Local directories unpack to a different location than local filesPaul EggletonPaul EggletonNEWnormalMedium2.2
7820Replace Hob with Toaster in EclipseTodor MinchevTim OrlingIN PROGRESS IMPLEMENTATIONenhancementMedium+2.2
5280For tested hosts, we should use a wild card or other translations to group compatible sstate-cache (and other items)Mark HatleRichard PurdieNEWenhancementMedium2.2
9090extensible sdk test compatibility with sdkAníbal LimónAníbal LimónNEWenhancementMedium+2.2
9547Resolve string formatting issues in libuserJoshua LockAníbal LimónNEWnormalMedium2.2
9061git fetcher inconsistency for working with PREMIRRORS.Alexander KanevskiyRichard PurdieNEWnormalMedium2.2
8859Provide a way of specifying the default sort direction in ToasterTableBelen Barros PenaElliot SmithNEWnormalLow2.2
9208createrepo fails to correctly update the repodata, image generation then failsRichard PurdieMark HatleNEWnormalMedium2.2
8860The 'clear search' icon in ToasterTable tables should clear any applied filterBelen Barros PenaElliot SmithNEWnormalLow2.2
9211base.bbclass: insufficient error handling for LIC_FILES_CHKSUMPatrick OhlyAníbal LimónNEWnormalMedium2.2
8074Graphic display using Virtual Box differs from VMwareJuro BystrickyJuro BystrickyIN PROGRESS REVIEWnormalMedium2.2
6132Have persistent log data (/var/log)Mark HatleChen QiIN PROGRESS REVIEWenhancementMedium2.2
7823Convert Eclipse projects to Yocto recipes with devtoolTodor MinchevJose LamegoIN PROGRESS DESIGNenhancementMedium2.2
7554Ownership issue in package contentsMario Domenech GoulartLiRongQingACCEPTEDmajorMedium2.2
5319Need a test to verify firstboot postinst script orderMark HatleJose Perez CNEWnormalMedium+2.2
8719Ensure bootable images can be supported by wic for all reference BSPsPaul EggletonEd BartoshIN PROGRESS DESIGNenhancementMedium2.2
9294Error Reporting Tool: Add a 'solutions' relationship to the error entriesBenjamin EsquivelMariano LopezNEWenhancementMedium2.2
9500In multitarget builds, Toaster shows software recipes in the list of imagesBelen Barros PenaElliot SmithNEWnormalMedium2.2
9548Resolve string formatting issues in ltpJoshua LockAníbal LimónNEWnormalMedium2.2
8643GTK+3 depends on libepoxy which depends on eglJussi KukkonenJussi KukkonenACCEPTEDnormalMedium2.2
824Usability: Improve RRECOMMENDS warning messages for -dbg packagesMark HatlePaul EggletonACCEPTEDenhancementLow2.2
6683Produce a script to automate release preparation tasksBelen Barros PenaMichael HalsteadNEWmajorMedium2.2
8865The project "updated" field shows the last time a project was saved, not its last activityElliot SmithEd BartoshNEWminorLow2.2
9212rework oe-core's handling of python and sysrootsAlexander KanavinAlexander KanavinNEWnormalMedium2.2
8078useradd.bbclass: useradd_preinst not run when rebuilding on second MACHINERichard TollertonMaxin B. JohnACCEPTEDmajorMedium+2.2
9395Cleanly support unicode throughout ToasterJoshua LockElliot SmithNEWenhancementMedium2.2
7555make oe-init-build-env-memres default for 2.2Benjamin EsquivelRichard PurdieNEWenhancementMedium+2.2
5322Global DNS fallback mechanism not present in poky distroCristian IorgaRoss BurtonACCEPTEDenhancementMedium2.2
8928extensible SDK - add a way to prepare the sdk for offline usageRandy WittRandy WittNEWenhancementMedium2.2
8721We are not validating machine inputBelen Barros PenaMichael WoodNEWminorLow2.2
9297Toaster: Simplify building extensible SDKHenry BruceJoshua LockNEWenhancementMedium2.2
9549Resolve string formatting issues in makedevsJoshua LockPlauchu EdwinNEWnormalMedium2.2
8647Script to analyse what areas a patch changes and what tests need runningPaul EggletonLeonardo Sandoval GonzalezACCEPTEDenhancementHigh2.2
1018runqemu script has bugs with the audio optionScott GarmanSaul WoldNEWnormalLow2.2
6700systemd's resolved conflicts with connmanRoss BurtonRoss BurtonNEWenhancementMedium2.2
8536support un-extracted package (e.g. rpm) as one type of test binaries Mariano LopezIN PROGRESS REVIEWenhancementMedium+2.2 M1
9064do_unpack does not wipe old source treeRoss BurtonMarkus LehtonenIN PROGRESS REVIEWmajorMedium+2.2 M1
9397[Autobuilder] - public WIC buildset artifactsAlexandru GeorgescuBeth FlanaganNEWnormalMedium+2.2 M1
8724Automate information collection for runtime errorsAlexandru GeorgescuBill RandleACCEPTEDenhancementMedium+2.2 M1
8648Automatic testing of incoming patchesPaul EggletonMichael HalsteadNEEDINFOenhancementHigh2.2 M1
9401patchtest: show assertion messages on summaryLeonardo Sandoval GonzalezLeonardo Sandoval GonzalezACCEPTEDenhancementMedium+2.2 M1
7561Port beaglebone BSP to use xf86-video-modesettingsRoss BurtonPlauchu EdwinIN PROGRESS IMPLEMENTATIONenhancementMedium+2.2 M1
8649Script to assemble patches for autobuilder testingPaul EggletonMichael HalsteadNEEDINFOenhancementHigh2.2 M1
9452[meta-swupd] update to latest swupd and adapt to changesJoshua LockJoshua LockNEWnormalMedium+2.2 M1
9599Reduce bundle overheads by not depending on os-core when generating bundle sysrootsJoshua LockJoshua LockNEWenhancementMedium+2.2 M1
8548Document best practises/style guide for selftest tests and update testsRoss BurtonRoss BurtonNEWenhancementMedium+2.2 M1
9351Issues using bitbake with externalsrc and gitCliff BrakeMarkus LehtonenNEWnormalMedium+2.2 M1
9403patchtest-oe: show the solution on the assertion messageLeonardo Sandoval GonzalezLeonardo Sandoval GonzalezACCEPTEDenhancementMedium+2.2 M1
9104ffmpeg libraries are missing -dbg packagingGary ThomasRoss BurtonNEWnormalMedium+2.2 M1
9505SDKs no longer provide opkg packaging dataDenys DmytriyenkoPaul EggletonIN PROGRESS REVIEWmajorMedium+2.2 M1
8650RRS: track ptest-enabled and potentially ptest-enabled statusPaul EggletonMariano LopezACCEPTEDenhancementMedium2.2 M1
9454improve on why a recipe is builtRobert YangRobert YangNEWenhancementMedium+2.2 M1
8554Support for self-contained "baremetal" CPU meta-layersJuro BystrickyRichard PurdieNEWenhancementMedium+2.2 M1
9224[meta-swupd] Try to speed up update generation by parallelising calls to swupd_make_packJoshua LockJoshua LockNEWenhancementMedium2.2 M1
7850Handle native and target test dependency binaries in build test and export test Mariano LopezIN PROGRESS DESIGNenhancementMedium+2.2 M1
9567bitbake's FetchLatestVersion fail when running bitbake-selftestLeonardo Sandoval GonzalezRichard PurdieNEWcriticalHigh2.2 M1
8443Builds that failed at the build request stage need a custom dashboardBelen Barros PenaElliot SmithIN PROGRESS IMPLEMENTATIONnormalMedium+2.2 M1
8943add a function hook that would process upstream and recipe versionsAlexander KanavinPlauchu EdwinNEWenhancementMedium2.2 M1
9506bitbake-layers: show-layers throws exception when can't find layer in bblayers.conf  IN PROGRESS DESIGNnormalMedium+2.2 M1
8652meta/recipes-devtools/ruby/ uses --disable-versioned-paths, but no such option exists Alejandro HernandezNEWminorLow2.2 M1
9455When I try to make a new project toaster cries "Fields missing: projectversion"Phlip BalisterMichael WoodIN PROGRESS IMPLEMENTATIONnormalMedium+2.2 M1
8653Validate OLDEST_KERNELPaul EggletonPaul EggletonIN PROGRESS IMPLEMENTATIONenhancementLow2.2 M1
2398make bitbake work using python 3.xKhem RajRichard PurdieIN PROGRESS IMPLEMENTATIONenhancementMedium+2.2 M1
8555Reading shlibs providers sometimes failsJussi KukkonenRoss BurtonNEWnormalMedium+2.2 M1
8879opkg-utils is built when build lib32-imageRobert YangRobert YangIN PROGRESS IMPLEMENTATIONmajorMedium+2.2 M1
8133RRS should handle upstream repositories without version tagsAlexander KanavinPlauchu EdwinIN PROGRESS DESIGNenhancementMedium2.2 M1
7583Gather and allow reporting all types of errors, not just task failuresPaul EggletonAníbal LimónNEWenhancementHigh2.2 M1
9507Misleading error message when conf/bblayers has problemsGeoffroy Van CutsemMarkus LehtonenNEWnormalMedium+2.2 M1
9554Add section for on-target debuggingRoss BurtonRoss BurtonNEWnormalMedium+2.2 M1
9555Create Toaster Docker containerBelen Barros Penabrian averyNEWnormalMedium+2.2 M1
9457patchtest: security check on incoming patchesLeonardo Sandoval GonzalezLeonardo Sandoval GonzalezACCEPTEDenhancementHigh2.2 M1
8880Need better allarch multilib sanity or automated QA testsRobert YangRobert YangNEWenhancementMedium+2.2 M1
8142avahi daemon fails to start on systemd while testing core-image-satoAlex FrancoAníbal LimónACCEPTEDnormalMedium+2.2 M1
7855Show blacklist information in layer indexPaul EggletonLeonardo Sandoval GonzalezIN PROGRESS REVIEWenhancementMedium2.2 M1
9569Add extract package function to the package managersMariano LopezMariano LopezNEWenhancementMedium2.2 M1
9508cross-localedef-native_2.22 fails to build on aarch64 hostTristan Van BerkomRoss BurtonIN PROGRESS REVIEWnormalMedium+2.2 M1
9112pseudo connection startup/reworkRichard PurdieSeebsNEWenhancementHigh2.2 M1
8657extensible SDK: improve handling for sanity checksPaul EggletonPaul EggletonNEWenhancementMedium+2.2 M1
9570Need a simple way of configuring Zephyr development environment at start of docker sessionHenry BruceTodor MinchevNEWnormalMedium2.2 M1
9242Relocate segments in native binaries when restoring from sstateRoss BurtonRoss BurtonNEWnormalMedium+2.2 M1
9408create-pull-request: auto push the branch if not presentRobert YangRobert YangNEWenhancementMedium2.2 M1
7610[Multilib] Can't install 64bit packages to 32bit rootfsWenzong.FanRobert YangACCEPTEDenhancementMedium2.2 M1
9571Allow CROPS to install host tools in specified locationHenry BruceTodor MinchevNEWnormalMedium2.2 M1
8743configme --allnoconfig breaks defconfig generated with kconfig / make savedefconfigAndreas FenkartBruce AshfieldIN PROGRESS IMPLEMENTATIONnormalMedium2.2 M1
9559test reporting tool planBenjamin EsquivelBenjamin EsquivelNEWenhancementHigh2.2 M1
8668lttng-tools ptest output confuses QA analysisRoss BurtondengkeIN PROGRESS REVIEWnormalMedium+2.2 M1
3169Implement Shuku proposalRoss BurtonJussi KukkonenIN PROGRESS IMPLEMENTATIONenhancementMedium+2.2 M1
9244patchtest-oe: Create tests to validate recipes, classes or config filesAlex FrancoLeonardo Sandoval GonzalezACCEPTEDenhancementMedium+2.2 M1
9409create-pull-request: add the ability to read env varRobert YangRobert YangNEWenhancementMedium2.2 M1
9572sudoku-savant tarball not found when SDK testing on core-image-satoLeonardo Sandoval GonzalezLeonardo Sandoval GonzalezACCEPTEDnormalMedium+2.2 M1
8748qemu86-64 with corei7-64 did not support gcc optimization level 3 '-O3' very wellHongxu JiaAníbal LimónNEWnormalMedium+2.2 M1
8273openjade-native doesn't remove from sysroot correctlyRoss BurtonRoss BurtonNEWnormalMedium+2.2 M1
8760Autobuilder additional task log availabilityBenjamin EsquivelBeth FlanaganNEWnormalMedium2.2 M1
9120The patch file is not applied to linux-yocto by yocto-kernel add patch commandYi ZhaoLeonardo Sandoval GonzalezIN PROGRESS REVIEWnormalMedium2.2 M1
9512insane.bbclass: package_qa_check_license -> do_qa_populate_licRobert YangRobert YangIN PROGRESS IMPLEMENTATIONnormalMedium2.2 M1
9249patchwork: test that CVE patches contain the proper formattingLeonardo Sandoval GonzalezLeonardo Sandoval GonzalezACCEPTEDnormalMedium+2.2 M1
6287Release scripts for BSPs/images.Beth FlanaganTracy GraydonNEWenhancementMedium2.2 M1
9410create-pull-request: automatically add the subject when there is only one patchRobert YangRobert YangNEWenhancementMedium2.2 M1
9573openssh, subversion and ghostscript URLs fail on do_checkuri testLeonardo Sandoval GonzalezLeonardo Sandoval GonzalezACCEPTEDnormalMedium+2.2 M1
8478Decoupling export test with Yocto build environment Mariano LopezNEWenhancementMedium+2.2 M1
8761[RMC]: Handle machine specific kernel command line differencesSaul WoldJianxun ZhangIN PROGRESS IMPLEMENTATIONenhancementMedium+2.2 M1
9513Failed to install sdk_ext for i686Yi ZhaoRandy WittNEEDINFOnormalMedium+2.2 M1
9251Need flowchart style documentation showing progress of tasks and what they touch in a setscene vs non setscene setting.brian averyRichard PurdieNEWenhancementMedium2.2 M1
8162patchwork: clear out the superseded and already merged patchesPaul EggletonMichael HalsteadNEWenhancementMedium2.2 M1
9474epiphany doesn't work on ARMGary ThomasRobert YangIN PROGRESS REVIEWnormalMedium+2.2 M1
9527Implement initial support for a stateless OSJoshua LockJoshua LockNEWenhancementMedium+2.2 M1
8570problems with gdk-pixbuf and pango loading on multilibJussi KukkonenRobert YangNEWnormalMedium+2.2 M1
7909RRS: Track patches and Upstream-Status informationSaul WoldPlauchu EdwinNEWenhancementMedium2.2 M1
8481Generate test tar balls for export test Mariano LopezIN PROGRESS REVIEWenhancementMedium+2.2 M1
8771test_smart_channel_add (oeqa.runtime.smart.SmartRepoTest) failed in AutobuilderMaxin B. JohnAníbal LimónIN PROGRESS DESIGNnormalMedium+2.2 M1
9563yocto-kernel script should use argparse instead of optparse library  ACCEPTEDenhancementMedium+2.2 M1
7654patchwork: ensure superseded patches are marked as suchPaul EggletonJose LamegoIN PROGRESS IMPLEMENTATIONenhancementMedium+2.2 M1
9255Allow rootfs tasks to run in parallel with rpmSteven WalterRichard PurdieNEWenhancementMedium+2.2 M1
9528dbus-test: installs libtool wrapper for binariesPatrick OhlyRoss BurtonIN PROGRESS REVIEWnormalMedium+2.2 M1
9575Test SDK EXT failed on core-image-sato for MIPS architectureLeonardo Sandoval GonzalezRobert YangNEWcriticalMedium+2.2 M1
8289kernel_configme step should use "oldnoconfig" instead of "allnoconfig" when silently upgrading user defconfigRob CalhounBruce AshfieldIN PROGRESS DESIGN COMPLETEnormalMedium2.2 M1
8773refactor yocto-kernel-cache common-pc / intel-common scc/cfg file to reduce delta & overlapSaul WoldCalifornia SullivanACCEPTEDenhancementMedium+2.2 M1
9564yocto-layer script should use argparse instead of optparse library  ACCEPTEDenhancementMedium+2.2 M1
7658patchwork: provide means of recording additional patch statusesPaul EggletonMichael HalsteadNEEDINFOenhancementHigh2.2 M1
8694Add support for multiple binaries in one testCostinMariano LopezIN PROGRESS IMPLEMENTATIONenhancementMedium+2.2 M1
9369Extensible SDK: oe-selftest test does not test that update actually worksPaul EggletonStephano CetolaIN PROGRESS DESIGNnormalMedium+2.2 M1
9257extensible SDK: need an easy way of installing toolchainsHenry BrucePaul EggletonNEWnormalMedium2.2 M1
9476Switch production error reporting web to filter on production-yocto-autobuilderBeth FlanaganBeth FlanaganNEWnormalMedium+2.2 M1
9414add support for bmap-toolsEd BartoshEd BartoshIN PROGRESS REVIEWenhancementMedium+2.2 M1
9576Extensible SDK test output needs to include preparing_build_system.log on failurePaul EggletonLeonardo Sandoval GonzalezIN PROGRESS REVIEWenhancementMedium+2.2 M1
9577gen-lockedsig-cache fails when populating sdk ext on PPC architectureLeonardo Sandoval GonzalezRobert YangNEWnormalMedium+2.2 M1
8483Compatible to run generic pyunit test cases by test runner jingwangIN PROGRESS DESIGNenhancementMedium2.2 M1
9130Update OE patchwork instancePaul EggletonMichael HalsteadNEWenhancementHigh2.2 M1
9517Move to Bootstrap 3Belen Barros PenaBelen Barros PenaNEWenhancementHigh2.2 M1
9565Add copy dir and delete files, dir to sshcontrolMariano LopezMariano LopezIN PROGRESS REVIEWenhancementMedium2.2 M1
8384Exported tests needs a test suiteCristian IorgaMariano LopezNEWenhancementMedium+2.2 M1
9298Autobuilder enable KVM on the cluster for x86, x86-64Aníbal LimónBeth FlanaganNEWenhancementHigh2.2 M1
8974Add eSDK benchmarkingRoss BurtonMarkus LehtonenNEWenhancementMedium+2.2 M1
9131Prelink breaks fork IFUNCFrancisco PedrazaMark HatleIN PROGRESS IMPLEMENTATIONmajorHigh2.2 M1
8397ROOTLESS_X should be used as default for Poky BSPJussi KukkonenAlejandro HernandezACCEPTEDnormalMedium2.2 M1
9261Can't distinguish between delayed and failed postinstRoss BurtonRoss BurtonNEWenhancementMedium+2.2 M1
8988test_rpm_query_nonroot (oeqa.runtime.rpm.RpmInstallRemoveTest) - Failed to create new userFrancisco PedrazaRoss BurtonNEWnormalMedium+2.2 M1
9132Toaster integrate testing into AB/buildbotAníbal LimónAníbal LimónIN PROGRESS IMPLEMENTATIONenhancementMedium+2.2 M1
8704patchwork: support history tracking of patch statusPaul EggletonJose LamegoIN PROGRESS REVIEWenhancementMedium+2.2 M1
8400rrs: add the cause of an unknown recipe versionMariano LopezPlauchu EdwinNEWenhancementMedium2.2 M1
9481Add example to "5.23. Debugging With the GNU Project Debugger (GDB) Remotely"Hongxu JiaScott RifenbarkNEWenhancementMedium+2.2 M1
9534oe-selftest --list-tests output format assumes 150 character wide terminalBenjamin Esquivel NEWnormalMedium2.2 M1
8592smart: make it can understand MLPREFIXRobert YangRobert YangNEWenhancementMedium2.2 M1
9419Enabling systemd-boot to replace gummibootJianxun ZhangJianxun ZhangIN PROGRESS IMPLEMENTATIONenhancementMedium2.2 M1
8714Patchwork frontend page for incoming patch testingPaul EggletonJose LamegoNEWenhancementMedium+2.2 M1
9377Enable automated build performance testing in AutobuilderJose Perez CMarkus LehtonenNEWenhancementMedium+2.2 M1
9484Port QA UI tests to Toaster's Django+Selenium frameworkElliot SmithAlexandru RomanNEWnormalMedium2.2 M1
 500      
Warnings were generated during the execution of function
  1. Report truncated - count greater than max allowed 501 > 500

Old Queries

Personal tools