Yocto 2.5 Schedule

From Yocto Project
Jump to: navigation, search

Contents

Yocto Project 2.5 release milestone structure

YP1.3milestone.png

=

Yocto Project 2.5 release schedule (release date: Apr. 27, 2018)


The detailed milestone map for the 2.5 release of Yocto Project is as below.

To view the Yocto schedule-at-a-glance, go to YoctoCalendar.

Please note that the estimation for each feature is done based on 'perfect day'. The purpose of the estimation is to estimate the relative size of features, NOT to predict when a single feature could be done.

M1 (Oct. 23, 2017 to Dec. 15, 2017

M1 Feature/Tasks Development / Cutoff is Dec. 4, 2017

IDRequesterAssigneeESummary (14 tasks) SeverityPWhiteboardStatus
10801Alexander KanavinAlexander Kanavin3devtool: upgrade: report diff for changed files referred to by LIC_FILES_CHKSUMenhancementMediumRESOLVED
11596Juro BystrickyCinly Ooi5bzip2-ptest: improve reproducible buildenhancementMediumRESOLVED
11753Leonardo Sandoval GonzalezDaniela Plascencia3patchwork should track the HEAD commit id in stored patchesenhancementMediumRESOLVED
10805Daniela PlascenciaDaniela Plascencia3Tinfoil usage in the test-suiteenhancementMedium+RESOLVED
11518Leonardo Sandoval GonzalezDaniela Plascencia1Upstream-Status Submitted and Inappropriate check for where/reason infoenhancementMedium+RESOLVED
11805Jose Perez CJose Perez C5Create yocto-bsp/yocto-kernel tools testsenhancementMediumRESOLVED
11806Jose Perez CJose Perez C5Create test for yocto-kernel toolenhancementMediumRESOLVED
5866Martin JansaJuro Bystricky5Reproducible builds: identical binariesenhancementMedium+RESOLVED
11780Joshua LockLeonardo Sandoval Gonzalez1Commit message failures should link to commit patch guidelinesenhancementMediumRESOLVED
10874Benjamin EsquivelLeonardo Sandoval Gonzalez3oe-selftest: 35% of the testing time is concentrated in 5 tests (out of ~200)enhancementMedium+RESOLVED
12269Robert YangRobert Yang5copy_bitbake_and_layers(): make it support subgitsenhancementUndecidedRESOLVED
12196patriciaRoss Burton1Update GStreamer to 1.12.3enhancementMediumRESOLVED
12167brian averyStephano Cetola1Remove yocto-layer now that bitbake-layers has been mergedenhancementMedium+RESOLVED
12126brian averyTodor Minchevupgrade meta-intel-clear-containers to 3.0enhancementMediumRESOLVED
   41     

M1 Bugs

IDRequesterAssigneeESummary (61 tasks) SeverityPWhiteboardStatus
11990Alex LennonAlex Lennon2Screen corruption with QEMU when running built qemux86 imagenormalMedium+RESOLVED
11978Paul EggletonAlejandro Hernandez2python-native is being built without IPV6 enablednormalMedium+RESOLVED
12542yeoh ee pengCalifornia Sullivan[Meta-Intel 2.5 M1 RC1] Unable to build poky tiny image where microcode source was inaccessiblenormalMediumRESOLVED
12536Ashwin SomanCalifornia Sullivan[Meta-Intel 2.5 M1 RC1] Unable to boot up Minnowboard with core-image-sato-sdk-intel-core2-32normalMedium+RESOLVED
9927Humberto IbarraDaniela Plascencia2yocto-bsp: listing properties stdout and data send to -o option should be the samenormalMediumRESOLVED
9928Humberto IbarraDaniela Plascencia2yocto-bsp: logical if statements should be avoided in json return by list subcommandnormalMediumRESOLVED
11328Daniela PlascenciaDaniela Plascencia1tests: test_lic_files_chksum_presence uses a variable not always provided by BitbakenormalMediumRESOLVED
11755Daniela PlascenciaDaniela Plascencia3patchtest-oe: test checking changes in lic_files_chcksum not failing when lacking the explanation in commit messagenormalMediumRESOLVED
11055Daniela PlascenciaDaniela Plascencia2tests: patch upstream status check fails erroneouslynormalMedium+RESOLVED
12209Jackie HuangJackie Huangqemuppc: Cannot manage 'undefined' PCI device type '<NULL>'normalMedium+RESOLVED
12358Jackie HuangJackie Huangmozjs_17.0.0.bb:do_compile failed with DEFAULTTUNE "mips"normalMedium+RESOLVED
12028Jose Perez CJair Gonzalez4Create Test Plan for Kernel Test SuitenormalMedium+RESOLVED
12127Leonardo Sandoval GonzalezJair Gonzalez5Duplicate log observed on oe-selftest runsnormalMedium+RESOLVED
11886Paul EggletonJose Lamego2patchwork: series info page is uglyminorMediumRESOLVED
12174Ross BurtonJose Lamego1RRS not reporting correct version for ca-certificatesnormalMedium+RESOLVED
12094LibertadJose Perez C2ptest: modify the result chart so that the current release commit is compared with the previous commit releasenormalHighRESOLVED
12087brian averyJoshua Lock0.5Eclipse Oxygen needs to be added. Eclipse Mars needs to be droppednormalMediumRESOLVED
12103Joshua LockJoshua Lock3Intermittent failures in updating submodules for intel-iot-refkit repositorynormalMedium+RESOLVED
12326Joshua LockJoshua Lock1Rename beaglebone machine in meta-yocto-bspnormalMedium+RESOLVED
12377Armin KusterJoshua Lock[morty-next] oe-selftest failednormalMedium+RESOLVED
10953Ross BurtonJuro Bystricky2util-linux installs libtool wrapper scripts instead of binaries for ptestnormalMediumRESOLVED
11700Juro BystrickyJuro Bystricky1tcl_8.6.6: tclConfig.sh: non-deterministic generationnormalMedium+RESOLVED
11705Juro BystrickyJuro Bystricky1gobject-introspection_1.50.0 contains various references to the host build systemnormalMedium+RESOLVED
12353Juro BystrickyKai Kangmips screen-4.6.2-r0 do_compilenormalMedium+RESOLVED
11392Paul EggletonKristi2Document how to specify a branch / tag / revision when using devtool add with a remote URLnormalMedium26 September 2017: RESOLVEDRESOLVED
11800Juan Manuel Cruz AlcarazKristi1NOAUTOPACKAGEDEBUG undocumentednormalMedium+19 DECEMBER, 2017: RESOLVEDRESOLVED
10473Yi ZhaoLeonardo Sandoval Gonzalez1Fail to launch custom qemu image with runqemunormalMedium+RESOLVED
11821Armin KusterLeonardo Sandoval Gonzalez1nightly-oe-selftest 2.4_M1-574-g2ec756257e failednormalMedium+RESOLVED
12218Leonardo Sandoval GonzalezLeonardo Sandoval Gonzalezdevtool modify failing in fedora 26normalMedium+RESOLVED
12341Juro BystrickyMatt MadisonERROR: go-cross-canadian-x86-64-1.9-r0 do_compile: Function failednormalMedium+RESOLVED
12051Tracy GraydonMaxin B. John0.5hostap-utils download site is downnormalMediumRESOLVED
11960Tony RiedererMaxin B. John1.5groupadd fails on ubuntu 16.04normalMedium+RESOLVED
12235Jonathan LiuMaxin B. John1image.bbclass: Consider adding --apparent-size to du -ks for get_rootfs_sizenormalMedium+RESOLVED
12361Maxin B. JohnMaxin B. JohnFetcher failure for URL: "http://www.webdav.org/neon/neon-0.30.2.tar.gz"normalMedium+Please backport to pyro (2.3)RESOLVED
12073oscar lopez arandasoscar lopez arandas1selftest: setUpClass failed failing on ubuntu 17.04 (oeqa.selftest.signing.Signing)normalMedium+RESOLVED
11757Patrick OhlyPatrick Ohlyselftests: do not touch existing build artifactsnormalMedium+RESOLVED
11763Patrick OhlyPaul Eggleton1bitbake-diffsigs: -t matches wrong task signature filesnormalMedium+RESOLVED
12185California SullivanPaul Eggleton2devtool_modify_native test failure in ross/rockonormalMedium+VERIFIED
12285Mikko YlinenPaul Eggletondevtool: upgrade: fails with a TypeErrornormalMedium+RESOLVED
12286AndrewPaul Eggleton0.25python-gevent_1.0.1.bb requires https for all downloads nownormalMedium+RESOLVED
12293Brendan Le FollPaul Eggleton1SWIG not supporting node.js version > 7normalMedium+RESOLVED
12318Paul EggletonPaul Eggleton0.25devtool upgrade+finish not deleting old filesnormalMedium+RESOLVED
12264Robert BergerRobert BergerIMAGE_FSTYPES += "... wic.bmap ..." bmaptool freaking outnormalMediumBackport 2.3.3 and 2.4.1?RESOLVED
12297Andrea AdamiKhem Raj1gcc7 fixes for armv5e [ARM] PR 82445 - (no boot)majorMedium+RESOLVED
12336Andrea AdamiKhem Raj1musl 1.18 fails to build for armv5tenormalMedium+RESOLVED
11393Paul EggletonRebecca Chang3recipetool: create: handle git URLs specifying only a tagminorMedium+VERIFIED
12163Ross BurtonRichard Purdie1Obtuse error if build dir != cwdnormalMedium+RESOLVED
12183California SullivanRichard Purdie3core-image-sato nightly-ppc failed to boot during testimagenormalMedium+RESOLVED
12232Phlip BalisterRichard Purdie0.5bitbake-layers create-layer has bad BBFILES entrynormalMedium+RESOLVED
12301Richard PurdieRichard PurdieKernel boot hanging on 4.12.14 with qemux86-64normalMedium+RESOLVED
12329Leonardo Sandoval GonzalezRichard Purdietestimage execution interrupted for nightly-x86normalMedium+RESOLVED
12403Juro BystrickyRoss Burton[QEMU]core-image-sato: no input from keyboard nor mouse for x86normalHighRESOLVED
12250Armin KusterRoss Burton3[ross/mut] nightly-x86 failed QEMU abortnormalMedium+RESOLVED
12251Armin KusterRoss Burton1[ross/mut] nightly-oe-selftest failednormalMedium+RESOLVED
12255Armin KusterRoss Burton[ross/mut] test_dnf_reinstall failed on nightly-ppc-lsb sanity testnormalMedium+Backport 2.3.3 and 2.4.1?RESOLVED
11967Jose Perez CSaul Woldcreating root file systems using 'elf' failed with error convert_magic 00000000 != a5a5a5a5normalMedium+RESOLVED
12162Robert BergerSaul WoldERROR: do_kernel_metadata: Could not locate BSP definitionnormalMedium+RESOLVED
12173brian averySaul Wold4wic cp,rm,ls of a partition e.g. ic ls myimage.wic:1/ fails if host mtools are not installednormalMedium+RESOLVED
12114oscar lopez arandasSonia Leonoe-selftest on Ubuntu1704 hangs due to a resource warning of unclosed file.normalMedium+Backport 2.3.3?VERIFIED
12191brian averyScott Rifenbark5need to document new wic features wic cp, wic rm, and wic ls.normalMedium+13 Oct 2017: RESOLVEDRESOLVED
12186Stephano CetolaStephano Cetola1add musl/qemux86-64 targetnormalMedium+RESOLVED
   73.5     

M1 Stabilize schedule

Release Candidate and Milestone Release schedule

  • RC1: 12/4/17
  • M1 release: 12/15/17

M2 (Dec. 5, 2017 to Jan. 26, 2018

M2 Feature/tasks Development / Cutoff is Jan. 15, 2018

IDRequesterAssigneeESummary (19 tasks) SeverityPWhiteboardStatus
12348Ross BurtonAlexander Kanavin5Integration Meson build systemenhancementMedium+RESOLVED
12425Juro BystrickyAlexander Kanavin1Upgrade rpm to 4.14.0+ to support binary reproducibilityenhancementMedium+RESOLVED
11943Paul EggletonAmanda Brindle1oe-pkgdata-util should support RPROVIDESenhancementMedium+RESOLVED
10556brian averybrian avery5Docker tooling support to manipulate CROPS containers from the Eclipse CROPS pluginenhancementMedium+RESOLVED
10548brian averyChin Huat Ang4Eclipse CROPS plugin support for debugging via gdb to QEMUenhancementMedium+RESOLVED
10549brian averyChin Huat Ang3Eclipse CROPS plugin support for debugging via gdb to hardware targetenhancementMedium+RESOLVED
11519Leonardo Sandoval GonzalezDaniela Plascencia1check for four-space indented in python metadataenhancementMediumRESOLVED
10773Jair Gonzalezyeoh ee peng3QA Bitbake: extend coverage for event unit testenhancementMedium+RESOLVED
11363California SullivanHaris Okanovic15Support building and deploying multiple kernels for a single imageenhancementMedium+LETRESOLVED
9787Joshua LockJose Perez C4create selftest for useradd-staticidsenhancementMediumRESOLVED
12327Joshua LockJoshua Lock5Split embedded shell commands out into callable scriptsenhancementMedium+RESOLVED
10956Leonardo Sandoval GonzalezLeonardo Sandoval Gonzalez1selftest: sstatetessts should use world instead of image targets, making it distro agnosticenhancementMediumRESOLVED
12177brian averyRebecca Chang2Support wic in the esdkenhancementMedium+RESOLVED
8730 Ross Burton8separate code generating python manifest file from manifest information and improve the manifest generationenhancementMediumRESOLVED
11510Alejandro HernandezRoss Burton6Improve the way we handle python's packaging (autopackaging)enhancementMediumLETRESOLVED
11694Alejandro HernandezRoss Burton7Python JSON manifest should be parsed directly by bitbakeenhancementMediumLETRESOLVED
11695Alejandro HernandezRoss Burton7Add task to create python manifest(s) automaticallyenhancementMediumLETRESOLVED
12370Scott RifenbarkScott Rifenbark1Create new YP Overview ManualenhancementMedium+09 February 2018: RESOLVED/NOT A BUGRESOLVED
11814Stephano CetolaStephano Cetola3Add a warning if buildhistory remote push failsenhancementMediumRESOLVED
   82     

M2 Bugs

IDRequesterAssigneeESummary (44 tasks) SeverityPWhiteboardStatus
12472Randy MacLeodAlexander Kanavin2webkitgtk is vulnerable to Meltdown and Spectre defectsnormalHighRESOLVED
12022Richard PurdieAlexander Kanavin5signing.Signing.test_signing_packages hangs on ubuntu1704.yocto.ionormalMedium+RESOLVED
12238Armin KusterAlexander KanavinRemove stale UPSTREAM_VERSION_UNKNOWNnormalMedium+RESOLVED
12396Alexander KanavinAlexander Kanavin2AUH: retrieving logs after running testimages is broken in multiple waysnormalMedium+RESOLVED
12477Joshua LockAlexander KanavinPossible bad interaction between shared-state uninative and gobject-introspectionnormalMedium+RESOLVED
11930Paul EggletonAmanda Brindle1Gateway timeout error searching for recipes without keywordnormalMedium+RESOLVED
12034Todor MinchevBruce Ashfield5backtrace in dmesg on qemuppc with 4.9normalMedium+RESOLVED
12095Dvorkin DmitryChin Huat Ang1Toolchain.Host.Mismatch problemnormalMediumRESOLVED
12459David ReynaDavid Reyna1corrupted patch for bldcollector URL filenormalHighRESOLVED
12441Libertadyeoh ee pengptest comparison script is not showing correct resultscriticalMedium+RESOLVED
12444yeoh ee pengyeoh ee peng[Test Case 1542] test_2_logrotate fails in MinnowMax with core-image-lsb-sdk-genericx86-64 imagenormalMedium+RESOLVED
12357Rebecca ChangJoshua Lockdevtool sdk-install unable to add componentnormalMedium+RESOLVED
11472Juro BystrickyJuro Bystricky1Python Makefile contains many references to the build systemnormalMedium+RESOLVED
12221Juro BystrickyJuro Bystricky3inconsistent .gnu_debuglinknormalMedium+RESOLVED
12016Paul EggletonKristi2Values for path variables in bitbake hello world tutorial make it harder to build upon itnormalMedium22 DECEMBER 2017: RESOLVEDRESOLVED
12089brian averyKristi1Need to document BBFILES_DYNAMICnormalMedium05 February 2018: RESOLVEDRESOLVED
11911Leonardo Sandoval GonzalezKristi2connection lost between host-target on a nightly-arm-lsb AB buildnormalMedium+19 DECEMBER, 2017: RESOLVEDRESOLVED
11580Paul EggletonLeonardo Sandoval Gonzalez1oe-selftest: blocking buildhistory enablement is too onerousnormalMedium+RESOLVED
12385Rebecca ChangLeonardo Sandoval Gonzalezoe-selftest: unable run test case modulenormalMedium+RESOLVED
12442Robert YangRobert Yang1FAILED: oe-selftest -r devtool.DevtoolTests.test_create_workspacenormalMediumRESOLVED
12210Robert YangRobert Yang2populate_sdk_ext failed when multilibnormalMedium+Backport to 2.4.1 and 2.3.3 if needed.RESOLVED
12270Jair GonzalezRobert Yang2[rocko] [Test Case 1534] runqemu fails using esdk in nfs modenormalMedium+Backport 2.3.3 and 2.4.1?RESOLVED
12343Robert YangRobert Yang1Let QEMU_USE_KVM can be set to 1normalMedium+RESOLVED
12438Robert YangRobert Yang1oe-selftest -r eSDK.oeSDKExtSelfTest.test_image_generation_binary_feeds errornormalUndecidedRESOLVED
12426Paul EggletonMichael HalsteadLayer index updates not being runmajorHighRESOLVED
12460Rebecca ChangMichael HalsteadChange in push.yoctoproject.org fingerprint causing connection timeout and autobuilder hangnormalMedium+RESOLVED
12381Patrick OhlyPaul Eggletondevtool: deploy-target: only set port when explicitly requestednormalMediumRESOLVED
12356Rebecca ChangPaul Eggletondevtool search produces tracebacks and not returning the search resultsnormalMedium+RESOLVED
12222FerryRebecca Changpopulate_sdk fails with multilib due to lib32- packages uninstallablenormalMediumRESOLVED
12418Richard PurdieRichard Purdie1Stale reference to meta-yoctonormalMedium30 March 2018: Set doc flag to "done"RESOLVED
12039Richard PurdieRichard Purdie2mips packages corrupt oe-selftestnormalMedium+RESOLVED
12464Keegan MorrowRichard PurdieFailure when get_srcrev runs from fakeroot tasksminorMedium+Backport 2.2.4, 2.3.4, and 2.4.2?RESOLVED
12398California SullivanRoss Burtonlibxslt intermittent fetch failuresnormalMediumRESOLVED
11513Ross BurtonRoss Burton2Python3 isn't multilib compatiblenormalMedium+RESOLVED
12057Peter KjellerstedtRoss Burton2Package license wrong in RPM for ${PN} when ${LICENSE_${PN}} != ${LICENSE}normalMedium+Backport 2.4.2RESOLVED
12139Juro BystrickyRoss Burton1ERROR: Multiple .bb files are due to be built which each provide gzip-nativenormalMedium+RESOLVED
12265Gino BadouriRoss Burton2Can't build older versions of glibc when host features version 2.26majorMedium+Backport 2.3.3 and 2.4.1?RESOLVED
12397Thomas EppersonRoss Burtonpatch_do_patch fails to detect patch failurenormalMedium+RESOLVED
12410Juro BystrickyRoss Burtoncannot use pigz, pigz is not a drop in replacement for gzipnormalMedium+RESOLVED
11880Jonathan LiuSaul Wold2kernel-devsrc: multiple System.map files present in kernel-build-artifactsnormalMediumRESOLVED
11714Jair GonzalezSaul Wold3Intel AC 7260 Bluetooth interface stops responding after disabling BluetoothnormalMedium+RESOLVED
12494Stephano CetolaStephano Cetola1remove quark on meta-intel abnormalMedium+RESOLVED
2087Darren HartYi Zhao3Fix or otherwise address existing failing LTP and POSIX compliance testsminorLowRESOLVED
11965Robert BergerYi Zhao2autogen-native: /bin/sh: bad interpreter: Permission deniedmajorMedium+RESOLVED
   55     


M2 Stabilize schedule

Release Candidate and Milestone Release schedule (Full Pass QA test follows every RC build)

  • RC1: 1/15/18
  • M2 release: 1/26/18

M3 (Jan. 16, 2018 to Mar. 2, 2018

M3 Feature/tasks Development / Cutoff is Feb. 19, 2018

IDRequesterAssigneeESummary (15 tasks) SeverityPWhiteboardStatus
10598Paul EggletonAlexander Kanavin5AUH: make use of devtool upgrade (or at least share code)enhancementMediumRESOLVED
12027 Bruce Ashfield4Merge linux-yocto git trees to a single one to reduce download times and mirror sizesenhancementMedium+RESOLVED
12188Stephano CetolaCalifornia Sullivan4Make wic the default image type for genericx86 and genericx86-64enhancementMediumRESOLVED
10987California SullivanCalifornia Sullivan5Use initramfs-framework for initialization by default in OE-CoreenhancementMedium+RESOLVED
12193David ReynaDavid Reyna1Add env for shell calls in localhostbecontrollerenhancementMediumRESOLVED
11548Robert Yangdengke5Reduce local Pending patchesenhancementMedium+RESOLVED
10063Aníbal Limónyeoh ee peng5testimage: Add tests for apt/dpkg like smart/rpm onesenhancementMediumRESOLVED
11483Libertadyeoh ee peng5Automate testcases for package managementenhancementMedium+RESOLVED
11488Libertadyeoh ee peng5Testimage: Add tests for ipk/opkg like dnf/rpm onesenhancementMedium+RESOLVED
12104Joshua LockJoshua Lock2Reduce the number of exported environment variablesenhancementMedium+RESOLVED
11178Joshua LockJuro Bystricky2Use SOURCE_DATE_EPOCHenhancementMedium+RESOLVED
11179Joshua LockJuro Bystricky1Ensure TZ is also set to a consistent valueenhancementMedium+RESOLVED
11018Todor MinchevStephano Cetola3Auto deploy and boot meta-intel images built with the ABenhancementMediumRESOLVED
12128Richard PurdieStephano Cetola20Rework the Quickstart and intro to the manualsenhancementMediumRESOLVED
10230+Aníbal LimónStephen K Jolleyoeqa refactor and improvements (master bug)enhancementMedium+RESOLVED
   67     

M3 Bugs

IDRequesterAssigneeESummary (42 tasks) SeverityPWhiteboardStatus
12360Alexander KanavinAlexander Kanavin1Make AUH/devtool/distrodata play nice with each othernormalMediumRESOLVED
11996Samuli PiippoAlexander Kanavin5pseudo: cannot use unnamed temporary files (O_TMPFILE)normalMedium+RESOLVED
12533yeoh ee pengAlexander Kanavin[2.2.3 rc2] selftest: setUpClass failed failing on ubuntu 17.10 (oeqa.selftest.signing.Signing)normalMedium+RESOLVED
12334Ross BurtonAmanda Brindlebuildhistory-diff misreports RPROVIDESnormalMedium+RESOLVED
12506Anuj MittalAnuj Mittal3remove config for obsolete machines from yocto-kernel-cacheminorMedium+RESOLVED
12508Anuj MittalAnuj Mittalqemu hangs while running oe-selftestnormalMedium+RESOLVED
12228Peter KjellerstedtBruce AshfieldRace between do_make_sccripts() and recipes using the scripts it createsnormalMedium+RESOLVED
12487Andrej RodeBruce Ashfield1kernel-yocto: configuration fragment with defconfig in name is garbled.normalMedium+RESOLVED
10455Jair GonzalezCalifornia Sullivan2[morty][Test Case 1059] Parselogs is failing on genericx86 (32 and 64 bits) giving error: blk_update_request: I/O error, dev loop0normalMediumRESOLVED
12509Paul EggletonChin Huat Ang[Eclipse] Drop yocto-bsp functionalitynormalMedium+RESOLVED
12514Chin Huat AngChin Huat Angeclipse-poky: use modern form of AM_INIT_AUTOMAKE in configure.ac templatenormalMedium+RESOLVED
12555David ReynaDavid Reyna1Toaster will not shut down due to extra PID from DjangonormalMedium+RESOLVED
12554David ReynaDavid Reyna1django now fails for 'optional' fixture 'custom.xml'majorUndecidedRESOLVED
11639Hongxu JiaHongxu Jiainstalling grub and grub-efi with conflictionnormalMedium+RESOLVED
12058Armin KusterJuro Bystricky3Qemu fails to start on recent kernels with KVM alloc() failurenormalMedium+RESOLVED
12277Juro BystrickyJuro Bystricky1.5dbus-test-ptest is brokennormalMedium+RESOLVED
11288Maxin B. JohnKevin Hao2X Server fails to start on qemuarm64 (need CONFIG_FB?)normalMedium+RESOLVED
12131Yi ZhaoKevin Hao2Kernel traceback when reboot beaglebone blacknormalMedium+VERIFIED
12458Stephano CetolaKristi1DEFAULTTUNE link is incorrectnormalMedium21 February 2018: IN PROGRESS REVIEWRESOLVED
12537Kentaro HayashiKristi1Ubuntu 14.04 is still listed in supported distros listnormalMedium+30 March 2018: RESOLVEDRESOLVED
12253Leonardo Sandoval GonzalezLeonardo Sandoval Gonzalez5Guest VM has errors on tap cleaningnormalMedium+RESOLVED
12646Aaron ChanPaul Eggleton[2.5 M3 rc1][OE Core] Bug found on systemd_237.bb recipes-core undefined base_sbindirnormalUndecidedRESOLVED
12710Aaron ChanPaul Eggleton[2.5 M3 rc1][nightly-arm][fedora28][autobuilder2] - elfutils-native-0.170-r0 oe_runmake failednormalUndecidedRESOLVED
12302Leonardo Sandoval GonzalezRandy MacLeod2kernel's perf compilation failing in nightly-arm-lsbnormalMedium+RESOLVED
12373Jackie HuangRichard PurdieFeature Backfilling doesn't work for multilibnormalHighRESOLVED
11762Jussi KukkonenRichard Purdie1Lacking documentation on virtual providersnormalMedium23 March 2018: RESOLVEDRESOLVED
12462 Richard PurdieGit configuration can break poky scriptsnormalMediumRESOLVED
12507Daniel F. DickinsonRichard Purdiemulticonfig throws python error on fresh checkout of OE-core on 'bitbake -c listtasks'majorMedium+RESOLVED
12510Martin HundebollRichard Purdiefetchall doesn't fetch PACKAGE_WRITE_DEPSnormalMedium+RESOLVED
12702Aaron ChanRichard Purdie[2.5 M3 rc1][BSP Core][autobuilder2] - nightly-arm appear to fail with warningsnormalUndecidedRESOLVED
12567Diego RussoRoss Burtonparallel_make_argument brokennormalHighRESOLVED
10450Alexander KanavinRoss Burton20Reduce fuzz factor when patching filesnormalMedium+LETRESOLVED
11106Ross BurtonRoss Burton1eSDK generation fails with rm_worknormalMedium+RESOLVED
12469Rebecca ChangRoss Burtondo_patch does not fail in a rare casenormalMedium+RESOLVED
12513Juro BystrickyRoss Burtonpython3-dev contains build host references in ./usr/bin/python3.5m-confignormalMedium+reproducibleRESOLVED
12529California SullivanRoss Burtonscripts/distro/build-recipe-list.py misses a large number of recipesnormalMedium+RESOLVED
12577Ross BurtonRoss Burtonbinutils 2.30 + musl + systemd + gobject-introspection failsmajorMedium+RESOLVED
12449Richard TollertonSeebsmkostemp() not implementednormalHighRESOLVED
11643Jonathan LiuSeebsSpecial dot files . and .. exist for both for directories and filescriticalMedium+RESOLVED
12495Stephano CetolaStephano Cetola1Add Stephano & Cal to QA Alert EmailsnormalMedium+RESOLVED
12496Stephano CetolaStephano Cetola1update dropdowns to include sumonormalMedium+RESOLVED
12518Anuj MittalYi Zhao1Ctrl+C doesn't close menuconfig terminalnormalMediumRESOLVED
   56.5     


M3 Stabilize schedule

Release Candidate and Milestone Release schedule (Full Pass QA test follows every RC build)

  • RC1: 2/19/18
  • M3 release: 3/2/18

M4 (Feb. 20, 2018 to Apr. 27, 2018

M4 Bug/fix Cutoff is Apr. 2, 2018

IDRequesterAssigneeESummary (6 tasks) SeverityPWhiteboardStatus
10147Jose Perez Cyeoh ee peng4Create a tool to compare the automated test list against the Testopia Test list DBenhancementMediumRESOLVED
11176Joshua LockJuro Bystricky3Add optional command to rootfs-postprocess to remove non-determinism from rootfsenhancementMedium+RESOLVED
11177Joshua LockJuro Bystricky2Generate archives with deterministic metadataenhancementMedium+RESOLVED
12422Juro BystrickyJuro Bystricky2Support reproducible build for core-image-minimal imagesenhancementMedium+RESOLVED
11525SJKristi3wic: /etc/fstab to mount partitions with UUID instead of kernel name descriptorsenhancementMedium23 February 2018: RESOLVEDRESOLVED
12371Scott RifenbarkScott Rifenbark5Purge concepts from YP Reference ManualenhancementMedium09 February 2018: RESOLVEDRESOLVED
   19     

M4 Bugs

IDRequesterAssigneeESummary (61 tasks) SeverityPWhiteboardStatus
12699Aaron ChanAaron Chan[2.5 M3 rc1] [OE-core] [autobuilder2] - buildoptions.ArchiverTest.test_arch_work_dir_and_export_source - Testcase 926: FAILED - oescripts.BuildhistoryDiffTests.test_buildhistory_diff - Testcase 295: FAILED - runtime_test.TestImage.test_testimage_dnf - TesnormalMedium+RESOLVED
12700Aaron ChanAaron Chan[2.5 M3 rc1][poky-tiny][Centos7][autobuilder2] - Clobber build dir - failed to load utilsnormalMedium+RESOLVED
12701Aaron ChanAaron Chan[2.5 M3 rc1][OE Core:Centos7] - Unpack shared repositoriesnormalMedium+RESOLVED
12566Tim OrlingAlexander Kanavin[AUH] 'tmp' dir is hard-codednormalHighRESOLVED
12618Ross BurtonAlexander Kanavinsyslog doesn't start under systemdmajorHighRESOLVED
12596California SullivanAlexander Kanavinpython3-native do_compile failure on master-nextnormalMedium+RESOLVED
12630Ross BurtonAlexander Kanavinpostinst intercepts fail in SDKsnormalMedium+RESOLVED
12661Richard PurdieAlexander KanavinRequire LAYERSERIES_COMPAT_X to be set in yocto-check-layer for YP CompatibilitynormalMedium+RESOLVED
12092Matthias SchöpferAmanda BrindleSources (/usr/src/debug) missing in -dbg packages when MACHINE="qemumips"normalMedium+Backport 2.3.n and 2.4.nRESOLVED
12553Denys DmytriyenkoAmanda Brindlewaf.bbclass fails to provide useful errornormalMedium+RESOLVED
12504yeoh ee pengAnuj Mittal[2.5 M1 RC3] LTP Test: LTP tests hung up on NUC7 and not able to complete full runnormalMediumRESOLVED
12338Patrick OhlyAnuj Mittalchecklayer: undefined LayerErrornormalMedium+RESOLVED
12559Ross BurtonAnuj Mittal2buildhistory-diff: directory rename detection sometimes goes crazynormalMedium+RESOLVED
12640Nobuhiro IwamatsuBruce Ashfieldrecipes-kernel contains unnecessary recipesnormalMedium+RESOLVED
12578California SullivanCalifornia Sullivantest_qemu_efi (oeqa.selftest.wic.Wic) fails on Fedora27 in masternormalMedium+RESOLVED
12583California SullivanCalifornia Sullivaninstall scripts need smarter sizing of the boot partitionnormalMedium+RESOLVED
12633pravinCalifornia Sullivan[2.5 M3 RC1] BSP-QEMU:core-image-lsb-sdk-x86.wic unable to boot on Minnowboard TurbotnormalMedium+VERIFIED
12713David ReynaDavid ReynaMove Toaster lookup to YP-2.5 Sumo releasenormalMedium+RESOLVED
10499Daniela Plascenciayeoh ee pengNUC6 freezes on core-image-sato using genericx86-64 with kernel 4.1.33normalLowRESOLVED
12220Javier Zepedayeoh ee peng[OE-seltest] Some automated test cases are being missed in the test run.minorMediumRESOLVED
12435Joshua Lockyeoh ee pengUpdate testopia and templates. Remove some TCs and replace duplicates.normalMediumRESOLVED
12093Jan-Simon MoellerHongxu Jia5do_populate_sdk RPM metadata conflict between nativesdk-cmake and nativesdk-qtbase-toolsnormalMedium+RESOLVED
12594California SullivanJackie Huanglarge number of host-user-contaminated QA warnings with Fedora 27majorHighRESOLVED
12632Alejandro HernandezJaewon Leematchbox: gconf isn't able to apply changesnormalMedium+RESOLVED
12679Juro BystrickyJuro Bystrickycommit: "apply MLPREFIX renaming to all package classes" breaks mingw buildnormalHighRESOLVED
11811oscar lopez arandasJuro Bystricky2ptest-busybox cases failednormalMediumbackport 2.3 & 2.4RESOLVED
12544Juro BystrickyJuro Bystrickykernel-module-xxx contain non-deterministic srcversionnormalMedium+RESOLVED
12625Juro BystrickyJuro Bystricky(reproducibility) libc6-dbg contains build host referencesnormalMedium+reproducibilityRESOLVED
12662sai pavanJuro Bystrickynativesdk-diffutils build fails with mingw toolchainnormalMedium+RESOLVED
12622Ross BurtonKevin Haolsb kernels causing preferred version not found warningsnormalMedium+RESOLVED
12467Cornel PanceacKristi1instructions for centos are wrongnormalMedium18 January 2018: RESOLVEDRESOLVED
12546Scott RifenbarkKristieclipse-poky repo being renamed to eclipse-yoctonormalMedium+15 February 2018: RESOLVEDRESOLVED
12547Scott RifenbarkKristiemoved the fetchall and checkuriall tasks, "bitbake X --runall=fetch" and "bitbake X --runall=checkuri" replace themnormalMedium+23 February 2018: RESOLVEDRESOLVED
11793LibertadLibertadcreate opkg and dpkg indexnormalMediumRESOLVED
12704Ross BurtonMatt MadisonGo fails to build on older hostsnormalMedium+RESOLVED
12461 Maxin B. JohnIMAGE_TYPES cpio.lz4 isbrokenmajorMedium+Backport 2.4.2RESOLVED
12552Ross BurtonMaxin B. Johncheckuri fails in masternormalMedium+RESOLVED
12565Scott BrandenMaxin B. Johnwatchdog.service dead on startup with systemdnormalMedium+RESOLVED
12575Diego RussoOtavio SalvadorTask do_make_scripts from imx-test_git.bb seems to be empty?!criticalMedium+RESOLVED
12647Aaron ChanPaul Eggleton[2.5 M3 rc1][OE-Core:Debian9] recipe xcursor-transport-theme went backwards, breaks package feedsnormalHighRESOLVED
12655Aaron ChanPaul Eggleton[2.5 M3 rc1][OE Core:Debian9] layerappend.LayerAppendTests.test_layer_appends - Testcase 1196: ERRORmajorHighRESOLVED
12665Mohamad Noor AlimPaul Eggleton[2.5 M3 rc1] OpenSUSE42.3 runtime test fail at runtime_test.TextExport, runtime_test.TestImage, runtime_test.TestImage and oe_runmake.normalHighRESOLVED
9566Henry BrucePaul Eggleton4devtool documentation is duplicated in dev and sdk manualsnormalMedium+23 March 2018: RESOLVEDRESOLVED
12387Nathan IllerbrunPaul EggletonBBMASK is ignored for populate_sdk_extnormalMedium+RESOLVED
12184Robert BergerRobert Berger2sysvinit-inittab_2.88dsf.bb: ${base_bindir}/start_getty?normalMedium+RESOLVED
11672MarkKhem Raj0.1gcc 7 format-truncation off by one with O2normalMedium+RESOLVED
12550Tim OrlingRichard PurdieName change of eclipse-poky -> eclipse-yocto will cause breakage in AB eclipse plugin jobsmajorMedium+RESOLVED
12606Juro BystrickyRichard Purdielttng-tools not working after version upgradenormalMedium+RESOLVED
12608Juro BystrickyRoss Burtonmaintainers.inc contains references to non-existent recipesnormalMediumRESOLVED
10047Jose Perez CRoss Burton1Piglit isn't in images (removed from tools-testapps)normalMedium+RESOLVED
11809Joshua LockRoss Burton1Possible race in xcb recipesmajorMedium+RESOLVED
12605California SullivanRoss Burtonlikely race in gcc-runtime's do_package_write_rpmnormalMedium+RESOLVED
12379Ioan-Adrian RatiuSeebspseudo cp loses sticky directory bitnormalMedium+RESOLVED
12568YangSeebsapplication with "clone" can't work in bitbake devshellnormalMedium+RESOLVED
12669Chin Huat AngScott Rifenbarkeclipse-plugin-neon/oxygen can't build yocto-docs masternormalHighRESOLVED
12419Amanda BrindleScott Rifenbark1Section 4.21.4.3.1 results in 404 error and failure to synchronize cachenormalMedium20 March 2018: RESOLVEDRESOLVED
12300Leonardo Sandoval GonzalezScott Rifenbark4remove yocto-[bsp|kernel] documentationnormalMedium+10 May 2018: RESOLVEDRESOLVED
12030 Stephano Cetola5Complete section "3.11. Task Checksums and Setscene"normalMedium+19 April 2018: RESOLVEDRESOLVED
12558Ola NilssonStephano CetolaNo debugsrc is collected for static librariesnormalMedium+RESOLVED
12628Scott RifenbarkStephano CetolaMACHINE_EXTRA_RRECOMMEND syntax not the bestnormalMedium+RESOLVED
12581Tim OrlingTim Orling0.3libxml-namespacesupport-perl recipe is at a development releasenormalMedium+RESOLVED
   28.4     


M4 Stabilize schedule

Release Candidate and Milestone Release schedule (Full Pass QA test follows every RC build)

  • RC1: 4/2/18
  • RC2: 4/9/18
  • RC3: 4/16/18
  • Final M4 release: 4/27/18

Yocto Project 2.5 release unscheduled features/tasks list

These features/tasks are planned for 2.5, but have not been scheduled to any specific milestone. As we move forward, more of these will be scheduled into each milestone, especially during milestone planning for each milestone above.

no bugzilla tickets were found
no bugzilla tickets were found
no bugzilla tickets were found
no bugzilla tickets were found
Personal tools