Yocto 2.3 Schedule

From Yocto Project
Jump to: navigation, search

Contents

Yocto Project 2.3 release milestone structure

YP1.3milestone.png

Yocto Project 2.3 release schedule (release date: April 28, 2017)


The detailed milestone map for the 2.3 release of Yocto Project is as below.

To view the Yocto schedule-at-a-glance, go to YoctoCalendar.

Please note that the estimation for each feature is done based on 'perfect day'. The purpose of the estimation is to estimate the relative size of features, NOT to predict when a single feature could be done.

M1 (Oct. 31, 2016 to Dec. 23, 2016 -- 9 weeks: planning done in week 1, development week 2-6, stabilization week 7-8, release week 9)

M1 Feature/Tasks Development / Cutoff is Dec. 12, 2016

IDRequesterAssigneeESummary (46 tasks) SeverityPWhiteboardStatus
10396Jair GonzalezBenjamin Esquivel7Creation of component to control USB multiplexer (Cleware1x8)enhancementHighVERIFIED
8480Cathy ShenBenjamin Esquivel7Support image flash methods and communication methods with DUTenhancementMedium+VERIFIED
10569Jair GonzalezBenjamin Esquivel4Integrate DevAuto USB multiplexer module to AFTenhancementMedium+VERIFIED
10327brian averybrian averysstate mirror does not serve up the (contents of ) the uninative tarballenhancementMediumRESOLVED
10058Leonardo Sandoval GonzalezDaniela Plascencia1patchtest-oe: check SUMMARY presence on new recipesenhancementMediumRESOLVED
10064Leonardo Sandoval GonzalezDaniela Plascencia1patchtest: Series Details must contain the revisionenhancementMedium+RESOLVED
9852brian averyEd Bartosh3Use the eventreplay mechanism for testingenhancementMediumRESOLVED
10395Jair GonzalezPlauchu Edwin7Creation of component to control remote power switch (NP-0801DT)enhancementHighVERIFIED
9088Aníbal LimónFrancisco Pedraza3Extensible SDK add tests for devtoolenhancementMedium+RESOLVED
10753Francisco PedrazaFrancisco Pedraza5QA Kernel-dev test cases basic functionalityenhancementMedium+RESOLVED
10394Jair GonzalezJair Gonzalez2Creation of component to emulate keyboard with USB-KM232enhancementHighRESOLVED
10086Jianxun ZhangJianxun Zhang3RMC: RMC Project - single library, single APIenhancementMedium+RESOLVED
9390Robert YangJose Lamego10oeqa: don't write anything to local.conf or bblayers.confenhancementMediumRESOLVED
10625Ross BurtonJose Lamego2Don't show "Series without cover letter" for series without cover letterenhancementMedium+RESOLVED
7376Ross BurtonJose Perez C3oe-selftest doesn't run lib/oe/tests/*enhancementMedium+RESOLVED
8433Ross BurtonJose Perez C4Add test for package postinstsenhancementMedium+RESOLVED
9727Bill RandleJoshua Lock3Add autobuilder support to publish sstate objects for releasesenhancementHighVERIFIED
10466Joshua LockJoshua Lock3Update BuildLog with build progressenhancementMedium+RESOLVED
10679Richard PurdieJoshua Lock0.5Drop unneeded expansion parameter to getVar and getVarFlagenhancementMedium+RESOLVED
10655Juro BystrickyJuro Bystricky3Add support for ZephyrenhancementHighRESOLVED
5546Paul EggletonJussi Kukkonen2Optimise away meta-oe X init mechanismenhancementHighRESOLVED
10195Jussi KukkonenJussi Kukkonen1Move to libinput as default x input driverenhancementMedium+RESOLVED
10078Paul EggletonLeonardo Sandoval Gonzalez1patchtest-oe: check patch authorenhancementMediumRESOLVED
10059Leonardo Sandoval GonzalezLeonardo Sandoval Gonzalez2patchtest-oe: check bitbake datastore variables on classes or includesenhancementMedium+RESOLVED
10112Daniela PlascenciaLeonardo Sandoval Gonzalez5Patchtest-oe: tests summary must provide patch nameenhancementMedium+RESOLVED
10469Leonardo Sandoval GonzalezLeonardo Sandoval Gonzalez2Install package dependencies for patchtest image (poky) developmentenhancementMedium+RESOLVED
9954Benjamin EsquivelMariano Lopez4report tool: a communication mechanism for sending resultsenhancementHighRESOLVED
9418Koen KooiMichael WoodSupport using existing OE setupsenhancementMediumRESOLVED
10509Leonardo Sandoval GonzalezMichael HalsteadInclude patchwork repository into git.yp.orgenhancementHighRESOLVED
10511Leonardo Sandoval GonzalezMichael HalsteadPatchwork production instance code base must point to git.yp.org repoenhancementHighRESOLVED
9189Joshua LockPatrick Ohly1[meta-swupd] Creates a lot of duplicate filesenhancementMediumRESOLVED
10702Patrick OhlyPatrick Ohly1add meta-swupd to update mechanism overviewenhancementMediumRESOLVED
10583Patrick OhlyPatrick Ohly3buildstats.bbclass + pybootchart: record and render system utilization statisticsenhancementMedium+RESOLVED
10701Patrick OhlyPatrick Ohly0.5create overview of update mechanismsenhancementMedium+VERIFIED
10413Paul EggletonPaul Eggleton0.25recipetool: use & to split licenses in LICENSE valueenhancementMediumRESOLVED
8880Robert YangChen Qi5Need better allarch multilib sanity or automated QA testsenhancementMedium+RESOLVED
10359Jonathan LiuRichard PurdieImprove taskhash mismatch diagnosticsenhancementMedium+RESOLVED
8584Ross BurtonScott Rifenbark3Enable building API documentationenhancementMedium+21 Nov 2016: RESOLVEDRESOLVED
10351Stephano CetolaScott Rifenbark1Add documentation regarding RPM postinstall failures on the hostenhancementMedium+29 Nov 2016: RESOLVEDVERIFIED
9342Ross BurtonStephano Cetola2Vet subprocess callsenhancementMedium+RESOLVED
10421Stephano CetolaStephano Cetola1recipetool: add pre/post install/rm to the recipe after importing .deb packagesenhancementMedium+RESOLVED
10472Paul EggletonStephano Cetola1devshell: list options when showing "no available terminal" errorenhancementMedium+VERIFIED
10532brian averyTim Orling2Create Target file definition for Eclipse CROPS PluginenhancementHighRESOLVED
10533brian averyTim Orling1Enable Maven/Tycho Command line build for Eclipse CROPS pluginenhancementMedium+RESOLVED
9570Henry BruceTodor Minchev2Zephyr Container for Windows/Mac/LinuxenhancementMediumRESOLVED
10527brian averyTodor Minchev2Travis test for the build of an out of kernel app for Zephyr containerenhancementMediumRESOLVED
   114.25     

M1 Bugs

IDRequesterAssigneeESummary (77 tasks) SeverityPWhiteboardStatus
10719Alejandro HernandezAlejandro HernandezNewly created recipe from the yocto-layer script fails to buildnormalMedium+VERIFIED
8656Alexandru GeorgescuAníbal Limón4ptest - perl tests fail for genericx86-64 on NUC - 2.0.rc3normalMediumRESOLVED
9373wangyiAníbal Limón1ptest for perl hangcriticalMediumRESOLVED
10609brian averybrian averyThe TestLandingPage browser test is failing.normalMediumRESOLVED
10578Randy Wittbrian averyUsing django>=1.8.16 prevents access from hosts other than localhostnormalMedium+RESOLVED
10587brian averybrian avery0.3Using django>=1.8.16 prevents access from hosts other than localhostmajorMedium+RESOLVED
10608Juan RamosCalifornia Sullivan1.29[Test Case 1059] dmesg log shows various error on NUC with image corei7normalMediumRESOLVED
10640Juan RamosCalifornia Sullivan0.5Parselog: dmi: Firmware registration failed.normalMediumRESOLVED
10426Maxin B. JohnCalifornia Sullivan1Kernel config warnings while building linux-yocto-4.8 for intel-corei7-64normalMedium+RESOLVED
10611Jair GonzalezCalifornia Sullivan1[Test Case 1059] Parselogs is failing on corei7-64 in Joule giving several error messages.normalMedium+RESOLVED
10411Leonardo Sandoval GonzalezDaniela Plascencia5Provide a working python-pylint recipemajorMedium+RESOLVED
10721Leonardo Sandoval GonzalezDaniela Plascencia2patchtest-oe: improve issue and fix strings for test_mbox_format testminorMedium+RESOLVED
10492David Lopez BarribaDavid Reyna[Test Case 1398] Build log cannot be downloadednormalMediumRESOLVED
10630David ReynaDavid Reyna1Toaster: protect against circular Layer dependenciesnormalMedium+VERIFIED
10631David ReynaDavid Reyna1Fix missing close bracketnormalMedium+VERIFIED
10832Humberto IbarraEd BartosheSDK install script failed with "tasks executed unexpectedly" messagesnormalHighVERIFIED
10441Richard PurdieEd Bartosh3source-highlight-native world build failuresmajorMedium+RESOLVED
10485Benjamin EsquivelEd Bartosh1wic images on SD card do not boot with meta-intel (USB drives boot fine)normalMedium+RESOLVED
10670Leonardo Sandoval GonzalezPlauchu Edwin1AUH: Upgrade status email should indicate the URL of the log folder instead of the tar's URLnormalMedium+RESOLVED
5319Mark HatleFrancisco Pedraza3Need a test to verify firstboot postinst script ordernormalMedium+RESOLVED
10432Leonardo Sandoval GonzalezFrancisco Pedraza2eSDK test test_install_libraries_headers fail when distro is nodistronormalMedium+VERIFIED
10481Jair GonzalezJair Gonzalez1[Test Case 1059] Parselogs is failing on genericx86 (32 and 64 bits) WIC giving error: GPT: Use GNU Parted to correct GPT errors.normalMediumRESOLVED
10594Jose Perez CJair Gonzalez2Ensure all options of WIC script are testednormalMedium+VERIFIED
10671Jianxun ZhangJianxun Zhang2RMC: Compiling error with musl C librarynormalMedium+RESOLVED
9941Jose LamegoJose Lamego2patchwork: ensure series are created for all submittersnormalHighRESOLVED
9942Jose LamegoJose Lamego2patchwork: ensure patches are not marked as Accepted when a newer Series revision is modifiednormalMedium+RESOLVED
10718Jose LamegoJose Lamego0.5send-pull-request: Avoid creating duplicated email reference headersnormalMedium+RESOLVED
10759Jose LamegoJose Lamego1patchwork: post-receive git hook is not functionalnormalUndecidedRESOLVED
10315Will NewtonJoshua Lock3python3 bytecode files not installednormalMedium+VERIFIED
10523Alexander KanavinJoshua Lock0.25api-documentation DISTRO_FEATURE should be enabled and tested on at least one build configurationnormalMedium+RESOLVED
10434Yi ZhaoJuro Bystrickyrunqemu can not launch qemu image in Build AppliancenormalMedium+Need backport to 2.2.1VERIFIED
10504Yi ZhaoJuro Bystricky[Build Appliance] The default user builder can not loginnormalMedium+VERIFIED
10478Niko MaunoJussi Kukkonen1run-postinsts doesn't update package manager database on target devicenormalMedium+Backport to YP 2.2.1 and 2.1.2RESOLVED
10635Raphael Kubo da Costa (rakuco)Jussi Kukkonen0.5matchbox-window-manager: _NET_CURRENT_DESKTOP is not implemented correctlynormalMedium+VERIFIED
10305Zubair Lutfullah KakakhelRobert Yang2do_package_qa should not error on 64 bit kernel modules + 32 bit rootfsnormalMedium+RESOLVED
10260Jose Perez CMariano Lopez1smart fails on testimage when image was not built on host and meta-selftest layer is usednormalMediumVERIFIED
10508JoergSMarkus Lehtonen3bitbake fetcher does not always check for trusted_networkmajorMedium+RESOLVED
10742patriciaMaxin B. John1Update GStreamer to 1.10.1normalMedium+RESOLVED
10581Michael WoodMichael Wood1Provide example production settings filenormalMediumRESOLVED
10860Leonardo Sandoval GonzalezMichael Halsteadpatchwork: security certificate expired on patchwork sitenormalHighRESOLVED
10153Jose LamegoMichael Halstead1patchwork: create new patchwork staging instancenormalMedium+RESOLVED
10226Richard PurdieMichael Halstead1Fedora autobuilders have intermittent network error to git.yoctoproject.org in oe-selftestnormalMedium+VERIFIED
9905Jose Perez CMonserratAdd build sets to test new OS Distribution in AutobuildernormalMedium+RESOLVED
10496Patrick OhlyPatrick Ohly1wrong security.SMACK64 when unpacking with bsdtarnormalHighRESOLVED
10665Patrick OhlyPatrick Ohly0.5swupd + tar extraction errors + IMAnormalMediumRESOLVED
10666Patrick OhlyPatrick Ohly0.5pack-from-0-*.tar lacks symlinksnormalMediumRESOLVED
10668Patrick OhlyPatrick Ohly2shell parser fails when using & for background processesnormalMedium+RESOLVED
8223Paul EggletonPaul Eggleton1bbwarn warnings during do_rootfs printed twiceminorMediumRESOLVED
10484Henry BrucePaul Eggleton0.5devtool: finish command fails if destination layer isn't in bblayers.confnormalMediumRESOLVED
10561Paul EggletonPaul Eggleton0.5SDK_OLDEST_KERNEL does not influence nativesdk-glibcnormalMediumRESOLVED
10369Benjamin EsquivelPaul Eggleton1Performance degradation on eSDK, install time is twice on 2.1normalMedium+RESOLVED
10563Igor StoppaPaul Eggletondevtool: traceback when trying to generate a patchnormalMedium+RESOLVED
10566Robert YangPaul Eggleton1populate_sdk_ext: uninative.bbclass is a mustnormalMedium+RESOLVED
10568Paul EggletonPaul Eggleton0.5Extensible SDK: TEMPLATECONF value causes failures if poky repo is used without meta-pokynormalMedium+RESOLVED
10616Andrea GalbuseraPaul Eggletondevtool: cannot 'devtool build hello-mod'normalMedium+RESOLVED
10250Chen QiChen Qi2qemumips64 + systemd + pam results in login failurenormalMediumRESOLVED
10866Benjamin EsquivelRichard Purdietinfoil2 breaks the prserv functionalitycriticalHighRESOLVED
10651Robert YangRichard Purdie1bitbake -g world is brokenmajorMedium+VERIFIED
10676Patrick OhlyRichard Purdie0.25cooker: event queue overflowednormalMedium+RESOLVED
10645Ross BurtonRoss Burton1oe-core builds need uninative enabledmajorHighRESOLVED
10758Randy WittRoss Burtonrm_work causes subsequent image builds to failnormalHighVERIFIED
10423Len SorensenRoss Burton1PKGSIZE double counts hard linked filesnormalMedium+RESOLVED
10729Martin VuilleRoss Burtondevshell: Exception: TypeError: Can't convert 'bytes' object to str implicitlynormalMedium+RESOLVED
10445Yann DirsonScott Rifenbark1RDEPENDS doc should cross-reference EXTENDPKGVnormalMedium08 Nov 2016: RESOLVEDRESOLVED
10462Benjamin EsquivelScott Rifenbark1mega manual: the building images section lacks sub-sectionsnormalMedium27 Oct 2016: RESOLVEDRESOLVED
10385Gene ChenScott Rifenbark1creating-a-new-bsp-layer-using-the-yocto-bsp-script prompted default kernel (4.1) but described default kernel is 4.4minorMedium+14 Oct 2016: RESOLVEDVERIFIED
10451Benjamin EsquivelScott Rifenbark1mkefidisk.sh writes images that don't boot to SD cardmajorMedium+27 Oct 2016: RESOLOVEDVERIFIED
10392 Scott Rifenbark1Some suggested changes in '5.3.20.5. Packaging Externally Produced Binaries'normalUndecided11 Oct 2016: RESOLVEDRESOLVED
10400 Scott Rifenbark1Explaining what datastore funcs. do when a variable does not existnormalUndecided11 Oct 2016: RESOLVEDRESOLVED
10401 Scott Rifenbark1Suggested fleshing out of the 'addtask' documentationnormalUndecided11 Oct 2016: RESOLVEDRESOLVED
10444 Scott Rifenbark1Suggested documentation to explain line joiningnormalUndecided19 Oct 2016: RESOLVEDRESOLVED
10229Joshua LockStephano Cetola3New cluster publishes artifacts regardless of whether deploy_artifacts ChoiceString is setnormalHighVERIFIED
10612Joshua LockStephano Cetola2Don't perform git clone on shared volumenormalHighRESOLVED
10649Stephano CetolaStephano Cetola1devtool: output from recipetool breaks 'add' for some remote sourcesmajorHighVERIFIED
10654Stephano CetolaStephano Cetola5Investigate binary component functionalitynormalMedium+RESOLVED
10387Sujith HSujith HToaster when run with non git layers fails to add packages that are built separately into new custom imagenormalMediumRESOLVED
10740Sujith HSujith HHandle exceptions while populating data to transmit using xmlrpcnormalMedium+RESOLVED
   86.09     

M1 Stabilize schedule

Release Candidate and Milestone Release schedule

  • RC1: 12/12/16
  • M1 release: 12/23/16

M2 (Dec. 12, 2016 to Feb. 3, 2017 -- 9 weeks: planning done in week 1, development week 2-6, stabilization week 7-8, release: week 9)

M2 Feature/tasks Development / Cutoff is Jan. 23, 2017

IDRequesterAssigneeESummary (59 tasks) SeverityPWhiteboardStatus
10231Aníbal LimónAníbal Limón4oeqa: Refactor code to avoid dependencies on bitbake datastoreenhancementMedium+VERIFIED
10232Aníbal LimónAníbal Limón4oeqa.utils: Audit/merge modules to avoid code duplicity and dependencies on bitbakeenhancementMedium+VERIFIED
10263Aníbal LimónAníbal Limón4oeqa: Refactor oetest moduleenhancementMedium+VERIFIED
9140Aníbal LimónBenjamin Esquivel3Eclipse plugin testing enable work on other distrosenhancementMediumRESOLVED
9689+Plauchu EdwinBenjamin EsquivelCreate a python library for automatic device manipulationenhancementMedium+RESOLVED
6607Paul Eggletonbrian averyAuto-detect client locale and use for date formattingenhancementLowRESOLVED
7096Paul EggletonCalifornia Sullivan2Document how to use initramfs featuresenhancementMedium25 Jan 2017: RESOLVEDRESOLVED
8719Paul EggletonEd Bartosh10Ensure bootable images can be supported by wic for all reference BSPsenhancementMediumLETRESOLVED
10751Jair GonzalezEd Bartosh3Add help on all oe scripts exported to the path and display it when no required arguments are specifiedenhancementMediumRESOLVED
10621Ed BartoshEd Bartosh5make bmaptool a recommended tool for flashing imagesenhancementMedium+05 Jan 2017: IN PROGRESS REVIEWRESOLVED
10691Ross BurtonEd Bartosh2buildhistory-diff should detect directory renamesenhancementMedium+RESOLVED
4144Jason WesselHumberto Ibarra2Runtime performance testingenhancementMedium+RESOLVED
4527Stoicescu CornelHumberto Ibarra3create a Runtime performance test layer to enable runtime performance testsenhancementMedium+RESOLVED
4528Stoicescu CornelHumberto Ibarra2boot time should be tracked for systemd and SysVinitenhancementMedium+RESOLVED
5369Saul WoldHumberto Ibarra3Create test plan to do performance analysis of x32 runtimeenhancementMedium+RESOLVED
5477Alexandru GeorgescuHumberto Ibarra2Check for any performance degradations with gcc security flags enabledenhancementMedium+RESOLVED
5478Alexandru GeorgescuHumberto Ibarra2test build time performance degradations with gcc security flags enabledenhancementMedium+RESOLVED
6296Alexandru GeorgescuHumberto Ibarra2Add support for runtime performance tests to image_testsenhancementMedium+RESOLVED
10704Patrick OhlyIsmo Puustinenadd OSTree to update mechanism overviewenhancementMediumRESOLVED
10352Richard PurdieJianxun Zhang15Performance of bitbake -S is horribleenhancementHighRESOLVED
8727Aníbal LimónJose Lamego0.1fetcher: should not log errors but pass them for handlingenhancementMediumRESOLVED
10627Ross BurtonJose Lamego3Way to navigate through patches in a seriesenhancementMedium+RESOLVED
10762Jose LamegoJose Lamego1patchwork: Enable automatic status update when patches are merged for all projectsenhancementMedium+RESOLVED
10489Jose Perez CJose Perez C1"test_1_logrotate_setup" fails on second run of test image due existing filesenhancementMediumRESOLVED
10200Jose Perez CJose Perez C10Create Test Plan for Tinfoil verificationenhancementMedium+RESOLVED
10593Jose Perez CJose Perez C1Add support for testing wic images on all reference hardwareenhancementMedium+RESOLVED
10724Jose Perez CJose Perez C3extend bitbake testing for YP-2.3enhancementMedium+RESOLVED
10778Joshua LockJoshua Lock2Adopt skipStep() throughout the codebaseenhancementMediumRESOLVED
10467Joshua LockJoshua Lock2Link to BuildLog entries from autobuilder UIenhancementMedium+RESOLVED
10502Joshua LockJoshua Lock1Ensure BuildLogger doesn't try and update whilst the target wiki page is being editedenhancementMedium+RESOLVED
3276Ross BurtonJuan Ramos3PulseAudio isn't testedenhancementMediumRESOLVED
10656Juro BystrickyJuro Bystricky1.5Support for out-of-tree development of Zephyr imagesenhancementMedium+RESOLVED
10657Juro BystrickyJuro Bystricky1.5Provide support for menuconfigenhancementMedium+RESOLVED
10658Juro BystrickyJuro Bystricky1Support for IAMCU baremetal toolchain for Zephyr imagesenhancementMedium+RESOLVED
10659Juro BystrickyJuro Bystricky1.5Support for ARC baremetal toolchain for Zephyr imagesenhancementMedium+RESOLVED
10660Juro BystrickyJuro Bystricky2Support for Nios2 baremetal toolchain for Zephyr imagesenhancementMedium+RESOLVED
10662Juro BystrickyJuro Bystricky3Provide "newlib" for Zephyr imagesenhancementMedium+RESOLVED
10917Patrick OhlyJuro BystrickyBBMULTICONFIG: print error when entry has no corresponding config fileenhancementMedium+VERIFIED
7887Randy WittRobert Yang3Add support for user networking to runqemuenhancementHighRESOLVED
10710Robert YangRobert Yang1make it be able to login as root by default when debug-tweaks is not setenhancementMediumRESOLVED
9468Benjamin EsquivelMariano Lopez3Export Tests execution (Runexport.py) execution log needs improvementsenhancementMediumRESOLVED
10233Aníbal LimónMariano Lopez2oeqa: Runner add the ability to output XML test resultsenhancementMedium+RESOLVED
10235Aníbal LimónMariano Lopez2oeqa: Implement OETiemout decoratorenhancementMedium+RESOLVED
10236Aníbal LimónMariano Lopez2oeqa: Implement OETag decorator.enhancementMedium+RESOLVED
10353Mariano LopezMariano Lopez3oeqa allow to filter tests based on different criteriaenhancementMedium+RESOLVED
9481Hongxu JiaMark Hatle2Add example to "5.23. Debugging With the GNU Project Debugger (GDB) Remotely"enhancementMedium+18 Jan 2017: RESOLVEDRESOLVED
10590Markus LehtonenMarkus Lehtonen3build-perf-test: suitable test report formatenhancementMedium+RESOLVED
9377Jose Perez CMonserrat4Enable automated build performance testing in AutobuilderenhancementMedium+RESOLVED
9449Joshua LockPatrick Ohly5[meta-swupd] Reduce runtime of do_swupd_updateenhancementMedium+RESOLVED
6132Mark HatleChen Qi4Have persistent log data (/var/log)enhancementMedium06 Jan 2017: IN PROGRESS REVIEWRESOLVED
10530brian averyRandy Wittadd dumbinit as entry point for crops containersenhancementMediumRESOLVED
1560Richard PurdieRichard Purdie5Enable recipe specific sysrootsenhancementHighRESOLVED
8493Alexandru GeorgescuSonia Delgado5Automate manual BSP test casesenhancementMedium+RESOLVED
7546Joshua LockScott Rifenbark5Streamline application development manualenhancementMedium08 Nov 2016: RESOLVEDRESOLVED
9166Scott RifenbarkScott Rifenbark1Need to document the do_devpyshell task that is in the devshell.bbclassenhancementMedium08 Nov 2016: RESOLVEDRESOLVED
10663Stephano CetolaStephano Cetola5Create BSP binary package classenhancementMedium+RESOLVED
10927Tim OrlingTim Orling1[eclipse-poky][neon] Update to Eclipse Neon.2 (4.6.2) releaseenhancementMediumRESOLVED
8724Alexandru GeorgescuTodor Minchev3Automate information collection for runtime errorsenhancementMedium+4RESOLVED
10747Jose Perez CYi ZhaoAdd support for testing wic images on non x86 platformsenhancementMedium+RESOLVED
   164.6     

M2 Bugs

IDRequesterAssigneeESummary (87 tasks) SeverityPWhiteboardStatus
10332Jianxun ZhangAlejandro Hernandez3gummiboot: purge all gummiboot features and support from OEnormalMediumRESOLVED
5470+Andreea Brandusa ProcaAníbal Limón5bitbake-layers cannot be used with memory resident bitbake runningnormalHighVERIFIED
10826Jose Perez CAníbal Limón2selftest: tests that use runqemu fail on GDC AutobuildersnormalHighVERIFIED
10873Benjamin EsquivelAníbal Limón3bitbake leak fd's and oe-selftest fails with max_user_watches errornormalHighVERIFIED
10254Jussi KukkonenAníbal Limón2esdk tests take very longnormalMediumRESOLVED
10338Joshua LockAníbal Limón0.3perl-native embeds host-dependent variables in sysrootnormalMedium+RESOLVED
10687Mariano LopezAníbal Limón5oeqa: migrate sdk to use the new frameworknormalMedium+VERIFIED
10863Alexander KanavinAníbal Limón1RRS hasn't updated itself since early DecembernormalMedium+RESOLVED
10871Maxin B. JohnAníbal Limón0.2RRS: "Commit" link points to non-existing URLnormalMedium+RESOLVED
10768brian averybrian averyTests for Build Appliance need to be translated to run on the poky containernormalHighRESOLVED
9252Cristina Aguridabrian avery1Build images doesn't work in ToasternormalMedium+RESOLVED
10856brian averybrian avery4crops/poky:tag containers are broken except where tag=ubuntu-14.04normalMedium+RESOLVED
10792 Bruce AshfieldARM-LPAE-Invalidate-the-TLB-for-module-addresses-dur.patch fails to applymajorMedium+RESOLVED
10916André DraszikAndré Drasziklib/oe/rootfs: alternative symlinks not reliably removednormalHighRESOLVED
10791Juan RamosCalifornia Sullivanfailed to add i915 component masternormalMedium+VERIFIED
10808Juan RamosCalifornia Sullivan[Test Case 191] LSB Image does not boot on NUC6i5normalMedium+VERIFIED
10795Leonardo Sandoval GonzalezDaniela Plascencia1patchtest:patchtest-oe: clean import statements on both projectsnormalMediumRESOLVED
10861Leonardo Sandoval GonzalezDaniela Plascenciaperl is not compiling on a OpenSUSE distronormalMedium+RESOLVED
10501Paul GortmakerEd Bartoshdo_image_wic fails with "Error: Couldn't find HDDDIR, exiting"normalMediumRESOLVED
10815Christopher LarsonEd Bartoshwic does not obey ROOTFS_SIZE / IMAGE_ROOTFS_EXTRA_SPACEnormalMediumRESOLVED
10816Christopher LarsonEd Bartosh2wic: errors from exec_cmd don't show the error outputnormalMediumRESOLVED
10468Benjamin EsquivelEd Bartosh1deprecate the use of mkefidisk.shnormalMedium+VERIFIED
10864Mikko YlinenEd Bartosh.wks(.in) search pathsnormalMedium+RESOLVED
10821Olev KartauEd Bartosh0.5oe-selftest: "import git" fails on Ubuntu 14.04majorUndecidedRESOLVED
8192 Plauchu Edwin5python3.4.3 os.fork and os.waitpid (prelink related)minorMediumRESOLVED
10440Plauchu EdwinPlauchu Edwin3Create a reference HW design and a python controlling library for a single power control unitnormalMediumRESOLVED
10904 Plauchu Edwin2python3-pip depends on python3-enum but is not installed by defaultnormalMedium+VERIFIED
10714Humberto IbarraHumberto Ibarra1Need to document workaround for NullPointer in Eclipse MarsnormalMedium06 Jan 2017: RESOLVEDRESOLVED
9369Paul EggletonJair Gonzalez4Extensible SDK: oe-selftest test does not test that update actually worksnormalMediumRESOLVED
10607Jair GonzalezJair Gonzalez3Creation of unit test suite for DevAuto package and its sub packagesnormalMediumRESOLVED
10507Jose LamegoJose Lamego3Patchwork: Create Patchtest results viewnormalMedium+RESOLVED
10734Leonardo Sandoval GonzalezJose Lamego1patchwork: fail tests should send email to submitter and mailing listnormalMedium+RESOLVED
10735Leonardo Sandoval GonzalezJose Lamego2patchwork: patchtest email should reply to the original patchesnormalMedium+RESOLVED
10764Jose LamegoJose Lamego0.5patchwork: Make "PATCH" prefix in subject mandatory for emails to be considered patchesnormalMedium+RESOLVED
10875Joshua LockJose Lamego2oe-selftest failure in test_find_path (oeqa.selftest.pkgdata.OePkgdataUtilTests) on autobuildernormalMedium+RESOLVED
10876Joshua LockJose Lamego2oe-selftest failure in test_list_pkgs (oeqa.selftest.pkgdata.OePkgdataUtilTests) on autobuildernormalMedium+RESOLVED
10877Leonardo Sandoval GonzalezJose Lamego0.5Patchwork is creating new series and/or revisions on behalf of user replies to the original seriesnormalMedium+RESOLVED
10490Jose Perez CJose Perez C2Error on oeqa.runtime.rpm.RpmInstallRemoveTest when running testimagenormalMedium+VERIFIED
10879Joshua LockJoshua LockAutobuilders fail to fetch from zlib.netnormalHighVERIFIED
10788Joshua LockJoshua Lock0.5Should default to not publishing artefactsnormalMediumRESOLVED
10412Tracy GraydonJoshua Lock1Specifying milestone with a DISTRO_VERSION in format of MM.mm.pp will cause build to fail on GetDistroVersionnormalMedium+VERIFIED
10780Joshua LockJoshua Lock4buildlogger doesn't cope well with builds being cancellednormalMedium+RESOLVED
10787Joshua LockJoshua Lock4Resolve autobuilder exceptions due to finishing steps before they've startednormalMedium+RESOLVED
10933Joshua LockJoshua LockNone-validated host distro such as debian-testing results in oe-selftest failuresnormalMedium+RESOLVED
10757Juro BystrickyJuro Bystrickymulticonfig MACHINE ignoredmajorHighVERIFIED
10767brian averyJuro Bystricky2Toaster can not run in Build AppliancenormalMedium+RESOLVED
10894Henry BruceJuro Bystricky1.5Zephyr BOARD value in local.conf is ignorednormalMedium+RESOLVED
10914Joshua LockJuro Bystricky0.5[meta-mingw] nativesdk-mingw-w64-runtime_3.1.0.bb fails in do_configurenormalMedium+RESOLVED
10442Markus LehtonenJussi Kukkonen0.5avahi: deluser and delgroup in postrm scriptnormalMedium+RESOLVED
10853Jussi KukkonenJussi Kukkonenppp fails to build on musl with libc headers for 4.9normalMedium+RESOLVED
10766Daniela PlascenciaLeonardo Sandoval Gonzalez2patchtest: patchtest deletes the content of .git/config in openembedded-corenormalHighRESOLVED
10765Daniela PlascenciaLeonardo Sandoval Gonzalezpatchtest: patchtest guest execution yields a 'Too many open files' message before haltingnormalMedium+RESOLVED
10428Martin JansaRobert Yang2*.qemuboot.conf files are left in DEPLOY_DIR after other image artifacts are removednormalMedium+RESOLVED
10519Yi ZhaoRobert Yang2Can not run multiple QEMU machines under UNFSnormalMedium+VERIFIED
10669  2apt package missing systemd filesnormalMediumRESOLVED
10964Jose Perez CMariano Lopeztestimage: Test suite is not running when images are downloaded from AutobuildernormalHighVERIFIED
10686Mariano LopezMariano Lopez8oeqa: migrate runtime to use the new frameworknormalMedium+RESOLVED
10433Haris OkanovicMarkus Lehtonen2syslog-ng rc5.d symlinks missing after install, broken postinstnormalMedium+Need backport to 2.2.1RESOLVED
10695Patrick OhlyMaxin B. Johnsqlite: upstream performance problemnormalMedium+RESOLVED
9997Benjamin EsquivelMichael Halstead1oe-selftest: make available unittest-xml-reporting at the autobuilder workersnormalMediumRESOLVED
9620brian averyMichael Halstead2Update layer index to django 1.8 ltsnormalMedium+RESOLVED
10376Leonardo Sandoval GonzalezMichael Halstead4patchtest: deploy patchtest on servernormalMedium+RESOLVED
10520Patrick OhlyPatrick Ohly2[meta-swupd] unnecessary changes during updatesnormalMedium+RESOLVED
10177Belen Barros PenaPaul Eggleton1Two openembedded-core entries when searching for recipesnormalMediumRESOLVED
10836Paul EggletonPaul Eggleton0.1Files with names containing square brackets populated by sstate may not be removed properlynormalMediumRESOLVED
10797Ross BurtonPaul Eggleton1ESDK can contain path to build sysroot as SDK sysrootnormalMedium+RESOLVED
10908brian averyPaul Eggletondevtool needs to check to see if locales are set properly for utf-8normalMedium+RESOLVED
10883Randy WittRandy WittIMAGE_TYPEDEP_* doesn't add dependencies needed for conversion typesnormalMedium+RESOLVED
10831Patrick OhlyRichard Purdiemulticonfig: parse multiconfig after base confignormalHighVERIFIED
10796Henry BruceRichard Purdie1devtool: sdk-update fails as git detects changes in layers/poky/bitbake/lib/bb/pysh/pyshtables.pynormalMediumRESOLVED
10344Juro BystrickyRichard Purdie5multiconfig: TMPDIR not handled properlynormalMedium+VERIFIED
10357Juro BystrickyRichard Purdie5multiconfig: error building meta-toolchainsnormalMedium+VERIFIED
10972Jair GonzalezRichard Purdie[Test Case 142] Enable PR service with remote server/local client modenormalMedium+VERIFIED
7142Ross BurtonRoss Burton3cmake.bbclass fails when rebuilding after MACHINE changesnormalMediumNIF 11/13, 11/20, 11/27, 12/04RESOLVED
10449Jan-Simon MoellerRoss Burton3tar-native - task do_populate_sysroot_setscene fails - likely racemajorMedium+RESOLVED
10498Jussi KukkonenRoss Burton2adwaita install failed on autobuildernormalMedium+RESOLVED
10838Jussi KukkonenSaul Woldopenssl-qat fails to build as opensslfoundation.com seems to have dropped of the netnormalMedium+RESOLVED
9553Ross BurtonScott Rifenbark1INHIBIT_PACKAGE_STRIP docs need to be expandednormalMedium08 Nov 2016: RESOLVEDRESOLVED
10076Richard PurdieScott Rifenbark3Docs should have pointer to latest manual at the topnormalMedium05 Feb 2017: RESOLVEDRESOLVED
10178Jose Perez CScott Rifenbark1Python version should be updated to 3.4 on Quick Start and Mega ManualnormalMedium08 Nov 2016: RESOLVEDRESOLVED
10183Maxin B. JohnScott Rifenbark1Needs documentation for PACKAGECONFIG_CONFARGS variablenormalMedium08 Nov 2016: RESOLVEDRESOLVED
10267Jussi KukkonenScott Rifenbark1workaround for missing --with-libtool-sysroot has wrong sysrootnormalMedium08 Nov 2016: RESOLVEDRESOLVED
10588Benjamin EsquivelScott Rifenbark1Exporting Tests section can lead to failed tests without proper specificationmajorMedium14 Nov 2016: RESOLVEDRESOLVED
10886Richard PurdieScott Rifenbark1Improve event documentationnormalMedium23 Jan 2017: RESOLVEDRESOLVED
10909Armin KusterScott Rifenbark1.5build-appliance-image requires pip3 but it isn't installed everywherenormalMedium+25 Jan 2017: RESOLVEDRESOLVED
10212Jianxun ZhangTodor Minchev5Support to deploy non-bootloader-specific files in EFI partition when build hddimg imagenormalMediumRESOLVED
10500Jianxun ZhangTodor Minchev4Benchmark meta-intel build VS generic-x86* build in OEnormalMedium+RESOLVED
   143.6     


M2 Stabilize schedule

Release Candidate and Milestone Release schedule (Full Pass QA test follows every RC build)

  • RC1: 1/23/17
  • M2 release: 2/3/17

M3 (Jan. 23, 2017 to Mar. 10, 2017 -- 8 weeks: planning done in week 1, development week 2-5, stabilization week 6-7, release: week 8)

M3 Feature/tasks Development / Cutoff is Feb. 27, 2017

IDRequesterAssigneeESummary (41 tasks) SeverityPWhiteboardStatus
5427Paul EggletonAníbal Limón5Extend and tidy up layer sanity checkingenhancementMediumRESOLVED
10325Saul WoldAníbal Limón1.5license.bbclass should only copy licenses for packages actually installedenhancementMediumRESOLVED
9592Randy Wittbrian avery4Add a mechanism for creating build appliance as a container imageenhancementHighRESOLVED
10789Leonardo Sandoval GonzalezDaniela Plascencia5patchtest-oe: Include a test case that fails in case pylint issues are found on new patch changesenhancementMedium+RESOLVED
10619Ed BartoshEd Bartosh10Refactor wic codebaseenhancementMediumLETRESOLVED
6359Darren HartFrancisco Pedraza5Include QA tests for kernel-dev manual tasksenhancementMedium+RESOLVED
10754Francisco PedrazaFrancisco Pedraza5QA Kernel-dev test cases for changing configurationenhancementMedium+RESOLVED
10727Jose Perez CHumberto Ibarra4selftest: create unit test for buildhistory_analysis.pyenhancementMedium+VERIFIED
10872Alexander KanavinHumberto Ibarra3Test for PACKAGE_FEED_URIS neededenhancementMedium+RESOLVED
10951Humberto IbarraHumberto Ibarra12Runtime Performance testing frameworkenhancementMedium+RESOLVED
11065Matti-Pekka SivosuoIsmo PuustinenReference Kit RealSense SupportenhancementHighRESOLVED
10624Ross BurtonJose Lamego1Ability to set patch metadata from a mailenhancementMedium+RESOLVED
10819Ross BurtonJose Lamego0.5Support range select in patch listenhancementMedium+RESOLVED
10822Ross BurtonJose Lamego3Multiple select/change state controls in series viewenhancementMedium+RESOLVED
10823Ross BurtonJose Lamego0.5A V2 series wasn't detected as suchenhancementMedium+RESOLVED
9460Juro BystrickyJoshua Lock1Provide a way to automate testing of meta-mingwenhancementMedium+RESOLVED
9596Henry BruceJoshua Lock0.5Build "minimal" extensible SDK installers instead of "full" onesenhancementMedium+RESOLVED
10678Richard PurdieJoshua Lock0.5Drop usage/support of bb.data.expand() and replace with d.expand()enhancementMedium+RESOLVED
11088Joshua LockJoshua Lock1wikilog must handle non-Latin characters in wiki page contentenhancementMedium+RESOLVED
10661Juro BystrickyJuro Bystricky2Provide support to run Zephyr images in QEMUenhancementMedium+RESOLVED
10810Patrick OhlyJuro Bystricky1.5sanity checks also need to run for multiconfigsenhancementMedium+VERIFIED
11049brian averyJuro BystrickyAdd recipe for python3-pip-nativeenhancementMedium+RESOLVED
11074Jussi LaakoJussi LaakoReference Kit must support MinnowBoard Turbot platformenhancementHighRESOLVED
11075Jussi LaakoJussi LaakoReference Kit must support 570x platformenhancementMedium+RESOLVED
10035Mariano LopezLeonardo Sandoval Gonzalez3oe-selftest: Use SSTATES without corrupting them.enhancementHighRESOLVED
9944Leonardo Sandoval GonzalezLeonardo Sandoval Gonzalez1patchtest-oe: check that patch was sent to the correct mailing listenhancementMedium+RESOLVED
10626Ross BurtonLeonardo Sandoval Gonzalez3git-pw needs bundle supportenhancementMedium+RESOLVED
10688Paul EggletonLeonardo Sandoval Gonzalez2Add a test looking for common paths that indicate patch is for the wrong layerenhancementMedium+RESOLVED
8497Alexandru GeorgescuLibertad1Continuous Toaster exploratory testingenhancementMediumRESOLVED
10703Patrick OhlyMariano Lopezadd mender.io to update mechanism overviewenhancementMediumRESOLVED
11037Mariano LopezMariano Lopez5selftest: Optimize use of get_bb_varenhancementMedium+RESOLVED
10558Tim OrlingMichael Halstead3.5Create Nexus instance (a java repository manager)enhancementHighRESOLVED
10924Mikko YlinenMikko Ylinen5RMC: Bring supported RMC functions to systemd-boot efi stubenhancementMedium+RESOLVED
9894Randy MacLeodChen Qi1Investigate porting smartpm, createrepo to python3enhancementMedium+RESOLVED
9502Randy WittRandy Witt5Add a way to build container images using oe-coreenhancementHighRESOLVED
10707Randy MacLeodRandy MacLeodFix CVE defects in openssl by upgrading bugfix/letter releaseenhancementMedium+RESOLVED
8200Ross BurtonRoss Burton1Add acl to default DISTRO_FEATURES?enhancementMediumRESOLVED
10215Richard PurdieRoss Burton4Add a class which allows buiding git upstream versions of code using BBCLASSEXTENDenhancementMedium+RESOLVED
10905 Scott Rifenbark2Difficult to find status of patchenhancementMedium+18 Jan 2017: IN PROGRESS REVIEWRESOLVED
9597brian averyTim Orling2RCPTT initial implementation so that we can automate testing of the pluginenhancementMediumRESOLVED
10092Jianxun ZhangTodor Minchev5RMC: RMC Project - Provide dumpers for fingerprint and database fileenhancementMedium+RESOLVED
   109.5     

M3 Bugs

IDRequesterAssigneeESummary (90 tasks) SeverityPWhiteboardStatus
10491Leonardo Sandoval GonzalezAníbal Limón1sysv init 'respawing too fast' on system startupnormalMedium+VERIFIED
11041Athanasios OikonomouAthanasios OikonomouLSB 4.1: lsb_release script incompatible with busybox head and findnormalMedium+RESOLVED
11012Mariano LopezBenjamin Esquivel1oe-selftest.log is not reporting failures when using xmlrunnernormalHighVERIFIED
9799brian averybrian averyCtrl-c does'nt stop the build for the ostro cli containernormalMediumRESOLVED
9992brian averybrian avery1If we run oe-init-build-env with an argument for builddir, toaster start failsnormalMediumRESOLVED
10755Joe Konnobrian avery1AUTOREV: morty definition results in a RecursionError when setting PV=SRCPV as documentednormalMedium06 Jan 2017: NEEDINFORESOLVED
11006brian averybrian avery0.5runbuilds prints its output to stdout and it should go into a log file and not spam the consolenormalMediumRESOLVED
11000David Lopez Barribabrian avery[Test Case 1588] Fail building images in toasternormalMedium+RESOLVED
9609George McCollisterBruce Ashfield4.1.x: musb fails to compilenormalMediumRESOLVED
10845Jose Perez CBruce Ashfield2test-image: compile and load a kernel module under the qemu-lsb image is failingnormalMediumRESOLVED
10402Jonathan LiuBruce Ashfield1ACPI: No IRQ available for PCI Interrupt Link [LNKD]. Try pci=noacpi or acpi=offnormalMedium+RESOLVED
10524Joshua LockDavid Reyna2Command line build monitoring broken when using custom builddir and config filemajorMediumRESOLVED
10849brian averyDavid Reyna2esdk creation on Toaster has traceback errors from buildinfohelpernormalMediumRESOLVED
10835Saul WoldEd Bartosh2WIC should not rely on hddimg creation for finding all needed artifactsnormalMediumRESOLVED
10783Paul EggletonEd Bartosh2wic should not be writing out to /var/tmp/wicminorMedium+RESOLVED
10881brian averyEd Bartosh1Add warning message to the esdk installer if version (build_host_gcc) > (install_host_gcc)normalMedium+RESOLVED
10998Francisco PedrazaEd Bartosh3IMAGE_FSTYPES=btrfs requires udev-native to buildnormalMedium+VERIFIED
10991Francisco PedrazaFrancisco PedrazaeSDK: Update decoratorsnormalMediumRESOLVED
10647Robert YangFrancisco Pedraza2core-image-minimal: do_testsdkext failedmajorMedium+VERIFIED
10958Francisco PedrazaFrancisco PedrazaLIBXML2 error package requirements libxml-2.0 >= 2.6.26 on eSDKnormalMedium+RESOLVED
10323Henry BruceHenry Bruce1Sample script to create source release for specific licences failsnormalMedium14 Mar 2017: Marked doc flag to "done"RESOLVED
10739Jose LamegoJose Lamego2patchwork: pw should not create new revisions from comments/replies containing patch-like contentnormalMediumRESOLVED
10973Patrick OhlyJose Lamego0.5changing state of patch fails?normalMediumRESOLVED
10756Jose LamegoJose Lamego1patchwork: New patch revision messages should be processed even if they have a duplicated message-idnormalMedium+RESOLVED
10968Jose Perez CJose Perez C2selftest: devtool and recipetool fails on load plugin test.normalMedium+VERIFIED
11005Jose Perez CJose Perez C3distro-testing: Add fedora 25 to supported distrosnormalMedium+RESOLVED
11013Jose Perez CJose Perez C1parselogs: Is failing on Xorg with error " FBDEV(0): mode "640x480" test failed "normalMedium+RESOLVED
10769brian averyJoshua Lock0.5Remove Build Appliance from autobuilder setnormalHighVERIFIED
11099Ed BartoshJoshua Lock0.5nightly-wic build: Autobuilder should build wic-toolsmajorHighRESOLVED
10623Patrick OhlyJoshua Lock0.25removing hardlink removes xattrsnormalMedium+RESOLVED
10986Saul WoldJoshua Lock0.25Re-Enable distro_check and distrodata on Main AutobuildernormalMedium+RESOLVED
11052Saul WoldJoshua Lockpseudo x32 target build failsnormalMedium+RESOLVED
11098Joshua LockJoshua Lock3Wikilog logs jumbled up when multiple controllers reporting to the same pagemajorMedium+RESOLVED
10614Juan RamosJuan Ramos1.5[Test Case 204] intel-corei7-64 sato, lsb and wic images doesn't boot on Cherry Hill platformmajorMedium+VERIFIED
10889Henry BruceJuro Bystricky1Zephyr kernel tests fail to start if python module pexpect is not installednormalMedium24 Jan 2017: RESOLVEDRESOLVED
10971Joshua LockJuro Bystricky1[meta-mingw] nativesdk-pthreads-win32 fails to build with poky master & meta-mingw masternormalMedium+RESOLVED
11022Yi ZhaoJuro Bystricky2Fail to build BA for 2.3 M2 rc3normalMedium+RESOLVED
11026Sona SarmadiJussi Kukkonen1cve-check: Error in executing cve-check-updatenormalMedium+RESOLVED
10884Jose Perez CLeonardo Sandoval Gonzalez5build-perf:time for build "rootfs" is increased in around 20% on 2.3 M1normalHighVERIFIED
10970Humberto IbarraLeonardo Sandoval Gonzalezpybootchartgui.py has not been migrated to python3normalMediumRESOLVED
8525Ross BurtonLeonardo Sandoval Gonzalez1selftest needs to control distro configurationnormalMedium+RESOLVED
8570Jussi KukkonenRobert Yang2problems with gdk-pixbuf and pango loading on multilibnormalMedium+RESOLVED
10471Paul EggletonRobert Yang3runqemu handling of machine not specified needs improvementminorMedium+RESOLVED
10929Richard PurdieMariano Lopez5oe-selftest corrupts sstate cachemajorHighRESOLVED
10978Mariano LopezMariano Lopez1oeqa: add validation to avoid importing build-insnormalMediumRESOLVED
10979Mariano LopezMariano Lopez1testimage.bbclass: Add a check to not run tests with empty suitesnormalMediumRESOLVED
10935Richard PurdieMariano Lopez0.5systemd tests should automatically be run on systemd imagesnormalMedium+RESOLVED
11054Jose Perez CMarkus Lehtonen1selftest: Signing packages failing on ubuntu 16.10 with gpg (GnuPG) 2.1.15normalMedium+RESOLVED
11069Markus LehtonenMarkus Lehtonen1rpm: signing fails with too many subpackagesnormalMedium+RESOLVED
10075Markus LehtonenMaxin B. Johnnettle 2.7.1: inconsistency between LICENSE and LICENSE_<pkg>normalMediumRESOLVED
10056Michael WoodMichael WoodTest failing test_new_duplicates_project_name (tests.browser.test_new_project_page.TestNewProjectPage)normalMediumRESOLVED
10967Martin JansaMichael HalsteadMerged commits are no longer sent to openembedded-commits MLnormalMedium+RESOLVED
11114MonserratMikko YlinenMraaGpio test is failing on Common profile for RefkitnormalLowRESOLVED
11078Patrick OhlyMikko Ylinendoes not boot on NUCnormalMediumRESOLVED
11270Henry BruceMikko YlinenRefKit: populate_sdk_ext fails with SDK_EXT_TYPE="minimal"normalMediumRESOLVED
11272Henry BruceMikko YlinenRefKit: Full extensible SDK fails to installnormalMediumRESOLVED
11113MonserratMikko YlinenMraa hello test is failing on computer vision profile for refkitnormalUndecidedRESOLVED
10101Nic DonaldsonNic Donaldson2When power cycling in masterimage.py, 'shutdown -h now' can return a non-zero exit status because the ssh connection is cutnormalMedium+RESOLVED
11111Patrick OhlyOlev Kartau3enable running oe-selftest tests in CIcriticalMediumRESOLVED
11007Humberto IbarraPatrick Ohlybuild fails after user add/delete commandsnormalMedium+VERIFIED
10961Joshua LockPaul Eggleton1Toolchain environment variables cleaned from environment during devtool usagemajorMedium+RESOLVED
10963Andrea GalbuseraPaul Eggleton0.5devtool sdk-update fails at subsequent runsnormalMedium+RESOLVED
11025Jose Perez CPaul Eggleton1selftest/devtool: Build mdadm failing on Centos7 and Ubuntu 1404normalMedium+RESOLVED
11034Yi ZhaoPaul Eggletondevtool modify doesn't work within eSDKnormalMedium+VERIFIED
9540Joshua LockChen Qi1.5Resolve string formatting issues in console-toolsnormalMediumRESOLVED
10976California SullivanRichard Purdie0.5Broken openssl-native symlinksnormalHighRESOLVED
11172Jose Perez CRichard Purdiebitbake: Fetcher failure when building core-image-minimal with "ERROR: socat: not found"criticalHighVERIFIED
11123Paul BarkerRichard PurdieStripping fixincl fails in gcc-cross-arm and gcc-cross-initial-arm do_populate_sysroot on Debian 9normalMedium+RESOLVED
10700Michel D'HOOGERoss Burton2buildtools + deb packaging: Package nativesdk-buildtools-perl-dummy not foundnormalMedium+RESOLVED
10761Michael GloffRoss Burton1Building Debugfs with nfs-utils-client and ipkgnormalMedium+RESOLVED
10794Joshua LockRoss Burton5Update sanity tests to cope with minimal eSDK installernormalMedium+RESOLVED
10814André DraszikRoss Burton1populate-volatile.sh causes confusing boot messages with read-only-rootfsnormalMedium+RESOLVED
10960Saul WoldRoss BurtonUsing distrodata.bbclass causes task mismatch errorsmajorMedium+RESOLVED
10982Andrea GalbuseraRoss Burtonbuilding eSDK fails after switching from sysinitv to systemdnormalMedium+VERIFIED
10985Blayne DennisRoss Burton1Dbus recipe fails when systemd is enabledmajorMedium+RESOLVED
11002NuboschRoss Burton1dbus: user-session dbus.socket contains path from native sysrootnormalMedium+RESOLVED
11014Mark CharleboisRoss Burtonpackage_qa_check_dbg tries to call a dict as a functionnormalMedium+RESOLVED
10697Ross BurtonSaul Wold10x32 world build fails badlynormalMedium+RESOLVED
10698Ross BurtonSaul Wold5meta-intel doesn't support x32normalMedium+Need to further evaluate and possibly file more bugsRESOLVED
10942NuboschSaul Woldlinux-firmware-ath9k fw ver 1.4.0 in main packagenormalMedium+RESOLVED
10990Humberto IbarraSaul Wold3[crosstap] systemtap error on core-image-minimal with tools-profilenormalMedium+VERIFIED
10999Sean V KelleySaul Woldmeta-intel: Recipes multimedia:libva need to be updated to point to github upstream projectsmajorMedium+RESOLVED
9859Ross BurtonSeebs1setcap doesn't worknormalMediumRESOLVED
1084Saul WoldScott Rifenbark1Quick-Start: Suggest the use of PREMIRROR_prependnormalMedium22 July 2011 - VerifiedVERIFIED
10818Trevor WoernerScott Rifenbark1add documentation on stabilizing host build machine performance for kernel>=4.3 and systemd>=228normalMedium10 Jan 2017: RESOLVEDRESOLVED
10763Martin VuilleScott Rifenbark1recipetool example is incorrectnormalMedium+16 Feb 2017: RESOLVEDRESOLVED
11010Alexandre BelloniScott Rifenbark1documentation for NO_RECOMMENDATIONS is incorrectnormalUndecided03 Feb 2017: RESOLVEDRESOLVED
11009Richard PurdieStephano Cetola2patchelf inflates filesize and causes performance problemsnormalMedium+RESOLVED
11008davidStephano Cetolapoky-morty meta-networking tries to download from samba.org via HTTP and it is no longer supportednormalUndecidedRESOLVED
11019Todor MinchevTodor Minchev1Fix chameleonsocks so it works with Docker Toolbox terminalnormalMedium+RESOLVED
   110     


M3 Stabilize schedule

Release Candidate and Milestone Release schedule (Full Pass QA test follows every RC build)

  • RC1: 2/27/17
  • M3 release: 3/10/17

M4 (Feb. 27, 2017 to May 5, 2017 -- 9 weeks: planning done in week 1, bug fixes 2-5, stabilization week 6-8, release week 9)

M4 Bug/fix Cutoff is April 10, 2017

IDRequesterAssigneeESummary (49 tasks) SeverityPWhiteboardStatus
11080Amaranth ValluriAmaranth ValluriEnabling testing TPM(v1.2) Support on QEMUenhancementMediumRESOLVED
10528brian averybrian avery4Add VNC support for cli containers for QEMUenhancementHighIN PROGRESS REVIEW
10557brian averybrian averyReplace Eclipse Poky plugin with Eclipse CROPS pluginenhancementMediumNEW
11282Stephano CetolaCalifornia SullivanWrite a wic tips and tricks for Minnowboard & JouleenhancementMedium+NEW
11067Dmitry RozhkovDmitry Rozhkov4Reference Kit Industrial Robotics profileenhancementMediumIN PROGRESS IMPLEMENTATION
11068Dmitry RozhkovDmitry Rozhkov2QEMU as a supported platformenhancementMediumRESOLVED
10618Ed BartoshEd Bartosh3Increase oe-selftest coverage of wic codebaseenhancementMedium+RESOLVED
11205Jair GonzalezFrancisco Pedraza5QA: Validate Reference kit supports whole disk encryptionenhancementMediumIN PROGRESS REVIEW
11206Jair GonzalezFrancisco Pedraza5QA: Validate Reference kit supports integrity protectionenhancementMediumIN PROGRESS REVIEW
11250Jair GonzalezFrancisco Pedraza5QA: Validate Secure Boot is enabled on Reference kitenhancementMediumACCEPTED
9962 Diana Thayer1Suggested additions to the --help output re. -v and -DenhancementMediumRESOLVED
11201Jair GonzalezHumberto Ibarra2QA: Validate testing TPM(v1.2) support on QEMU has been enabledenhancementMediumNEW
11203Jair GonzalezHumberto Ibarra2QA: Validate QEMU as a supported platform in RefkitenhancementMediumIN PROGRESS REVIEW
11248Jair GonzalezHumberto IbarraQA: Validate Reference Kit Industrial Robotics profile is enabledenhancementMediumNEW
11084Ismo PuustinenIsmo PuustinenReference kit OpenCL supportenhancementHighRESOLVED
11085Ismo PuustinenIsmo PuustinenComputer vision demo/testing setupenhancementLowWaitForUpstream
11083Ismo PuustinenIsmo PuustinenGPLv3 free computer vision profileenhancementMediumIN PROGRESS REVIEW
11204Jair GonzalezJair GonzalezQA: Validate OpenCL support in Reference kitenhancementHighRESOLVED
11244Jair GonzalezJair Gonzalez1QA: Validate Reference kit has BT audio support on gateway profileenhancementMediumNEW
11246Jair GonzalezJair Gonzalez5QA: Validate Reference kit supports image installerenhancementMediumIN PROGRESS REVIEW
11251Jair GonzalezJair GonzalezQA: Validate updated components for GPLv3 free Computer Vision profileenhancementMediumNEW
11255Jair GonzalezJair Gonzalez2QA: Clean up and enablement of single-node Bluetooth test cases on meta-iotqaenhancementMediumIN PROGRESS DESIGN
11081Matti-Pekka SivosuoJaska UimonenBT Audio SupportenhancementMediumRESOLVED
11027Jose LamegoJose Lamego0.5patchwork: Notify if status-change-through-email was attempted without required privilegesenhancementMediumRESOLVED
11118Benjamin EsquivelJose Perez Cselftest: some testexport tests need a previous build to runenhancementMediumRESOLVED
11076Jussi LaakoJussi LaakoSupported hardware definitionenhancementMediumRESOLVED
11129Jussi LaakoJussi Laakothermald should be included in images without explicit pull-inenhancementMediumRESOLVED
11086Krisztian LitkeyKrisztian LitkeyFlatpak-based 3rd party application supportenhancementMedium+WaitForUpstream
10878Leonardo Sandoval GonzalezLeonardo Sandoval Gonzalez1source code lines should not exceed more than 80 charactersenhancementMedium+RESOLVED
9423Robert YangRobert Yang5devshell: export CONFIGUREOPTS to envenhancementMediumRESOLVED
10249Robert YangRobert Yang5runqemu: add test casesenhancementMedium+RESOLVED
8596Paul EggletonMark Hatle3Document proper way of adding a userspace header for the kernelenhancementMedium04 April 2017: IN PROGRESS REVIEWIN PROGRESS REVIEW
11082Mikko YlinenMikko Ylinenwr-lx-setup distro build assembler studyenhancementLowNEW
11066Mikko YlinenMikko Ylinen4Reference Kit Secure BootenhancementMediumIN PROGRESS IMPLEMENTATION
11070Patrick OhlyPatrick Ohly2whole-disk encryptionenhancementMediumRESOLVED
11071Patrick OhlyPatrick Ohly2installer imageenhancementMediumRESOLVED
11072Patrick OhlyPatrick Ohly2integrity protectionenhancementMediumRESOLVED
6432Richard PurdiePaul Eggleton2Document an example SDK usage workflowenhancementMedium+10 Oct 2016: Some thoughts about the solutionACCEPTED
6437Belen Barros PenaPaul Eggleton2Document how to set up the Yocto Project for production workenhancementMedium+ACCEPTED
6700Ross BurtonChen Qi2systemd's resolved conflicts with connmanenhancementMediumRESOLVED
8314Robert YangChen Qi5warn when ALTERNATIVE_PRIORITY are the sameenhancementMediumRESOLVED
10596Leonardo Sandoval GonzalezRichard Purdie5Enable tests of layers for compatibility (YP Compatible v2)enhancementHigh27 March 2017: Setting to 2.3 M4RESOLVED
9037Armin KusterRichard Purdie1Consider alternate methods for maintain Yocto releases after 1yrenhancementMedium+NEW
9070Ross BurtonRoss Burton3Add test that locales are workingenhancementMediumACCEPTED
8631Paul EggletonScott Rifenbark3Fully document sysroot populationenhancementMedium13 April 2017: IN PROGRESS REVIEWIN PROGRESS REVIEW
10692Paul EggletonScott Rifenbark1Add references to SYSROOT_DIRSenhancementMedium18 Nov 2016: IN PROGRESS REVIEWRESOLVED
11021Paul EggletonScott Rifenbark2Section on source archiving needs to discuss filtering optionsenhancementMedium10 April 2017: RESOLVEDRESOLVED
9675Alexander KanavinScott Rifenbark30Replacing/updating smartpm/createrepoenhancementMedium+10 April 2017: RESOLVEDRESOLVED
11079Tim OrlingTim Orling0.5devtool deploy.py should allow for changing the port for ssh/scpenhancementMediumRESOLVED
   122     

M4 Bugs

IDRequesterAssigneeESummary (166 tasks) SeverityPWhiteboardStatus
11095Stavros VagionitisArmin Kuster1Error building tpm-tools v1.3.9normalMediumIN PROGRESS DESIGN
10314 Alejandro Hernandez3Installing Yocto on EFI systemsminorMediumNEW
10425Maxin B. JohnAlejandro Hernandez3poky-tiny distro shows Kernel config warnings during qemux86 buildnormalMediumAdd release notes for 2.2IN PROGRESS DESIGN
9542Joshua LockAlexander Kanavin1.5Resolve string formatting issues in expectnormalMediumRESOLVED
11167Mark HatleAlexander Kanavinrpm 4 has a different set of subpackages then rpm 5normalMedium+RESOLVED
7174Paul EggletonAníbal Limón1AUH can't tell when MACHINE is set with = in local.conf and thus multi-machine build won't worknormalLowACCEPTED
6128Paul EggletonAníbal Limón2Incorrect wildcard unpack behaviour in fetchernormalMediumRESOLVED
6129Paul EggletonAníbal Limón2Local directories unpack to a different location than local filesnormalMediumRESOLVED
9349Dimitrij GesterAníbal Limón2Jethro build fails for core-image-x11 with package_debnormalMediumRESOLVED
10842Jose Perez CAníbal Limón0.5testrunner test timeout can lead to garbage outputnormalMediumRESOLVED
10899Alexander KanavinAníbal Limón1version mismatch between recipe and tarball linknormalMediumNEW
11162Patrick OhlyAníbal Limón0.5yocto-compat-layer: filter out false positives (?)normalMedium+RESOLVED
11164Aníbal LimónAníbal Limón1yocto-compat-layer: Add support to isolate the environmentnormalMedium+RESOLVED
11300Jose Perez CAníbal Limón2selftest: do_populate_sdk_ext task failing on eSDK test on GDC ABsnormalMedium+REOPENED
8721Belen Barros PenaAwaisWe are not validating machine inputminorLowGUI design availableRESOLVED
10098Henry BruceBrendan Le Foll3npm fetcher is not documented in bitbake manualnormalMedium29 Nov 2016: IN PROGRESS DESIGNIN PROGRESS DESIGN
11119Juan Ramosbrian avery2runqemu-extract-sdk is failing when extracting .tar.bz filenormalHighRESOLVED
11170Jussi Kukkonenbrian avery2runqemu broken with recipe sysrootsnormalHighRESOLVED
11223Yi Zhaobrian avery1devtool runqemu doesn't work in eSDKnormalHighRESOLVED
11375Jose Perez Cbrian averytestimage; runqemu not working when images are downloaded (not built)normalHighIN PROGRESS REVIEW
10798Henry Brucebrian avery0.5Extensible SDK: sdk-update fails with error if no updates are availablenormalMediumNEW
10858Yi Zhaobrian avery2Can not stop tcf-agent daemonnormalMediumNEW
11220oscar lopez arandasbrian averyrunqemu: Qemux86 not boot with UbuntunormalMediumNEW
11148brian averybrian avery1switch crops/poky to ubuntu 16.04 LTSnormalMedium+RESOLVED
11222Libertadbrian avery[eclipse] C compiler cannot create executables when reconfiguring projectnormalMedium+NEW
10455Jair GonzalezCalifornia Sullivan[Test Case 1059] Parselogs is failing on genericx86 (32 and 64 bits) giving error: blk_update_request: I/O error, dev loop0normalMediumIN PROGRESS DESIGN
10628Juan RamosCalifornia Sullivan0.75Parselogs: Failed to obtain handles for "Service Changed" characteristicnormalMediumIN PROGRESS REVIEW
10928Tim OrlingChin Huat Ang1[eclipse-poky] YoctoSDKUtils.java is missing support for qemuarm64 and qemumips64 targetsnormalMediumACCEPTED
10930Leonardo Sandoval GonzalezDaniela Plascencia1Skip SRC_URI checksum related tests on GIT recipesnormalMedium+RESOLVED
10850brian averyDavid Reyna4esdk creation on Toaster does not show necessary file in artifactsnormalMediumRESOLVED
10851brian averyDavid Reyna1sdk creation on Toaster does not show any files in artifactsnormalMediumRESOLVED
11225David Lopez BarribaDavid Reyna1Build from Command line fail when finish all the tasksnormalMediumRESOLVED
11213BogDan VatraDavid Reyna2Cannot add layers in Machine pagemajorMedium+RESOLVED
11317David ReynaDavid ReynaToaster filters are brokenmajorMedium+RESOLVED
11312David Lopez BarribaDavid Lopez Barriba[Test Case 1735] test_dnf_help fails and all the others dnf test are skippednormalMedium+RESOLVED
10224daweidawei2oeqa/utils/sshcontrol.py:SSHProcess decode stdout data failnormalMediumRESOLVED
10456Yi Zhaodengke3X can not launch on qemumips64normalMedium+Need backport to 2.2.1RESOLVED
11341Ismo PuustinenDmitry RozhkovSystemctl fails to rename usb network interfacesnormalMediumNEW
10833Jose Perez CEd Bartosh5runqemu / wic: IP of tap is not being set when launching .wic image on qemux86*normalMedium+RESOLVED
11163Jose Perez CEd Bartosh1Error "Rootfs is too small for BTRFS" when building image with IMAGE_FSTYPES=btrfsnormalMedium+VERIFIED
11295brian averyEd Bartosh2do_image_wic: fails when rm_work is activenormalMedium+RESOLVED
11307Paulo NevesEd Bartoshsstate.bbclass tries to modify mirror filesnormalMedium+RESOLVED
11050Saul WoldFlavio5kexec-tools fails to build with x32 as DEFAULTTUNEnormalMedium+RESOLVED
9001Gatis PaeglisGatis Paeglis2bootimg.bbclass does not ducument GRUB boot lodader supportnormalMediumNIR 4/7, 4/14, 4/21 - 20 Mar 2017: NEEDINFONEEDINFO
9566Henry BruceHenry Bruce4devtool documentation is duplicated in dev and sdk manualsnormalMedium+16 Feb 2017: Moved target to 2.3M4 and setting to NEEDINFOACCEPTED
10258Mark HatleHongxu Jiabitbake package-index does not work with 'rpm'normalMedium+VERIFIED
10717Joe KonnoJoe Konno1KERNEL_IMAGE_BASE_NAME: morty definition does not match poky's codenormalMedium31 Jan 2017: NEEDINFORESOLVED
11140Jose LamegoJose Lamego0.5patchwork: Web UI throws an error instead of series view when user is not authenticatedmajorHighRESOLVED
10959Jose LamegoJose Lamego1patchwork: failed to create new series revisions from emails in a threadnormalMediumRESOLVED
11200Jose LamegoJose Lamego1patchwork: Bundle paging links drop "archive" query parameternormalMediumRESOLVED
10812Nicolas DechesneJose Lamego1python3 fails to run with multilibnormalMedium+RESOLVED
11156Leonardo Sandoval GonzalezJose LamegoPatches containing long lines are split by patchworknormalMedium+RESOLVED
11284Jair GonzalezJoshua Lock1selftest: tests that capture output fail on GDC AutobuildersnormalHighRESOLVED
10448Paul EggletonJoshua Lock2Package files already existed at Publishing Artifacts stepmajorMedium+RESOLVED
10582Markus LehtonenJoshua Lock1Automated Git storage of build perf test resultsnormalMedium+IN PROGRESS REVIEW
11326California SullivanJoshua Locknightly-mips64 SDK sanity check failure on master-nextnormalMedium+RESOLVED
11134Robert BergerJuro Bystricky1Python Exception <class 'ImportError'> No module named 'imp'normalMediumRESOLVED
11062Tom RiniJuro BystrickyUnable to build recent U-Boot with SDKnormalMedium+ACCEPTED
11116Joshua LockJuro Bystricky[meta-mingw] nativesdk-mingw-w64-runtime_3.1.0.bb fails in do_compile on the ABnormalMedium+RESOLVED
11144Juro BystrickyJuro Bystricky1Build Appliance : Toaster requires pod2mannormalMedium+VERIFIED
11166Henry BruceJuro Bystricky2multiconfig: builds fails due to quilt-native errors when targeting arduino-101 and arduino-101-sssnormalMedium+VERIFIED
11210Patrick OhlyJuro Bystricky1tinfoil: parse_recipe() fails for multiconfig pnsnormalMedium+RESOLVED
11396Alexander LarssonJussi KukkonenOpenSSL soname "wrong"normalHighRESOLVED
9541Joshua LockJussi Kukkonen2Resolve string formatting issues in cmakenormalMediumRESOLVED
9545Joshua LockJussi Kukkonen1.5Resolve string formatting issues in kexec-toolsnormalMediumRESOLVED
10287Gary ThomasJussi Kukkonen1gst-play is brokennormalMedium+RESOLVED
11221Jose Perez CJussi Kukkonen1pTest: various quilt test cases are failingnormalMedium+RESOLVED
11239Jussi KukkonenJussi Kukkonen3native recipes should not care about DISTRO_FEATURES / MACHINE_FEATURESnormalMedium+RESOLVED
11296California SullivanJussi Kukkonenopenssl.cnf not in expected location for openssl-nativenormalMedium+RESOLVED
11311oscar lopez arandasJussi KukkonenMedia player is not play audio neither video on corei7-64_NUCnormalMedium+WaitForUpstream
11384Jussi KukkonenJussi Kukkonenimage does not contain all RDEPENDS with package_rpmnormalMedium+RESOLVED
11267Yi ZhaoKevin Hao2X can not launch on beaglebonenormalHighVERIFIED
11154Jose Perez CLeonardo Sandoval Gonzalez0.5buildperf: Fedora machine failing on buildperf execution due could not find 'ip' toolnormalHighVERIFIED
10890Leonardo Sandoval GonzalezLeonardo Sandoval Gonzalez1Selftest OePkgdataUtilTests fails on poky-tiny distronormalMedium+VERIFIED
10891Leonardo Sandoval GonzalezLeonardo Sandoval Gonzalez1Selftest test_devtool_update_recipe_local_patch_gz fails on poky-tiny distronormalMedium+VERIFIED
10902Leonardo Sandoval GonzalezLeonardo Sandoval Gonzalez1several wic unit tests on selftest fail if distro is poky-tinynormalMedium+VERIFIED
10903Leonardo Sandoval GonzalezLeonardo Sandoval Gonzalez1test_recipetool_create_git fails on poky-distro due to x11 feature requirementnormalMedium+RESOLVED
11057Robert BergerLeonardo Sandoval Gonzalez1yocto-layer creates faulty examplenormalMedium+RESOLVED
11174Yi ZhaoLeonardo Sandoval Gonzalez0.5Update yocto-bsp script for kernel 4.10normalMedium+VERIFIED
11231Mariano LopezLeonardo Sandoval Gonzalez1gpgme: do_configure task failsnormalMedium+RESOLVED
9808Michael WoodLibertad5Create selenium tests for project dashboard pagenormalMediumRESOLVED
9660Benjamin EsquivelLibertad3Create a YP-2.3 test plan for SWUpdnormalMedium+RESOLVED
11160Patrick OhlyLibertad0.2yocto-compat-layer.py: write report to stdout, not stderrnormalMedium+RESOLVED
9404Jate SujjavanichRobert Yang3Smart will remove RECOMMENDS during a remove commandnormalMediumRESOLVED
9544Joshua LockRobert Yang1.5Resolve string formatting issues in gettextnormalMediumRESOLVED
10941Jan-Simon MoellerRobert Yang1runqemu -h or runqemu --help throw errornormalMedium+RESOLVED
11073Patrick OhlyRobert Yang3runqemu: do no rely on grepping imagesnormalMedium+RESOLVED
11141brian averyRobert Yang3runqemu ignores the environment variables KERNEL,MACHINE, and ROOTFSnormalMedium+RESOLVED
11232Yi ZhaoRobert YangThe qemu can not get correct ip in meta-ide-support environmentnormalMedium+VERIFIED
11349California SullivanRobert Yang1nightly-x86 acl compilation failure on master-nextnormalMedium+RESOLVED
10342Joshua LockMariano Lopez2Lots of debug noise "while parsing exportTests"minorMediumRESOLVED
10980Mariano LopezMariano Lopez1oeqa: skip modules that start with underscorenormalMediumRESOLVED
10188Mark HatleMarkus Lehtonen3sanity.bbclass: config re-write doesn't appear to worknormalMedium+RESOLVED
8078Richard TollertonMaxin B. John3useradd.bbclass: useradd_preinst not run when rebuilding on second MACHINEmajorMedium+RESOLVED
11124Peter KjellerstedtMaxin B. JohnProblem with RSS and functions that modifies files installed into RSS by other recipescriticalMedium+RESOLVED
11322California SullivanMaxin B. Johnnightly-checkuri failed ednormalMedium+RESOLVED
11117Leonardo Sandoval GonzalezMichael Halstead1patchwork not sending emails on behalf of patchtestmajorHighRESOLVED
10382Armin KusterMichael Halstead5master - nightly-mips-lsb failednormalMedium+RESOLVED
11039Tim OrlingMichael Halstead4Finalize authentication (SSH keys desired) for Nexus instance (java artifact repository manager)normalMedium+ACCEPTED
11101Alexander KanavinMichael Halstead0.25autobuilder.yocto.io is not accessible from some browsers (due to invalid cipher?)normalMedium+NEW
11030Mikko YlinenMikko Ylinen1systemd-boot EFI stub: Don't read RMC db in SecureBoot modenormalMediumIN PROGRESS REVIEW
11271Henry BruceMikko Ylinen1RefKit: 'devtool modify mraa' fails when using eSDKnormalMediumRESOLVED
11298Henry BruceMikko Ylinen1RefKit: eSDK toolchain environment variables have incorrect pathnormalMedium+RESOLVED
11319Juro BystrickyNathan Rossi"go" recipes trigger warnings/error messages for unrecognized MACHINEs.normalMedium+VERIFIEDRESOLVED
11277Patrick OhlyOlev Kartau14CI: enable the use of KVM for running selftestsnormalMediumRESOLVED
11276Patrick OhlyOlev KartauCI: oe-selftests must have BUILD_ID setnormalMedium+RESOLVED
10898Patrick OhlyPatrick Ohly1LIC_FILES_CHKSUM: unclear meaning of begin/endlinenormalMedium27 March 2017: Marked the doc flag to "done." Fix should be complete now.RESOLVED
11017Patrick OhlyPatrick Ohly2wic: per-image native tool dependenciesnormalMedium+04 April 2017: RESOLVEDRESOLVED
11161Patrick OhlyPatrick Ohly2yocto-compat-layer: show signature differencesnormalMedium+RESOLVED
10760Henry BrucePaul Eggleton2devtool: fails to build project 'npm://registry.npmjs.org;name=statsd;version=0.8.0'normalMediumIN PROGRESS IMPLEMENTATION
10447Henry BrucePaul Eggleton1eSDK: runqemu fails unless unless DEPLOY_DIR_IMAGE is setnormalMedium+RESOLVED
10785Paul EggletonPaul Eggleton2shell logging function appears to break task outputnormalMedium+NEW
10807Henry BrucePaul Eggleton1Extensible SDK: sdk-update deletes some meta-datanormalMedium+NEW
10992Paul EggletonPaul Eggleton2devtool: add: check for nodejs-native broken since recipe specific sysroots changesnormalMedium+RESOLVED
11185Juan RamosPaul Eggleton1selftest/devtool: failing when parsing “mraa” recipenormalMedium+VERIFIED
11275Patrick OhlyPaul Eggleton2tinfoil: some output gets duplicatednormalMedium+ACCEPTED
11193Yi ZhaoChen Qirunqemu can not launch image if enable "rm_work"normalHighRESOLVED
6016Alexandra SaftaChen Qi5CrossTap has issues on running scheduler script against qemuppcnormalMediumRESOLVED
10953Ross BurtonChen Qi2util-linux installs libtool wrapper scripts instead of binaries for ptestnormalMediumACCEPTED
11266Patrick OhlyChen Qirunqemu: fails when rm_work is activenormalMedium+RESOLVED
10311brian averyRandy Wittsupport netbios name resolution when using samba containernormalMedium+RESOLVED
10642Yann DirsonRandy MacLeod2BUILD_CC and such are missing from variable indexnormalMedium20 April 2017: NEEDINFOIN PROGRESS DESIGN
11292Jair GonzalezRichard PurdieSanity testing distros not working correctly on Autobuilder and causing selftest failuresnormalHighRESOLVED
11110George McCollisterRichard PurdieTOPDIR, DEPLOY_DIR aren't in BB_HASHBASE_WHITELISTnormalMediumRESOLVED
11262Holger FreytherRichard Purdiewget.py: Handling of ud.user is wrong/outdatednormalMediumRESOLVED
10983Jair GonzalezRichard Purdie1[Test Case 810] Avoid cache reload for incremental development using a backgrounded bitbake servernormalMedium+RESOLVED
11042Yi ZhaoRichard PurdieFail to build sdk_ext if enable 'rm_work'normalMedium+VERIFIED
11107Mikko YlinenRichard Purdie1Improve docs about SSTATE_MIRROR usage with uninativenormalMedium+NEW
11237Jussi KukkonenRichard Purdiekernel repo does not exist during unpacknormalMedium+RESOLVED
11139Yocto UserRoss BurtonLocale settings does not have effectsnormalHighRESOLVED
11190Phil WiseRoss BurtonERROR: file-native-5.28-r0 do_fetch: Fetcher failure for URL: 'git://github.com/file/file.git'.normalHighRESOLVED
11152Lukas BulwahnRoss Burtonboost: type error when including libs/python/src/numpy/dtype.cpp while compilingnormalMediumRESOLVED
10271Joshua LockRoss Burton3KeyError exception when pushing buildhistory failsnormalMedium+RESOLVED
10597Jose Perez CRoss Burton2license_create_manifest fails when linux-dummy is used to create own kernelnormalMedium+NEW
10629Chen QiRoss Burton5package brought in by runtime dependency of a complementary package does not have its own complementary package installednormalMedium+NEW
11089Leonardo Sandoval GonzalezRoss Burton2License manifest creation failsnormalMedium+NEW
11104Ismo PuustinenRoss Burton2boost libboost_python3.so.1.62.1 links incorrectly against Python 2 C APInormalMedium+RESOLVED
11135Paul EggletonRoss Burton1irda-utils do_populate_lic warning indicates encoding handling issueminorMedium+RESOLVED
11153Yocto UserRoss BurtonGenerated locales does not support UTF-8 encodingnormalMedium+RESOLVED
11240Tristan Van BerkomRoss Burtonlibjpeg-turbo fails to build for aarch64/arm targets on aarch64 hostnormalMedium+RESOLVED
11256Ross BurtonRoss BurtonHOSTTOOLS can link to directoriesnormalMedium+RESOLVED
11259Ross BurtonRoss Burton1systemd.bbclass doesn't wipe units in native / or should nativesdk unset DISTRO_FEATURESnormalMedium+RESOLVED
11313Ming LiuRoss BurtonAs a developer, I want to avoid churn of cross,crosssdk,nativesdk,cross-canadian do_populate_sysrootnormalMedium+RESOLVED
11120Jonathan RichardsonSaul Woldperf doesn't compile when devtool used with kernelnormalMediumNEW
11051Saul WoldSaul Wold2gnu-efi fails to build with x32 gnu/stubs-64.h missingnormalMedium+RESOLVED
11230Leonardo Sandoval GonzalezSaul WoldBuilding the virtual/kernel of a i386 BSP created by yocto-bsp failsnormalMedium+RESOLVED
11336David Lopez BarribaSaul WoldTestimage [Test Case 195] rpm.RpmInstallRemoveTest is failing on corei7-64normalMedium+RESOLVED
10095 Scott Rifenbark1Suggested documentation for the currently undocumented *_task-foo override syntaxnormalMedium10 April 2017: RESOLVEDRESOLVED
10405KarimScott Rifenbark3[bitbake] Missing SRC_URI "path_spec" option for SVN fetchernormalMedium16 Mar 2017: RESOLVEDRESOLVED
10887Richard PurdieScott Rifenbark5Add specific QA strategy section to the manualnormalMedium10 April 2017: RESOLVEDRESOLVED
10946George McCollisterScott Rifenbark3Document correct use of BSP directory in layernormalMedium27 Mar 2017: RESOLVEDRESOLVED
11048Jose Perez CScott Rifenbark2Missing documentation about generation of rpm signed packages.normalMedium10 April 2017: RESOLVEDRESOLVED
11263Henry BruceScott Rifenbark1Eclipse download text refers to http://www.eclipse.org/neon, but hyperlink is to http://www.eclipse.org/marsnormalMedium30 March 2017: RESOLVEDRESOLVED
10350Henry BruceScott Rifenbark4devtool: deploy-target: deploy run time dependenciesnormalMedium+12 April 2017: RESOLVEDRESOLVED
10854brian averyScott Rifenbark1Missing package in Quick Start Guide for debiannormalMedium+29 March 2017: RESOLVEDVERIFIED
10855brian averyScott Rifenbark1Missing package in Quick Start Guide for fedoranormalMedium+20 Feb 2017: RESOLVEDVERIFIED
10888Richard PurdieScott Rifenbark4Add documentation about releases and release processnormalMedium+16 Mar 2017: RESOLVEDRESOLVED
10995Robert BergerScott Rifenbark1AUTOREV/AUTOINC not autoincrementing?normalMedium+19 April 2017: RESOLVEDRESOLVED
11310Robert BergerScott Rifenbark1host packages wrong for Ubuntu 16?normalMedium+20 April 2017: IN PROGRESS REVIEWIN PROGRESS REVIEW
11274Patrick OhlyScott Rifenbark1PACKAGE_WRITE_DEPS + pkg scripts dependencies need to be documentednormalUndecided04 April 2017: RESOLVEDRESOLVED
10993Geoffroy Van CutsemStanley Phoong1eSDK installation log file is incomplete in case of failurenormalMedium+RESOLVED
10949Stephano CetolaStephano Cetola3do_rootfs: missing file dependancies should error regardless of PACKAGE_CLASSESnormalMedium+RESOLVED
11171Andrea GalbuseraStephano Cetola1devtool: finish/update-recipe fail to capture kernel config changesnormalMedium+RESOLVED
11327oscar lopez arandasTodor Minchev1Install opption is not not displayed when booting core-image-sato-sdk-intel-core2-32.hddimgnormalMedium+RESOLVED
11090Ross BurtonNg, Wei Tee1linux-firmware-carl9170 doesn't set LICENSEnormalMedium+RESOLVED
11226Ross BurtonChoong YinThongRemove all use of fedorahosted SRC_URInormalMedium+RESOLVED
   234.7     


M4 Stabilize schedule

Release Candidate and Milestone Release schedule (Full Pass QA test follows every RC build)

  • RC1: 4/10/17
  • RC2: 4/17/17
  • RC3: 4/24/17
  • M4 release: 5/5/17

Yocto Project 2.3 release unscheduled features/tasks list

These features/tasks are planned for 2.3, but have not been scheduled to any specific milestone. As we move forward, more of these will be scheduled into each milestone, especially during milestone planning for each milestone above.

no bugzilla tickets were found
no bugzilla tickets were found
IDAssigneeESummary (105 tasks) SeverityPMilestoneWhiteboardStatus
5520Alejandro Hernandez40poky-tiny enhancementsenhancementMedium2.3On Track for Initial ImplACCEPTED
9921Benjamin Esquivel3oe-selftest naming test guidelinesnormalMedium2.3NEW
7819brian avery5Support multi-image debuggingenhancementMedium2.3NEW
10110California Sullivan1.5parselogs/intel-core-i7-64 on cherryhill /irq stat interface fatal error/failed to enable keyboardnormalMedium2.3IN PROGRESS REVIEW
11061Dmitry Rozhkov2RMC DB: qemu virtual machines need serial console settings (or default?)normalMedium2.3NEW
11115yeoh ee pengDownloading cvs tarball for buildcvs.py selftest shouldn't use /tmpnormalMedium2.3NEW
9539Diana Thayer3Resolve string formatting issues in busyboxnormalMedium2.3NEW
10784Giouli2devtool: Misleading error message when running "devtool runqemu" before building imagenormalMedium2.3NEW
6420Hongxu Jia5Detect and error when required packages are not producedenhancementMedium2.3NEW
7018Hongxu Jia3archiver missing tasks between do_unpack and do_patchnormalMedium2.3IN PROGRESS REVIEW
7149Hongxu Jia5rpm: print which pkgname for warningenhancementMedium2.3NEW
8446Hongxu Jia5fix .pyc/.pyo buildpaths issueenhancementMedium2.3NEW
10308Hongxu Jiarpm installs bad signature package with option --nodigest --nosignature failednormalMedium2.3NEW
10487Hongxu Jiareadline examples should go in -doc packagenormalMedium2.3NEW
10948Jonathan Richardson3buildhistory not reporting srcrev's when using sstate cachenormalMedium2.3NEEDINFO
6278Juro Bystricky3runqemu without /etc/resolv.confenhancementMedium2.3NEW
8074Juro Bystricky1Graphic display using Virtual Box differs from VMwarenormalMedium2.3IN PROGRESS REVIEW
9442Juro Bystricky2Please add virtio console to qemux86-64.confenhancementMedium2.3IN PROGRESS DESIGN
6077Jussi Kukkonen2piglit depends on libx11enhancementMedium2.3ACCEPTED
6378Jussi Kukkonen1libfakekey patch to allow shift-ed version of symbol not already in keymapnormalMedium2.3NEW
7040Jussi Kukkonen5Support for /usr merge (à la systemd and Fedora)enhancementMedium2.3IN PROGRESS DESIGN
7054Jussi Kukkonen2Need remote profiler (sysprof or eclipse?)normalMedium2.3ACCEPTED
8586Jussi Kukkonen1multilib build includes 32bit connman without good reasonnormalMedium2.3IN PROGRESS REVIEW
9350Jussi Kukkonen4As a developer, I want a global variable exist for choosing the default SSL/TLS provider.enhancementMedium2.3NEW
10025Jussi Kukkonen4Missing 'Connection Manager' icon for qemumips and qemumips64normalMedium2.3NEW
10266Jussi Kukkonen2Add ptest for gnutlsenhancementMedium2.3NEW
8582Mark Hatle2Error message not in log filenormalMedium2.3NEW
9782Markus Lehtonen4Add support for parallel gzip to package creationenhancementMedium2.3NEW
10622Markus Lehtonen3buildstats: use JSON formatenhancementMedium2.3NEW
10867Markus Lehtonen3bitbake with extra fetcher fails allow SRCPVnormalMedium2.3NEW
11053Markus Lehtonen2insane.bbclass: Verify shebang line length validenhancementMedium2.3NEW
10525Otavio SalvadorChromium 52 segfaults on i.MX6 duallitenormalMedium2.3NEW
5057Paul Eggleton4Conflict when building SDK for image containing dropbear and openssh-sftp-servernormalMedium2.3Release NoteACCEPTED
6626Paul Eggleton1Add an example for debugging software with the corresponding -dbg packagenormalMedium2.3NEW
7852Paul Eggleton1bitbake-layers layerindex-fetch doesn't respect branch (-b|--branch) optionnormalMedium2.3IN PROGRESS DESIGN
8840Paul Eggleton4Failure to build 32 bit eSDK on a 64 bit hostenhancementMedium2.3NEW
8909Paul Eggleton2Mention standard fetcher options also in fetcher seaction (not only in SRC_URI in the glossary)enhancementMedium2.3NEW
9360Paul Eggleton4devtool: update-recipe ignores SRC_URI_appendnormalMedium2.3NEW
9479Paul Eggleton2Extensible SDK breaks if python-dependent items added to TOOLCHAIN_HOST_TASKnormalMedium2.3NEW
9627Paul Eggleton4devtool seems to mangle incorrectly the .bb file, when modifying the set of patches for a componentnormalMedium2.3NEW
10237Paul Eggleton2bitbake -c cleanall on npm fetched recipe will prevent fetching other versions of the same packagenormalMedium2.3NEW
10939Paul Eggleton1devtool: upgrade: handle toplevel directory (S) changing in upstream tarballnormalMedium2.3NEW
11011Paul Eggleton1Double parse on eSDK installationnormalMedium2.3NEW
11015Paul Eggleton2devtool: fails to add node.js project that has local dependencynormalMedium2.3NEW
11028Paul Eggleton1devtool: source and object files are packaged when building npm gyp projectnormalMedium2.3NEW
11029Paul Eggleton0.5devtool: generated node.js recipes should use npm version unless overriddennormalMedium2.3NEW
11036Paul Eggleton1In certain cases devtool reset will fail, but bitbake -c clean will succeednormalMedium2.3NEW
8087Khem Raj2eglibc patch bugnormalMedium2.3ACCEPTED
9417Khem RajBring clang/llvm compiler infrastructure to OE-CoreenhancementMedium2.3ACCEPTED
9543Khem Raj4Resolve string formatting issues in gccnormalMedium2.3NEW
10312Randy MacLeodFailed to execute child process "oe-gnome-terminal-phonehome" (No such file or directory)normalMedium2.3IN PROGRESS REVIEW
4143Richard Purdie5Support real-time logging when using bitbake interactivelyenhancementMedium2.3NEW
5395Richard Purdie5Nativesdk postinstalls directory issues.normalMedium2.3NEW
7298Richard Purdie5packagegroups are not rebuilt when rdependency pkg name changesnormalMedium2.3NEW
7846Richard Purdie1devshell cannot be kept open across rebuildsenhancementMedium2.3NEW
7877Richard Purdie3Depending on the error found, inconsistent line reported.normalMedium2.3NEW
7879Richard Purdie3Depending on the name of a recipe, the build succeeds or fails.normalMedium2.3NEW
7960Richard Purdie5Feature Request: to enable poky to support building multilib native commandsenhancementMedium2.3NEW
8161Richard Purdie2Can't use "\" characters in SRC_URI entries - not even escapednormalMedium2.3NEW
8805Richard Purdie1Detect and warn people naming functions something_remove_somethingnormalMedium2.3NEW
8828Richard Purdie3pTest - lttng-tools tests failnormalMedium2.3ACCEPTED
9061Richard Purdie5git fetcher inconsistency for working with PREMIRRORS.normalMedium2.3NEW
9272Richard Purdie1BBCLASSEXTEND="cross" overrides do_install()normalMedium2.3NEW
9279Richard Purdie1Issue with PREFERRED_PROVIDER interaction with overridesnormalMedium2.3NEW
9762Richard Purdie3Add support for poisoning of variablesenhancementMedium2.3NEW
9888Richard Purdie1uninative cannot find tarball when using "own-mirrors" and BB_NO_NETWORKnormalMedium2.3NEW
10061Richard Purdie3Ctrl+C during BB_HASHCHECK_FUNCTION execution does not interrupt processing nicelyminorMedium2.3NEW
10096Richard Purdie1Allow PREFERRED_VERSION miss to be fatalenhancementMedium2.3NEW
10682Richard Purdie5multiconfig sstate optimisationsenhancementMedium2.3NEW
10865Richard Purdie1bitbake-prserv needs a --status flagenhancementMedium2.3NEW
10893Richard Purdie7Missing information of starting tasks in task-depends.dotnormalMedium2.3ACCEPTED
10945Richard Purdie1data_smart.py: _remove causes extra workenhancementMedium2.3NEW
3488Ross Burton2Enable Mesa's llvmpipe?enhancementMedium2.3ACCEPTED
5322Ross Burton3Global DNS fallback mechanism not present in poky distroenhancementMedium2.3ACCEPTED
6142Ross Burton1we need general documentation on Systemd vs SysV related issuesenhancementMedium2.3ACCEPTED
7010Ross Burton1systemd-serialgetty cannot create a serial-getty@.service that is not enablednormalMedium2.3Backport to 1.7.3NEW
7136Ross Burton1Packaging non-versioned libraries is non-trivialnormalMedium2.3NEW
8064Ross Burton1ptest fails tracker bugnormalMedium2.3NEW
8430Ross Burton1inaccurate 'du' usage in Image::_get_rootfs_sizeenhancementMedium2.3ACCEPTED
8454Ross Burton1archiver.bbclass does not create subfolder per licensenormalMedium2.3NEW
8593Ross Burton2The head files of ncurses installing into sysroot seems different in multiple times compilationnormalMedium2.3NEW
8688Ross Burton2busybox syslog not update-alternatives awarenormalMedium2.3NEW
8879Ross Burton5opkg-utils is built when build lib32-imagemajorMedium2.3IN PROGRESS DESIGN
9110Ross Burton2Move some oe-pkgdata-util logic into lib/oeenhancementMedium2.3NEW
9119Ross Burton1ptest fails tracker bug (Cont.)normalMedium2.3NEW
9171Ross Burton5Consider limiting the scope of depchains to runtime depsnormalMedium2.3NEW
9207Ross Burton4Need to fix prelink to iterate mulitlibsnormalMedium2.3NEW
9213Ross Burton1Enable thumb for ARM buildsnormalMedium2.3NEW
9424Ross Burton1systemd tmpfiles.d warnings (volatile, resolv.conf)minorMedium2.3NEW
9883Ross Burton1curl-native: invalid builtin ca-bundle path when restoring from sstatenormalMedium2.3NEW
10130Ross Burton1Excessive warnings for incorrectly formatted LICENSEminorMedium2.3NEW
10133Ross Burton2uninative tarball should contain layer manifestenhancementMedium2.3ACCEPTED
10300Ross Burton2libunwind fails to build with ld-is-goldnormalMedium2.3NEW
10737Ross Burton2binconfig-disabled should install non-broken files to packagesnormalMedium2.3NEW
10841Ross Burton2pTest : Various test cases are failing on "dbus-test" modulenormalMedium2.3NEW
10954Ross Burton2dynamically detect dependency on libgccenhancementMedium2.3NEW
8732Rudolf J Streif2Branch Support for BuildhistoryenhancementMedium2.3NEW
10514Saul Woldtest_parselogs on genericx86-lsb minnow board max 32 FAILED LOGIN (1) on '/dev/tty1' FOR 'UNKNOWN', Authentication failurenormalMedium2.3possible 2.2.1REOPENED
8447Seebs1Host contamination in glibc-localesnormalMedium2.3ACCEPTED
10722soumya2devtool: be able to specify src_uri in upgradeenhancementMedium2.3IN PROGRESS IMPLEMENTATION
10859Tom Zanussicrosstap doesn't work with error: runtime_defines.h: No such file or directorynormalMedium2.3NEW
4183Tracy Graydon2Reference material for how a user creates a build that meets GPL obligations given a reference BSP, standard rootfs/kernel...etc.enhancementMedium2.3NEW
8158Tracy Graydon10INCOMPATIBLE_LICENSES has unexpected results with GNU librariesnormalMedium2.3NEW
9259Yi Zhao3The rpm database costs lots of disk space after install a packagenormalMedium2.3ACCEPTED
10844Choong YinThong3parselogs: qemux86 and x86-64 failing with message "qemux86-64 getty[728]"normalMedium2.3IN PROGRESS REVIEW
IDAssigneeESummary (6 tasks) SeverityPMilestoneWhiteboardStatus
8606Jussi Kukkonen3Evaluate using connman-ui instead of connman-gnomeenhancementLow2.3ACCEPTED
10453Randy Wittadd .inputrc file for the default users so the up arrow history worksenhancementLow2.3NEW
6258Richard Purdie1svn fetch uses last changed revision instead of revision on a svn branch.normalLow2.3ACCEPTED
7982Richard Purdie1Have an option to exclude some packages from the SDK generationenhancementLow2.3NEW
8612Richard Purdie3Add a locked sigs mode allowing locked task to rerunenhancementLow2.3NEW
10316Tom HochsteinVivante: Memory corruption in wayland client process after hiding windownormalLow2.3WaitForUpstream
Personal tools