Yocto 2.2 Schedule

From Yocto Project
Jump to: navigation, search

Contents

Yocto Project 2.2 release milestone structure

YP1.3milestone.png

Yocto Project 2.2 release schedule (release date: Oct. 28, 2016)


The detailed milestone map for the 2.2 release of Yocto Project is as below.

To view the Yocto schedule-at-a-glance, go to YoctoCalendar.

Please note that the estimation for each feature is done based on 'perfect day'. The purpose of the estimation is to estimate the relative size of features, NOT to predict when a single feature could be done.

M1 (May 2, 2016 to 6/24/16-- 8 weeks: planning done in week 1, development week 2-5, stabilization week 6-7, release week 8)

M1 Feature/Tasks Development / Cutoff is 6/13/2016

IDRequesterAssigneeESummary (48 tasks) SeverityPWhiteboardStatus
8640Ross BurtonAlexander Kanavin2Remove vala from oe-core?enhancementMedium+RESOLVED
7583Paul EggletonAníbal Limón5Gather and allow reporting all types of errors, not just task failuresenhancementHighGUI desing availableRESOLVED
9293Aníbal LimónAníbal Limón10bitbake: Add support for trigger event on errors like exceptionsenhancementHighVERIFIED
9517Belen Barros PenaBelen Barros PenaMove to Bootstrap 3enhancementHighVERIFIED
9414Ed BartoshEd Bartoshadd support for bmap-toolsenhancementMedium+RESOLVED
9017Alex FrancoPlauchu Edwin4Sync and Upgrade AB configurationenhancementMediumRESOLVED
7561Ross BurtonPlauchu Edwin1Port beaglebone BSP to use xf86-video-modesettingsenhancementMedium+RESOLVED
7058Wenzong.FanHongxu Jia20ERROR: QA Issue: File xxx in package contained reference to tmpdir [buildpaths]enhancementMediumRESOLVED
9634Humberto IbarraHumberto Ibarra5bitbake-whatchanged script should use argparse instead of optparse libraryenhancementMedium+VERIFIED
9419Jianxun ZhangJianxun Zhang0.1Enabling systemd-boot to replace gummibootenhancementMediumRESOLVED
9292Jianxun ZhangJianxun Zhang0.1Update Graphic recipes with candidate versions in planned Graphic Stack 2016Q1 ReleaseenhancementMedium+RESOLVED
4223Adrian DudauJose Lamego2System tap plugin works only with a fixed poky/build folderenhancementMediumRESOLVED
8704Paul EggletonJose Lamego3patchwork: support history tracking of patch statusenhancementMedium+RESOLVED
9340Joshua LockJoshua Lock5Improve tooling around BuildLog and SWAT processenhancementHighRESOLVED
9321Joshua LockJoshua Lock4[meta-swupd] Enhancements for use within a continuous integration systemenhancementMediumRESOLVED
9325Joshua LockJoshua Lock2[meta-swupd] Copy only required bundle contents, rather than copying the entire mega image and then pruning unwanted filesenhancementMediumRESOLVED
9493Joshua LockJoshua Lock1Support dummy/empty bundlesenhancementMedium+RESOLVED
9599Joshua LockJoshua Lock4Reduce bundle overheads by not depending on os-core when generating bundle sysrootsenhancementMedium+RESOLVED
9082Chris LordJussi Kukkonen0.5Display network information on log-in screensenhancementMediumRESOLVED
3169Ross BurtonJussi Kukkonen15Implement Shuku proposalenhancementMedium+RESOLVED
7658Paul EggletonLeonardo Sandoval Gonzalez4patchwork: provide means of recording additional patch statusesenhancementHighRESOLVED
9311Leonardo Sandoval GonzalezLeonardo Sandoval Gonzalez2patchtest: track last poll series' event inside patchtest so we do not depend on patchwork gitenhancementHighRESOLVED
7855Paul EggletonLeonardo Sandoval Gonzalez2Show blacklist information in layer indexenhancementMediumGUI design availableRESOLVED
9309Leonardo Sandoval GonzalezLeonardo Sandoval Gonzalez3patchtest: detect the target branch from mbox before patchingenhancementMedium+RESOLVED
9310Leonardo Sandoval GonzalezLeonardo Sandoval Gonzalez1patchtest: check if the patchwork instance is alive before merging/testingenhancementMedium+RESOLVED
9401Leonardo Sandoval GonzalezLeonardo Sandoval Gonzalez1patchtest: show assertion messages on summaryenhancementMedium+RESOLVED
9402Leonardo Sandoval GonzalezLeonardo Sandoval Gonzalez0.5patchtest: filter incoming series by usersenhancementMedium+RESOLVED
9403Leonardo Sandoval GonzalezLeonardo Sandoval Gonzalez1patchtest-oe: show the solution on the assertion messageenhancementMedium+RESOLVED
9576Paul EggletonLeonardo Sandoval Gonzalez1Extensible SDK test output needs to include preparing_build_system.log on failureenhancementMedium+RESOLVED
9388Robert YangRobert Yang5A way to no build kernelenhancementMediumRESOLVED
7850Cathy ShenMariano Lopez10Handle native and target test dependency binaries in build test and export testenhancementMediumRESOLVED
9235Benjamin EsquivelMariano Lopez1oe-init-build-env: to receive an argument/variable for appending to local.confenhancementMediumRESOLVED
8384Cristian IorgaMariano Lopez2Exported tests needs a test suiteenhancementMedium+VERIFIED
8478Cathy ShenMariano Lopez5Decoupling export test with Yocto build environmentenhancementMedium+RESOLVED
8481Cathy ShenMariano Lopez5Generate test tar balls for export testenhancementMedium+RESOLVED
8536Cathy ShenMariano Lopez5support un-extracted package (e.g. rpm) as one type of test binariesenhancementMedium+RESOLVED
8694CostinMariano Lopez5Add support for multiple binaries in one testenhancementMedium+RESOLVED
9432Mariano LopezMariano Lopez3Add test for exported test functionalityenhancementMedium+RESOLVED
9565Mariano LopezMariano Lopez1Add copy dir and delete files, dir to sshcontrolenhancementMedium+RESOLVED
9569Mariano LopezMariano Lopez3Add extract package function to the package managersenhancementMedium+RESOLVED
8974Ross BurtonMarkus Lehtonen2Add eSDK benchmarkingenhancementMedium+RESOLVED
9130Paul EggletonMichael HalsteadUpdate OE patchwork instanceenhancementHighVERIFIED
7981Paul EggletonMichael Halstead2Set up procedure for layer index database upgradesenhancementMedium+RESOLVED
8653Paul EggletonPaul EggletonValidate OLDEST_KERNELenhancementLowRESOLVED
2398Khem RajRichard Purdiemake bitbake work using python 3.xenhancementMedium+RESOLVED
7005Ionut ChisanoviciSujith H1Toaster UI - two or more projects having the same name can be createdenhancementMediumGUI design availableVERIFIED
7615Tracy GraydonTracy Graydon5Autobuilder should automatically create BSPs for major releasesenhancementMediumRESOLVED
6945Bruce AshfieldHe Zhe4kernel-dev: multiple kernel buildenhancementMedium+RESOLVED
   158.2     

M1 Bugs

IDRequesterAssigneeESummary (79 tasks) SeverityPWhiteboardStatus
8397Jussi KukkonenAlejandro Hernandez3ROOTLESS_X should be used as default for Poky BSPnormalMediumRESOLVED
9717Alejandro HernandezAlejandro Hernandez2oeqa.runtime.smart.SmartBasicTest complains about missing smart modulenormalMedium+VERIFIED
9211Patrick OhlyAníbal Limón0.3base.bbclass: insufficient error handling for LIC_FILES_CHKSUMnormalMediumRESOLVED
8748Hongxu JiaAníbal Limón0.5qemu86-64 with corei7-64 did not support gcc optimization level 3 '-O3' very wellnormalMedium+VERIFIED
9744Aníbal LimónAníbal Limón0.5distrodata class don't work with python3normalUndecidedRESOLVED
9674Yi ZhaoBill Randle0.1Rename qemux86_64 to qemux86-64 in adt repo for 2.0.2 rc1normalUndecidedVERIFIED
9394Beth Flanaganbrian averybootstrap v2 License is not compatible with bitbake/toaster license.criticalHighVERIFIED
9680Ross BurtonBruce Ashfieldbeaglebone kernel fails in poky-lsb with gcc6majorMedium+RESOLVED
8742Robert Yangdengke2nativesdk-coreutils: a lot of warningsnormalMediumRESOLVED
9050Francisco Pedrazadengke3pTest - tcl (NUC) failed, tested on NUC 5425WYK for YP 2.1_M2.rc1normalMediumRESOLVED
8668Ross Burtondengke2lttng-tools ptest output confuses QA analysisnormalMedium+RESOLVED
9584brian averyEd Bartosh5upgrade toaster to Python3normalMedium+RESOLVED
9711Ross BurtonEd Bartosh0.5oe-pkgdata-util crashes if no arguments passednormalMedium+VERIFIED
9712Jussi KukkonenEd Bartoshbuildhistory-diff depends on python3-git, which is not in Debian StablenormalMedium+8 June 2016: IN PROGRESS REVIEWRESOLVED
9741Joshua LockEd Bartosh0.2buildhistory-diff should recommend python3 version of GitPythonnormalMedium+RESOLVED
9761Yi ZhaoEd BartoshFailed to extract rootfs by using runqemu-extract-sdknormalMedium+VERIFIED
9803Jussi KukkonenEd Bartoshcooker.py blew up on failed build (serialization issue?)normalUndecidedRESOLVED
9476Beth FlanaganBeth Flanagan1Switch production error reporting web to filter on production-yocto-autobuildernormalMedium+VERIFIED
8515brian averyElliot Smith5In analysis mode, if you interrupt the bitbake build, toaster erroneously reports a successful buildnormalMediumRESOLVED
9011Alexandru RomanElliot Smith0.5Default sorting for recipes page not showing properlyminorMediumRESOLVED
9159Armin KusterElliot Smith0.5if recipe = git, 18 pages shownnormalMediumRESOLVED
9745LibertadElliot SmithDjango DEBUG variable set to True in settings file provokes a NameError when trying to filter the a tablenormalMedium+VERIFIED
9536Francisco PedrazaFrancisco Pedraza1oe-selftest: test_sstate_noop_samesigs failed due qmmp LICENSE_FLAGS_WHITELISTnormalMedium+VERIFIED
9507Geoffroy Van CutsemGeoffroy Van Cutsem1Misleading error message when conf/bblayers has problemsnormalMedium+RESOLVED
9407Heinz WrobelHeinz Wrobel3bitbake reports log_check warning without stating in which log/recipe the problem occurrednormalMediumRESOLVED
9534Benjamin EsquivelHumberto Ibarra1oe-selftest --list-tests output format assumes 150 character wide terminalnormalMediumVERIFIED
9506Humberto IbarraHumberto Ibarra2bitbake-layers: show-layers throws exception when can't find layer in bblayers.confnormalMedium+VERIFIED
9723Humberto IbarraHumberto Ibarra1yocto-bsp create fails with 'raw_input' is not defined errornormalMedium+VERIFIED
9736Humberto IbarraHumberto Ibarra1yocto-bsp: unrecognised parameter exception using python3normalMedium+VERIFIED
9280Francisco PedrazaJose Perez C1[Test Case 1059], when running testimage several test cases for test smart failed on WIC imagenormalMediumRESOLVED
9619Igor StoppaJoshua LockAutomate the process of updating meta patches in a recipenormalHighRESOLVED
9199Joshua LockJoshua Lock3[meta-swupd] Enable updating of configuration files in swupd-clientnormalMediumRESOLVED
9758Ke ZouJuro Bystricky[build appliance] yocto 2.2: bitbake fails to build imagenormalHighVERIFIED
8616Robert YangJuro Bystricky3arm64's multilib SDK is brokenmajorMedium+VERIFIED
9581Sona SarmadiJussi KukkonenCVE-2016-2107, CVE-2016-2108, CVE-2016-2105, CVE-2016-2106, CVE-2016-2109, CVE-2016-2176majorHighRESOLVED
9691Jussi KukkonenJussi Kukkonen1new dosfstools changes sectors-per-track, breaks image generationnormalHighRESOLVED
9664Christopher LarsonJussi KukkonenThe old gstreamer1.0-plugins-bad recipe is causing errors and conflictsnormalMedium+VERIFIED
9714Dmitriy FalkoJussi KukkonenAvahi 0.6.32 build with uclibc failednormalMedium+RESOLVED
9715Jussi KukkonenJussi Kukkonen0.5gst-plugins-bad and gst-player should be updated after Sato uses Gtk+3normalMedium+VERIFIED
9120Yi ZhaoLeonardo Sandoval Gonzalez2The patch file is not applied to linux-yocto by yocto-kernel add patch commandnormalMediumVERIFIED
9501Jean GouletLeonardo Sandoval Gonzalez'yocto-bsp create xxxx arm' generates bbappend file with 'bbapend' extensionnormalMediumRESOLVED
9572Leonardo Sandoval GonzalezLeonardo Sandoval Gonzalez1sudoku-savant tarball not found when SDK testing on core-image-satonormalMedium+RESOLVED
9573Leonardo Sandoval GonzalezLeonardo Sandoval Gonzalez1openssh, subversion and ghostscript URLs fail on do_checkuri testnormalMedium+VERIFIED
9661Benjamin EsquivelLeonardo Sandoval Gonzalez3upgrade oe-selftest to python 3normalMedium+VERIFIED
9690Leonardo Sandoval GonzalezLeonardo Sandoval Gonzalezoe-selftest required package (gitpython) for openSUSE not foundnormalMedium+7 June 2016: Set the Doc flag to "No"VERIFIED
9512Robert YangRobert Yang5insane.bbclass: package_qa_check_license -> do_qa_populate_licnormalMediumRESOLVED
9702Mariano LopezMariano Lopez2testexport broken with python3majorUndecidedRESOLVED
9705Mariano LopezMariano Lopez3Runtime testing fails to import tests from other layersnormalUndecidedRESOLVED
9767Jose Perez CMariano Lopez1oe-selftest is not running test cases from meta-yocto-bspnormalUndecidedVERIFIED
9496Maxin B. JohnMaxin B. Johnsmart fails to install packages which adds groups in core-image-minimalmajorMedium+VERIFIED
9606Kevin HaoMaxin B. Johnlibjpeg-turbo fail to build with mips64-nf (soft float)normalMedium+VERIFIED
9676Belen Barros PenaMichael Wood4ToasterTables does not take into account the target when displaying package dependenciesnormalMedium+RESOLVED
9716Alejandro HernandezMichael HalsteadGitPython dependency missing on Autobuilder SetupnormalMedium+VERIFIED
9855Bill RandleMichael Halstead0.5xsltproc is required on all build slavesnormalUndecidedRESOLVED
9605Henry BrucePaul EggletonExtensible SDK installer fails if the local.conf used to build it contains variable in DL_DIRnormalMediumRESOLVED
9177Valentin HanganPaul Eggleton1Failed to install jethro eSDK image from AutobuildermajorMedium+RESOLVED
9301Yi ZhaoPaul EggletonExtensible SDK: failed to run sdk-update: checksum mismatch for uninativenormalMedium+VERIFIED
9505Denys DmytriyenkoPaul EggletonSDKs no longer provide opkg packaging datamajorMedium+RESOLVED
9666Henry BrucePaul Eggletonesdk: 'devtool build' fails due to certificates problemnormalMedium+RESOLVED
9608Maciej SobkowskiKhem Rajpkg-config 0.29 compilation error after gcc update (5.3 -> 6.1)criticalMedium+RESOLVED
9659BharathKhem Rajhidden symbol pthread_atforkmajorMedium+RESOLVED
9567Leonardo Sandoval GonzalezRichard Purdiebitbake's FetchLatestVersion fail when running bitbake-selftestcriticalHighVERIFIED
9490Mark HatleRoss Burton2IMAGE_GEN_DEBUGFS = "1" does not work when PACKAGE_CLASSES = "package_ipkg"normalMedium+VERIFIED
9508Tristan Van BerkomRoss Burton1cross-localedef-native_2.22 fails to build on aarch64 hostnormalMedium+VERIFIED
9516Alexandru RomanRoss Burton1boost doesn't rebuild correctlynormalMedium+VERIFIED
9521Gary ThomasRoss BurtonCan't install dbusnormalMedium+VERIFIED
9528Patrick OhlyRoss Burton1dbus-test: installs libtool wrapper for binariesnormalMedium+RESOLVED
9628Juro BystrickyRoss Burtonopenssh : do_check_uri: connection refused errorsnormalMedium+VERIFIED
9655Aníbal LimónRoss Burtonzip/unzip: needs to update SRC_URI failing in checkurinormalMedium+VERIFIED
9713Jussi KukkonenRoss Burtonpackagegroup-self-hosted.bb needs to be updated for python3normalMedium+RESOLVED
9640Ross BurtonSaul Woldlms8 fails with gcc6normalHighRESOLVED
9800Bill RandleSaul Woldcore-image-sato out of space when smart and rpm are installednormalMedium+RESOLVED
9773Joshua LockScott RifenbarkSSTATE_MIRRORS examples don't match local.conf.samplenormalMedium+14 June 2016: IN PROGRESS REVIEWVERIFIED
9535Mark HatleStephano Cetola1Generated SDK environment files use 'source' to load additional environment filesnormalMedium+RESOLVED
9614Humberto IbarraTim Orling1yocto-bsp main page: Typo in error shown about existing directoryminorMediumVERIFIED
9695Todor MinchevTim OrlingAdd UUID to toolchain JSON filesnormalMediumRESOLVED
9571Henry BruceTodor MinchevAllow CROPS to install host tools in specified locationnormalMediumRESOLVED
7937brian averyTom Zanussi7https://www.yoctoproject.org/sites/default/files/kernel-lab-1.6.pdf is really nice and should be updated to 2.0minorMediumRESOLVED
8652  1meta/recipes-devtools/ruby/ uses --disable-versioned-paths, but no such option existsminorLowRESOLVED
   83.1     

M1 Stabilize schedule

Release Candidate and Milestone Release schedule

  • RC1: 6/13/16
  • RC2: 6/20/16
  • M1 release: 6/24/16

M2 (6/13/16 to 7/29/16 -- 7 weeks: planning done in week 1, development week 2-4, stabilization week 5-6, release: week 7)

M2 Feature/tasks Development / Cutoff is 7/18/16

IDRequesterAssigneeESummary (41 tasks) SeverityPWhiteboardStatus
9299Aníbal LimónAníbal Limón3Enable Tracing boot and process times in testing imagesenhancementMedium+RESOLVED
9559Benjamin EsquivelBenjamin Esquivel3test reporting tool planenhancementHighVERIFIED
9682Benjamin EsquivelBenjamin Esquivel5enable xml output in OeTest class for report consumersenhancementMedium+RESOLVED
9919California SullivanCalifornia SullivanEnhance installer to give a selection of block devices to install toenhancementMedium+VERIFIED
5534Alexandru DamianEd Bartosh3Bitbake resident server autoloading/unloadingenhancementMedium+RESOLVED
9412Ed BartoshEd Bartosh5Implement python 3 support for wicenhancementMedium+RESOLVED
9413Ed BartoshEd Bartosh2bmap-tools support for wicenhancementMedium+RESOLVED
9755Jussi KukkonenEd Bartoshbuildhistory-diff contains loads of PKGR spam when used with PRSERVenhancementMedium+RESOLVED
9002Elliot SmithElliot Smith6Move directory scan logic out of toaster.bbclass into buildinfohelperenhancementLowRESOLVED
8563Belen Barros PenaElliot Smith5Improve detection and presentation of build artifactsenhancementMedium+GUI desing availableRESOLVED
9023Belen Barros PenaElliot Smith4Improve the content of the "other artifacts" sectionenhancementMedium+GUI design availableRESOLVED
9439Belen Barros PenaElliot Smith1Verify that the REST API works with httpsenhancementMedium+RESOLVED
9871Leonardo Sandoval GonzalezFrancisco Pedrazapatchtest-oe: make sure description is present on patchesenhancementMedium+RESOLVED
8321Leonardo Sandoval GonzalezHumberto Ibarra2yocto-bsp script should use argparse instead of optparse libraryenhancementMediumRESOLVED
8761Saul WoldJianxun Zhang15[RMC]: Handle machine specific kernel command line differencesenhancementHighOn Track to meta-intelVERIFIED
9886Jianxun ZhangJianxun Zhangsystemd-boot: Support construct direct-boot image with sd-boot in wic and wksenhancementMediumRESOLVED
9872Leonardo Sandoval GonzalezJose Lamego1patchtest-oe: check LIC_FILES_CHECKSUM is present on new recipesenhancementMedium+RESOLVED
9873Leonardo Sandoval GonzalezJose Lamego1patchtest-oe: in case LIC_FILES_CHKSUM changed, make sure commit message indicates the reasonenhancementMedium+RESOLVED
9706Jianxun ZhangJose Perez C3Systemd-boot: Create test harness in OEenhancementMedium+VERIFIED
9876Leonardo Sandoval GonzalezJose Perez Cpatchtest-oe: check that attached SW patches does not contain trailing spacesenhancementMedium+RESOLVED
9112Richard PurdieJoshua Lockpseudo connection startup/reworkenhancementHighRESOLVED
9448Joshua LockJoshua Lock3Add mechanism for running image level QA checksenhancementMedium+RESOLVED
9556Christopher LarsonChristopher LarsonThe EFI bootloaders should deploy startup.nsh for wicenhancementMedium+RESOLVED
4078Mark HatleLeonardo Sandoval Gonzalez5A method to validate the contents of changes to recipes, configuration files and classesenhancementHighRESOLVED
8648Paul EggletonLeonardo Sandoval Gonzalez10Automatic testing of incoming patchesenhancementHighTesting in ProgressRESOLVED
9244Alex FrancoLeonardo Sandoval Gonzalez5patchtest-oe: Create tests to validate recipes, classes or config filesenhancementMedium+RESOLVED
9881Leonardo Sandoval GonzalezLeonardo Sandoval Gonzalez1patchtest-oe: check patch's subject lengthenhancementMedium+RESOLVED
9428Robert YangRobert Yang5poky-tiny: make it support more machines/archsenhancementMediumVERIFIED
9515Ross BurtonMariano Lopez1update-rcd class should add build dependencies if requiredenhancementMedium+RESOLVED
9766Mariano LopezMariano Lopez3testimage: test import of tests from other layersenhancementMedium+RESOLVED
9623Markus LehtonenMarkus Lehtonen4Rewrite build-perf-test.sh in pythonenhancementMedium+VERIFIED
8489Ross BurtonMaxin B. John1Update DirectFB to git?enhancementMedium+RESOLVED
4431Paul EggletonMichael Halstead3Set up buildhistory-web for autobuilderenhancementHighRESOLVED
9613Paul EggletonPaul EggletonExtensible SDK: Improve perceived performance of preparation during installenhancementMedium+RESOLVED
4634Christopher LarsonRoss Burton5BitBake default 'dirs' in exec_func (${B}) causes build failuresenhancementMedium+VERIFIED
9251brian averyScott Rifenbark1Need flowchart style documentation showing progress of tasks and what they touch in a setscene vs non setscene setting.enhancementMedium21 July 2016: RESOLVEDRESOLVED
9671Leonardo Sandoval GonzalezScott Rifenbark1UPSTREAM_CHECK_* variables needs documentationenhancementMedium8 June 2016: RESOLVEDRESOLVED
9823 Scott Rifenbark1Suggested additions to the shared state cache documentationenhancementMedium21 July 2016: RESOLVEDRESOLVED
9843 Scott Rifenbark1Suggested additions to the documentation on PRenhancementMedium30 June 2016: RESOLVEDRESOLVED
9529Sascha SilbeStephano Cetolasysvinit: inittab labels for consoles need to be restricted to 4 charactersenhancementMediumRESOLVED
9361Valentin HanganTim Orling3Failed to reconfigure a project in Eclipse with eSDKenhancementMedium+RESOLVED
   112     

M2 Bugs

IDRequesterAssigneeESummary (71 tasks) SeverityPWhiteboardStatus
9632Armin KusterArmin Kustergcc: Security fix CVE-2016-4490normalMedium+RESOLVED
9729Alejandro HernandezAlejandro Hernandez1python-numpy script f2py is built with incorrect shebangnormalMedium+RESOLVED
8508Ross BurtonAlexander Kanavin3Remove knowledge of MACHINE from distutils3normalMedium+RESOLVED
9934Amaranth ValluriAlexander Kanavinopenssl-1.0.2h open CVEs: CVE-2016-2177, CVE-2016-2178normalMedium+RESOLVED
9935Amaranth ValluriAlexander Kanavinbzip2 v1.0.6 has open CVEs: CVE-2016-3189normalMedium+RESOLVED
9746Aníbal LimónAníbal Limón5RRS: Update to work with python3normalHighRESOLVED
9747Aníbal LimónAníbal Limón5AUH: Make sure that works with python3normalHighRESOLVED
9733brian averyAníbal Limón5update Django to 1.8 LTSnormalMedium+VERIFIED
9870Leonardo Sandoval GonzalezAníbal Limón0.5patchtest-oe: check bugzilla entry in patches is correctly formattedminorMedium+RESOLVED
9884Joshua LockBill Randle3Better configuration on whether toaster event files are written or notnormalHighRESOLVED
7963Alexandru DamianBill Randle2Release process needs to generate correct toasterconf.json files for tar.gz releasesnormalMediumRESOLVED
9315Joshua LockBill Randle2nightly-world & nightly-world-lsb failed at PublishingArtifactsnormalMediumRESOLVED
9397Alexandru GeorgescuBill Randle0.5[Autobuilder] - public WIC buildset artifactsnormalMedium+VERIFIED
9810Tim OrlingBill Randle1Add beaglebone (cortexa8hf-neon) SDK to supplied toolchainsnormalMedium+VERIFIED
7095Richard PurdieBruce Ashfield4Can't install kernel-dev and kernel-devsrc togethernormalMedium+RESOLVED
9804Patrick OhlyCalifornia Sullivanmeta-intel: standard/intel/bxt-rebase lacks sounds/pci/hda bug fixnormalMediumRESOLVED
9829Fabio BertonEd Bartosh2WIC error when using rawcopynormalMediumRESOLVED
9806Joshua LockEd Bartoshsstate doesn't detect when the recipe filename changesnormalMedium+RESOLVED
9809Leonardo Sandoval GonzalezEd Bartosh2List python/bitbake libraries that are not being tested by oe-selftestnormalMedium+VERIFIED
9828Yi ZhaoPlauchu Edwin5[Beaglebone] mouse doesn't work when system startupnormalMedium+VERIFIED
9500Belen Barros PenaElliot Smith4In multitarget builds, Toaster shows software recipes in the list of imagesnormalMediumRESOLVED
9514Belen Barros PenaElliot Smith2Builds of software recipes should not show a "New custom image" buttonnormalMediumRESOLVED
8556Alexandru RomanElliot Smith15Toaster: bitbake variables image_fstypes not being passed to build processnormalMedium+RESOLVED
9594Alexandru RomanElliot Smith5Toaster is not showing properly image files for buildsnormalMedium+RESOLVED
9749LibertadElliot SmithDjango DEBUG variable set to True in settings file provokes a NameError when trying to search a tablenormalMedium+VERIFIED
9784Peter KjellerstedtElliot Smith3Building with -c rootfs fails if toaster and buildhistory are inheritednormalMedium+VERIFIED
9842LibertadElliot Smith0.5CLI started builds dont show properly on All builds view plus no cancel buttonnormalMedium+RESOLVED
9750Humberto IbarraHumberto Ibarra1yocto-bsp create: no graceful error message for wrong format in input fileminorMediumRESOLVED
9834Ke ZouHumberto Ibarra1with python upgraded to version 3, "yocto-kernel patch add" script failednormalMediumRESOLVED
9720Leonardo Sandoval GonzalezHumberto Ibarra1yocto-bsp: BSP creation fails using an input filenormalMedium+VERIFIED
9868Humberto IbarraHumberto Ibarrayocto-bsp: help command throws exception and messes terminalnormalMedium+RESOLVED
9898Jose Perez CHumberto IbarraCreate Performance Test charts and reportscriticalUndecidedVERIFIED
9735Jose Perez CJose Perez C2Update suported distros under meta-poky/conf/distro/poky.confnormalHighRESOLVED
9774Jianxun ZhangJose Perez Csystemd-boot: Add new test target as what the existing gummiboot doesnormalMedium+RESOLVED
1882Joshua Lock - DisabledJoshua Lock5Verify and document package feed creation for each package management backendnormalMedium16 June 2016: Set doc flag to done.RESOLVED
9317Patrick OhlyJoshua Lockpseudo: incorrect xattr semantic for hardlinksnormalMedium+RESOLVED
9452Joshua LockJoshua Lock2[meta-swupd] update to latest swupd and adapt to changesnormalMedium+RESOLVED
8477Robert YangRobert Yang5ALTERNATIVE_PRIORITY conflictsnormalMediumRESOLVED
9422Robert YangRobert Yang3oe-init-build-env: read SSTATE_DIR and DL_DIR from env varnormalUndecidedRESOLVED
9249Leonardo Sandoval GonzalezMariano Lopez1patchwork: test that CVE patches contain the proper formattingnormalMedium+RESOLVED
9696Benjamin EsquivelMariano Lopez3Lab Network support for Device Automated Runtime TestingnormalMedium+VERIFIED
9764Mariano LopezMariano Lopez3testimage: test installation of packages in the DUT without package managernormalMedium+RESOLVED
9811Sebastian Dröge (slomo)Maxin B. JohnUpdate GStreamer to 1.8.2 and fix up the "GIT" recipesnormalMedium+VERIFIED
8818Michael WoodMichael Wooderror in lsupdates when duplicate openembedded-core layers foundnormalMediumRESOLVED
9853Michael WoodMichael Wood10Database refactoring to ease multiple configurationsnormalMediumRESOLVED
9704Paul EggletonPaul Eggletonlayer index update script needs to handle python 3 for mastermajorHighRESOLVED
9822Yi ZhaoPaul Eggletondevtool: fail to add recipe for some packagesnormalMediumVERIFIED
9826Paul EggletonPaul EggletonExtensible SDK: eSDK built with live image doesn't worknormalMedium+RESOLVED
5359Davide SoldanChen Qi[Yocto 1.5] su - USER -c 'COMMAND' env variable issuenormalMediumRESOLVED
9555Belen Barros PenaRandy Witt1.5Create Toaster Docker containernormalMedium+RESOLVED
9673Gianluigi TiesiRenato Caldas1perl ptest package tries to include generate_uudmap host executablemajorMedium+RESOLVED
9910Ross BurtonRoss Burtonpstree isn't pretty since Py3normalMediumRESOLVED
8555Jussi KukkonenRoss Burton2Reading shlibs providers sometimes failsnormalMedium+VERIFIED
9509Tristan Van BerkomRoss Burton1Backport binutils bugfix: fix build of webkitgtk4 on aarch64normalMedium+VERIFIED
9701Richard PurdieRoss BurtonReconcile xserver-nodm-init and x11-common/xserver-common between oe-core and meta-oenormalMedium+VERIFIED
9709Ross BurtonRoss Burtonsystemtap has non-deterministic build dependenciesnormalMedium+RESOLVED
9775Paul EggletonRoss Burton2buildtools results in broken system locale if LANG is not en_USmajorMedium+VERIFIED
9780Jussi KukkonenRoss Burton2buildsudoku.py runtime test depends on gtk+2normalMedium+VERIFIED
9797Maxin B. JohnRoss Burtontest_parselogs failed on AIGLX error: dlopen of swrast_dri.so failednormalMedium+VERIFIED
9798Paul EggletonRoss BurtonFiles in ~/tmp being deleted during a buildmajorMedium+RESOLVED
9961Patrick OhlySaul Woldintel-quark: 4.4.14 does not compilenormalHighmeta-intel blockerRESOLVED
9771Christopher LarsonSaul Woldmeta-intel is unconditionally modifying linux-firmwarenormalMediumRESOLVED
9683Harald AchitzScott Rifenbark13.10 says d.getVar("X", expand=False) but that's wrong for 2.1normalMedium9 June 2016: IN PROGRESS REVIEWRESOLVED
9777Vesa JääskeläinenStephano Cetolauseradd with static id mappings got broken in krogothnormalHighRESOLVED
9788Stephano CetolaStephano Cetolasystemd rootfs-postprocess command should check for -m flagnormalMedium+RESOLVED
9598Randy WittSujith HSSTATE_MIRRORS should not be on the list of restricted "Bitbake variables"normalMediumVERIFIED
7828Belen Barros PenaSujith H4Impossible to add a new image type in ToasternormalMedium+GUI design availableRESOLVED
7533Beth FlanaganTim Orling1.5eclipse-plugin build scripts don't fail correctly.normalMediumRESOLVED
9105Teodor MadanTim Orling1.5[MARS] Cannot install eclipse-poky pluginnormalMedium+VERIFIED
9791brian averyTodor MinchevCODI server fails to register all toolchains if multiple containers are launched simultaneouslynormalMediumRESOLVED
9286Yi ZhaoYi Zhao3Failed to build gst-player for qemuarm64 on Fedora23 i686normalMedium+VERIFIED
   128     


M2 Stabilize schedule

Release Candidate and Milestone Release schedule (Full Pass QA test follows every RC build)

  • RC1: 7/18/16
  • RC2: 7/25/16
  • M2 release: 7/29/16

M3 (7/18/16 to 9/9/16 -- 8 weeks: planning done in week 1, development week 2-5, stabilization week 6-7, release: week 8)

M3 Feature/tasks Development / Cutoff is 8/29/16

IDRequesterAssigneeESummary (68 tasks) SeverityPWhiteboardStatus
9383Ross BurtonArmin Kuster3Move to LSB 5enhancementMedium+RESOLVED
9756Joshua LockAníbal Limón2Plan clean up and improvements for oeqaenhancementMedium+RESOLVED
9298Aníbal LimónBill Randle4.5Autobuilder enable KVM on the cluster for x86, x86-64enhancementHighRESOLVED
7568Tracy GraydonBill Randle3Create an image to run regular build tests for no-X11 caseenhancementMediumRESOLVED
8083Richard PurdieBill Randle1Add n32 test case to autobuilder nightly-multilibenhancementMediumRESOLVED
9450Randy MacLeodBill Randle2Add automated runtime tests that use the musl libc rather than glibcenhancementMedium+RESOLVED
9940Tim OrlingBill Randleautobuilder will need an eclipse-poky recipe for the Neon branchenhancementMedium+RESOLVED
10166Jose Perez CBill RandleEnable AB to build WIC images for generix86 and qemux86 machines and publish themenhancementUndecidedVERIFIED
10118Randy Wittbrian avery3Make a bitbake container similar to the extsdk container, but for multiple releases like the toaster containerenhancementMedium+RESOLVED
8179Jussi LaakoBruce Ashfield10It should be possible to disable kernel features using config fragmentsenhancementMedium+RESOLVED
9466Bruce AshfieldBruce Ashfield7enhance kernel configuration audit to include reasons for missing configs, and required config checkingenhancementMedium+RESOLVED
9874Leonardo Sandoval GonzalezDaniela Plascencia2patchtest-oe: check that patches are removed if these are removed from the SRC_URIenhancementMedium+RESOLVED
9875Leonardo Sandoval GonzalezDaniela Plascencia2patchtest-oe: in case upstream link change (SRC_URI), check that checksums flags also indicated this changeenhancementMedium+RESOLVED
9346Ross BurtonEd Bartosh1Rename COMPRESS_CMD_* to IMAGE_POSTPROCESS_*?enhancementMediumRESOLVED
9869Elliot SmithEd Bartosh5Provide a per-target manifest of files which were, or would have been, producedenhancementMedium+RESOLVED
9631brian averyElliot Smith10add state Transitions to progress bar as well as build progress.enhancementMedium+GUI design availableRESOLVED
9169Hongxu JiaHongxu Jiaadd fix_buildpaths.bbclass to fix build pathenhancementMediumRESOLVED
10088Jianxun ZhangJianxun ZhangRMC:RMC Project - add dynamic linking option for C libenhancementMediumRESOLVED
6362Darren HartJianxun Zhang10Runtime machine configurationenhancementMedium+work post 8761 RESOLVED
9904Jose LamegoJose Lamego1patchwork: show cover letter message in series created with pull requestenhancementHighRESOLVED
9389Robert YangJose Lamego2oeqa: split configuration from the codeenhancementMediumRESOLVED
7654Paul EggletonJose Lamego2patchwork: ensure superseded patches are marked as suchenhancementMedium+RESOLVED
9538Joshua LockJoshua Lock10Review common security hardening flags and expand security_flags.incenhancementMedium+RESOLVED
8649Paul EggletonLeonardo Sandoval Gonzalez15Script to assemble patches for autobuilder testingenhancementHighRESOLVED
10057Leonardo Sandoval GonzalezLeonardo Sandoval Gonzalez1patchtest: create a cron job to monitor oe-core mailing listenhancementMedium+RESOLVED
4827Ross BurtonRobert Yang15runqemu shouldn't hard-code machine knowledgeenhancementMediumRESOLVED
9408Robert YangRobert Yang3create-pull-request: auto push the branch if not presentenhancementMediumRESOLVED
9409Robert YangRobert Yang2create-pull-request: add the ability to read env varenhancementMediumRESOLVED
9410Robert YangRobert Yang2create-pull-request: automatically add the subject when there is only one patchenhancementMediumRESOLVED
9421Robert YangRobert Yang10kernel: add an ability to build from an existing .configenhancementMediumRESOLVED
8318Paul EggletonRobert Yang20Avoid unnecessary package feed churn due to packages rebuildingenhancementMedium+RESOLVED
9399Robert YangRobert Yang10qemu-native: make it can boot efi imagesenhancementUndecidedRESOLVED
9411Robert YangRobert Yang5runqemu: make it support arch as the parameter rather than machineenhancementUndecidedRESOLVED
8532Cathy ShenMariano Lopez3runexported.py parameter support for: -a <tag>enhancementMedium+RESOLVED
8535Cathy ShenMariano Lopez15export the test scripts under all layers' ./lib/oeqaenhancementMedium+RESOLVED
9624Markus LehtonenMarkus Lehtonen1build-perf-test: store test results in GitenhancementMedium+RESOLVED
9625Markus LehtonenMarkus Lehtonen1build-perf-test: re-organize test output dataenhancementMedium+RESOLVED
9257Henry BrucePaul Eggleton1extensible SDK: need an easy way of installing toolchainsenhancementMediumRESOLVED
8657Paul EggletonPaul Eggleton1extensible SDK: improve handling for sanity checksenhancementMedium+RESOLVED
9537Paul EggletonPaul Eggletonrecipetool: support node.js code outside of npmenhancementMedium+RESOLVED
9751Paul EggletonPaul EggletonExtensible SDK: add mode to include toolchain by defaultenhancementMedium+RESOLVED
9436Robert YangChen Qi3lib/bb/fetch2/git.py: print more friendly errors messages when failedlib/bb/fetch2/git.pyenhancementMediumRESOLVED
9835Joshua LockChen QiSplit container/vm related systemd services into a separate packageenhancementMediumRESOLVED
9454Robert YangChen Qi10improve on why a recipe is builtenhancementMedium+RESOLVED
9004Paul EggletonRandy Witt4Produce container image providing extensible SDKenhancementMedium+RESOLVED
7518Tyler HallRichard Purdie15Build multiple machines in the same bitbake invocationenhancementHighRESOLVED
8554Juro BystrickyRichard Purdie3Support for self-contained "baremetal" CPU meta-layersenhancementMediumRESOLVED
9861 Scott Rifenbark1Suggested additions to the dependencies sectionenhancementMedium16 July 2016: RESOLVEDRESOLVED
9899Stephano CetolaScott Rifenbark1Add REMOVE_PKG_SUPPORT to variable referenceenhancementMedium01 Sept 2016: RESOLVEDRESOLVED
9909 Scott Rifenbark1Suggested clarification re. implementation and limitations of BBCLASSEXTENDenhancementMedium16 July 2016: RESOLVEDRESOLVED
9933 Scott Rifenbark1Suggested additions to the DEPENDS documentationenhancementMedium18 July 2016: RESOLVEDRESOLVED
9984 Scott Rifenbark1Suggested clarification of the '3.1.2. Variable Expansion' sectionenhancementMedium01 August 2016: RESOLVEDRESOLVED
9988 Scott Rifenbark1Suggested clarification of the STAGING_DIR_* glossary entriesenhancementMedium22 Sept 2016: RESOLVEDRESOLVED
9989 Scott Rifenbark1Two tiny documentation nits re. D and do_checkpkgenhancementMedium21 July 2016: IN PROGRESS REVIEWRESOLVED
9963 Scott Rifenbark1Warning against ${PN}-dev-related gotcha in the RDEPENDS glossary entryenhancementUndecided18 July 2016: RESOLVEDRESOLVED
9967 Scott Rifenbark1Suggested fleshing out of the do_package documentationenhancementUndecided18 July 2016: IN PROGRESS REVIEWRESOLVED
9968 Scott Rifenbark1Suggested fleshing out of the do_populate_sysroot documentationenhancementUndecided18 July 2016: IN PROGRESS REVIEWRESOLVED
9970 Scott Rifenbark1Suggested fleshing out of the do_deploy documentationenhancementUndecided19 July 2016: RESOLVEDRESOLVED
9976 Scott Rifenbark1Suggested addition to 2.3. Debugging Build Failures re. missing build-time dependenciesenhancementUndecided19 July 2016: RESOLVEDRESOLVED
9983 Scott Rifenbark1host-user-contaminated, invalid-chars, and invalid-packageconfig are missing from '7.62. insane.bbclass'enhancementUndecided19 July 2016: RESOLVEDRESOLVED
9255Steven WalterStephano Cetola0.5Allow rootfs tasks to run in parallel with rpmenhancementHighRESOLVED
9911Belen Barros PenaSujith HImport a layer that points to a directory instead of a Git repositoryenhancementMedium+GUI design availableRESOLVED
9912Belen Barros PenaSujith HBuild a layer that points to a directory instead of a Git repositoryenhancementMedium+RESOLVED
9913Belen Barros PenaSujith HSwitch imported layers between directories and Git repositoriesenhancementMedium+GUI design availableRESOLVED
9925Belen Barros PenaSujith HSupport building non-Git layers with ToasterenhancementMedium+RESOLVED
9907Tim OrlingTim Orling3eclipse-poky should support the latest Neon 4.6 release of EclipseenhancementMedium+RESOLVED
9908Tim OrlingTim Orling1eclipse-poky builds have a LOT of warningsenhancementMedium+RESOLVED
10156Tim OrlingTim Orling0.2[eclipse-poky][neon] scripts/setup.sh should give a warning when Java version incorrectenhancementMedium+RESOLVED
   238.2     

M3 Bugs

IDRequesterAssigneeESummary (125 tasks) SeverityPWhiteboardStatus
7254Alejandro HernandezAlejandro Hernandez7PATCHRESOLVE's devshell opens up multiple new terminalsminorMediumRESOLVED
9520Francisco PedrazaAlejandro Hernandeztest_parselogs failed on udevd[342] inotify_add_watch /dev/loop when running test imagenormalMedium+Will need to be backported to 2.1.2 alsoVERIFIED
9757Alejandro HernandezAlejandro Hernandez1python3-git requires operator and enum modulesnormalMedium+RESOLVED
10048David RodriguezAlejandro HernandezGraphics - ABAT-fatal IO error 11normalMedium+VERIFIED
6996Alexandre TuleuAníbal Limón10cyclic symlinks in rootfs cause user-space qemu to infinite loop on startupnormalMediumRESOLVED
10019Jose Perez CAníbal Limón0.2build-perf-test-wrapper.sh failing to execute performance testnormalMediumRESOLVED
10051Joshua LockAníbal Limón0.2Error log links (err.html and err.text) in build page show tracebacks from buildsteps.pynormalMediumRESOLVED
8142Alex FrancoAníbal Limón5avahi daemon fails to start on systemd while testing core-image-satonormalMedium+RESOLVED
10128Leonardo Sandoval GonzalezAníbal Limón3nightly-qa-systemd: testimage check for task and ssh log failed for core-image-satomajorMedium+VERIFIED
10020Ross BurtonBill RandleHandle oe-core layer version 9majorHighRESOLVED
10082Bill RandleBill RandleUse sendmail, rather than mail for sending QA emailsnormalMediumRESOLVED
8210Ross BurtonBill Randle3Should be able to restart a crashed vnc servernormalMedium+RESOLVED
9866Bill RandleBill RandleSanity tests fail due to permission problemnormalMedium+RESOLVED
10010Bill RandleBill RandleCheckOutLayers build step fails if OPTIMIZED_GIT_CLONE is not TruenormalUndecidedRESOLVED
10105Bill RandleBill RandleAdd musl world build on autobuildernormalUndecidedRESOLVED
10139Sona SarmadiBruce AshfieldCVE-2016-5696 kernel: challenge ACK counter information disclosure.majorHighRESOLVED
7418Ross BurtonBruce Ashfield3Perf/kernel-devsrc racenormalMediumWaiting for 4.7 releaseRESOLVED
8289Rob CalhounBruce Ashfield4kernel_configme step should use "oldnoconfig" instead of "allnoconfig" when silently upgrading user defconfignormalMediumRESOLVED
8970Randy WittBruce Ashfield5test_kernel_module fails with AssertionError: 137 != 0 : cd /usr/src/kernel && make scriptsnormalMediumRESOLVED
10016Yi ZhaoBruce AshfieldFail to build linux-yocto for custom qemumips64 bsp with yocto-bspnormalMediumRESOLVED
9440Sascha SilbeCalifornia Sullivan1SERIAL_CONSOLES_CHECK doesn't work if kernel console name and device node name differnormalMedium+RESOLVED
9959Leonardo Sandoval GonzalezDaniela Plascencia1patchtest-oe: the check for 'signed-off-by' format is failing on unicode namesmajorMedium+RESOLVED
10049Leonardo Sandoval GonzalezDaniela Plascencia2patchtest-oe: use a template when on the scripts that creates the final summarynormalMedium+RESOLVED
10065Leonardo Sandoval GonzalezDaniela Plascenciapatchtest-oe: replace 'subject' for 'shortlog'normalMedium+RESOLVED
9860David RodriguezDavid RodriguezLAN device doesn't retrieve connection after resume from suspend statenormalMedium+VERIFIED
3388Tom Zanussidengke2perf: enable man pages for basic 'help' functionalitynormalMediumRESOLVED
6120Catalin Scrieciudengke5perf top command does not work on QemuPPCnormalMediumRESOLVED
8810daweidengke3Some strace ptests failnormalMediumRESOLVED
8834Alexandru Georgescudengke2pTest - attr test fail ln -s fnormalMediumVERIFIED
9863DiegoEd BartoshChanging files in packages-split with populate_packages_prepend does not impact rpm packages, while it does for deb and ipknormalMedium+RESOLVED
9951Elliot SmithEd BartoshToaster builds hang because of a runqueue exception in bitbakenormalMedium+RESOLVED
9204Cristina AguridaPlauchu Edwin1Cleanup should be made after testing smartnormalMediumRESOLVED
10140Yi ZhaoPlauchu EdwinThe output is strange when using unzip to extract zip filenormalMedium+VERIFIED
9833LibertadElliot Smith2There can be a Task and Recipes table of 0 columns when deselecting them on the "Edit Columns" buttonnormalMediumRESOLVED
9836LibertadElliot Smith3Project builds table and Software Recipes: Sorting does not reset to default when hiding column that is currently being used as the sorting criterianormalMediumRESOLVED
9837LibertadElliot Smith3When trying to Download task log it returns Page not found (404)normalMediumRESOLVED
9952Belen Barros PenaElliot Smith4Impossible to access task details page for tasks with outcome "covered"normalMediumRESOLVED
8440Belen Barros PenaElliot Smith8Toaster has some issues when showing builds that fail at the build request stagenormalMedium+GUI design availableRESOLVED
8443Belen Barros PenaElliot Smith3Builds that failed at the build request stage need a custom dashboardnormalMedium+Look at 8440RESOLVED
9475Belen Barros PenaElliot Smith20db locking - Nothing happens when you click the "Create custom image" buttonnormalMedium+RESOLVED
9893Richard PurdieElliot Smith0.5Exception from toaster_buildhistory_dumpmajorMedium+RESOLVED
10269Francisco PedrazaFrancisco PedrazaEthernet is not workingnormalUndecidedRESOLVED
9474Gary ThomasGary Thomas1epiphany doesn't work on ARMnormalMedium+RESOLVED
8784Hongxu JiaHongxu JiaIMAGE_LINGUAS did not support multilib correctlynormalMediumRESOLVED
9896Chen QiHongxu Jiagroff_1.18.1.4 do_compile failurenormalMediumRESOLVED
10015Ed BartoshHumberto Ibarra1oe-selftest --coverage produces empty coverage report on OpenSUSEnormalMedium+RESOLVED
10245Richard PurdieJianxun Zhangqemu 2.7.0 target recipe fails to buildnormalHighRESOLVED
10008David RodriguezJose Perez C[Test Case 25] connection to Target can not be carried outnormalMediumRESOLVED
10067Bill RandleJose Perez CHost sanity check fails for CentOS 7normalMedium+RESOLVED
9929Patrick OhlyJoshua Lockpseudo 1.8.1: potential performance regressionnormalHighRESOLVED
9857Joshua LockJoshua Lock3sstate install doesn't preserve extended attributes on filesnormalMedium+RESOLVED
10211Joshua LockJoshua LockNew runqemu makes it harder to use on hosts other than the build machinenormalMedium+RESOLVED
10238brian averyJoshua Lock0.5new runqemu fails when you change the DEPLOY_IMAGE_DIR variable for the testnormalMedium+RESOLVED
10240Joshua LockJoshua LockPython3 runqemu doesn't support calling testimage on QEMU artefacts copied from another host/build dirnormalMedium+RESOLVED
10036Paul EggletonJuro Bystrickyncurses-native fails at do_install using make 4.2normalMediumRESOLVED
10018Daniel ThompsonJussi Kukkonenpulseaudio server crashes on bluetooth disconnectnormalMedium+RESOLVED
1018Scott GarmanRobert Yang3runqemu script has bugs with the audio optionnormalLowRESOLVED
7554Mario Domenech GoulartRobert Yang0.5Ownership issue in package contentsmajorMediumRESOLVED
9495Robert YangRobert Yang5Can't boot efi image (iso or vmdk) in virtualboxnormalMediumRESOLVED
9415Robert YangRobert Yang5IMAGE_FSTYPES: split image type and compress formatnormalUndecidedRESOLVED
10162Mariano LopezMariano Lopezoe-selftest: When using xml reporting runqemu failsnormalHighRESOLVED
9926Mariano LopezMariano Lopez2testimage/testexport: When installed packages if there is more than json file just one will be processednormalMediumRESOLVED
8383Paul EggletonMariano Lopez2smart runtime test failurenormalMedium+RESOLVED
9763Andreas FenkartMariano Lopez1tar --exclude option is position-sensitivenormalMedium+RESOLVED
9765Mariano LopezMariano Lopez3testexport: Test SDK generation and installation for exported tests.normalMedium+RESOLVED
9932Mariano LopezMariano Lopez4testimage/testexport: Extracting packages with symlinks failsnormalMedium+RESOLVED
9943Joe SlaterMariano Lopez1userdel_sysroot_sstate() deletes only first user/groupnormalMedium+VERIFIED
9996Jose Perez CMariano Lopez1Testimage is failing due missing "__init__.py" filemajorMedium+VERIFIED
9131Francisco PedrazaMark Hatle10Prelink breaks fork IFUNCmajorHighRESOLVED
10137Jose Perez CMarkus Lehtonenoe-build-perf-test is not giving consistent metrics for build performancemajorHighVERIFIED
9351Cliff BrakeMarkus Lehtonen1Issues using bitbake with externalsrc and gitnormalMedium+RESOLVED
9499Ola NilssonMarkus Lehtonen1license.bbclass find_license_files does not process LICENSE_pn variables correctlynormalMedium+RESOLVED
10244Richard PurdieMarkus Lehtonensmart runtime testing sometimes fails with obtuse errorsnormalMedium+RESOLVED
9217Martin JansaMartin Jansa10Many unsolveable QA warnings from build-deps and file-rdepsnormalMediumRESOLVED
7436Ross BurtonMaxin B. John1kbd build racenormalMediumRESOLVED
9987Ross BurtonMaxin B. Johnsysprof has floating dependency on polkitnormalMediumRESOLVED
10040Ross BurtonMaxin B. JohnSome recipes use DEBIAN_MIRROR for SRC_URInormalMediumBackport to KrogothRESOLVED
10045David RodriguezMaxin B. JohnMedia player cannot be closed Minnow32normalMediumRESOLVED
10074Markus LehtonenMaxin B. Johnhdparm: invalid usage of LICENSE and LICENSE_<pkg>normalMediumRESOLVED
9093Belen Barros PenaMichael Wood2Hide scary errors while importing recipe information from the layer indexnormalMediumRESOLVED
9425Elliot SmithMichael Wood4Custom image cannot be downloaded until after it is builtnormalMedium+RESOLVED
10004Richard PurdieMichael Halsteadmail command missing on ubuntu1604 workernormalUndecidedRESOLVED
10154Bill RandleMichael HalsteadEclipse-poky-neon requires java 1.8.0 to buildnormalUndecidedRESOLVED
10164Jonathan LiuJonathan Liu0.01RM_OLD_IMAGE = "1" doesn't remove old .vdi and .hdddirect imagesnormalUndecidedRESOLVED
9865Patrick OhlyPatrick Ohly"inherit" invalid in .inc file when included in distro confignormalMediumRESOLVED
9972Paul EggletonPaul Eggletonrecipetool: setvar fails on empty bbappend filenormalMediumRESOLVED
10002 Paul Eggleton1Suggested glossary entries for PATH and EXTRANATIVEPATHnormalMedium01 August 2016: RESOLVEDRESOLVED
10023Ross BurtonPaul Eggletonrecipetool create breaks on github tarballsnormalMediumRESOLVED
10134Leonardo Sandoval GonzalezPaul EggletonUNINATIVE_CHECKSUM configuration failure on core-image-minimal's do_populate_sdk_ext taskmajorMediumRESOLVED
8884Paul EggletonPaul Eggleton1Locked signature warning is shown even if package can be fetched from SSTATE_MIRRORSnormalMedium+RESOLVED
9083Bogdan Alexandru VoiculescuPaul Eggleton1Extensible SDK: SDK installation ERROR: Unexpected tasks left over to be executednormalMedium+RESOLVED
9626Juro BystrickyPaul EggletonERROR: core-image-sato-1.0-r0 do_testsdkext: Couldn't install the SDK EXT:normalMedium+RESOLVED
10149Mark HatlePaul EggletonCrash in image.bbclassnormalMedium+RESOLVED
9890Chen QiChen Qigettext-native (0.16.1 version) do_populate_sysroot failsnormalMediumRESOLVED
9575Leonardo Sandoval GonzalezChen Qi5Test SDK EXT failed on core-image-sato for MIPS architecturecriticalMedium+RESOLVED
9577Leonardo Sandoval GonzalezChen Qi3gen-lockedsig-cache fails when populating sdk ext on PPC architecturenormalMedium+RESOLVED
9772Jussi KukkonenKhem Rajmusl libgcc_s.so.1 missing symbols on targetnormalMedium+RESOLVED
9991niqingliang2003Khem Rajgcc6: qtbase5 compile error.normalMedium+RESOLVED
7552 Randy Witt1Generated SDK has "expect" headers in wrong locationnormalMediumRESOLVED
9922brian averyRandy WittNeed a webhook service for CROPS that allows us to kick off actions based on eventsnormalMediumRESOLVED
10155brian averyRandy Wittusersetup in the extsdk container is not doing a sudo -H so our user is getting the wrong $HOMEnormalMedium+RESOLVED
10129Leonardo Sandoval GonzalezRichard Purdiegcc-runtime fails to build if libunwind in sysroot with muslmajorHighRESOLVED
10227Joshua LockRichard Purdienightly-oecore do_testimage fails with "core-image-sato - FAILED to start qemu - check the task log and the boot log"normalHighRESOLVED
9740Enrico ScholzRichard Purdie[PATCH] fetch: copy files with -HnormalMedium+RESOLVED
9902brian averyRichard Purdiethe tmp/cache can get corrupted and prevent buildingnormalMedium+RESOLVED
10115Leonardo Sandoval GonzalezRichard PurdieStack overflow on persist_data modulecriticalMedium+RESOLVED
10052Joshua LockRoss BurtonStop known selftest failures making it to error reportingnormalHighRESOLVED
10028Yi ZhaoRoss BurtonFail to build sudoku-savant with toolchain SDKnormalMediumRESOLVED
8988Francisco PedrazaRoss Burton1test_rpm_query_nonroot (oeqa.runtime.rpm.RpmInstallRemoveTest) - Failed to create new usernormalMedium+Jethro BackportVERIFIED
9064Ross BurtonRoss Burton1do_unpack does not wipe old source treemajorMedium+RESOLVED
9776Alexandru RomanRoss Burton5RPM/SMART fail on qemuarmnormalMedium+VERIFIED
9994Patrick OhlyRoss Burtonyocto-uninative.inc: please create and use a new uninative tarballnormalMedium+RESOLVED
10027Yi ZhaoRoss BurtonFail to run 'bitbake linux-yocto -c menuconfig'normalMedium+VERIFIED
10106Paul EggletonRoss BurtonUsing local mirror in SSTATE_MIRRORS results in "changed cwd" warningsminorMedium+RESOLVED
9964 Scott Rifenbark1Suggested fleshing out of the do_compile documentationnormalMedium29 July 2016: IN PROGRESS REVIEWRESOLVED
9965 Scott Rifenbark1Suggested fleshing out of the do_configure documentationnormalMedium18 July 2016: IN PROGRESS REVIEWRESOLVED
9985 Scott Rifenbark1Suggested clarification and motivation for the override-style operatorsnormalMedium01 August 2016: IN PROGRESS REVIEWRESOLVED
10013 Scott Rifenbark1Suggested changes to the INITRAMFS_IMAGE_BUNDLE glossary entrynormalMedium01 August 2016: RESOLVEDRESOLVED
9966 Scott Rifenbark1Suggested fleshing out of the do_install documentationnormalUndecided18 July 2016: IN PROGRESS REVIEWRESOLVED
10003 Scott Rifenbark1Mention what happens when non-existent variables are expandednormalUndecided22 July 2016: IN PROGRESS REVIEWRESOLVED
9491Paul EggletonStephano CetolaEnable explicit removal of support packages when not needednormalMedium+RESOLVED
9815Beth 'pidge' FlanaganStephano CetolaSSTATE_MIRRORS does not support http* with basic authenticationnormalMedium+RESOLVED
10038Tim OrlingTim Orling0.5[meta-qt4, -lsb] krogoth: qt4-native fails to build on gcc-6 host; has "already stripped" QA errorsnormalMedium+VERIFIED
10039Tim OrlingTim Orling0.5[meta-qt4, -lsb] master: qt4-native fails to build on gcc-6 host; has "already stripped" QA errorsnormalMedium+RESOLVED
9510Tristan Van BerkomTristan Van Berkom2gcc-cross-initial parallel make problem / build break (found on aarch64)normalMediumRESOLVED
   191.91     


M3 Stabilize schedule

Release Candidate and Milestone Release schedule (Full Pass QA test follows every RC build)

  • RC1: 8/29/16
  • RC2: 9/2/16
  • M3 release: 9/19/16

M4 (8/29/16 to Oct. 28, 2016 -- 9 weeks: planning done in week 1, bug fixes 2-4, stabilization week 5-8, release week 9)

M4 Bug/fix Cutoff is 10/3/16

IDRequesterAssigneeESummary (20 tasks) SeverityPWhiteboardStatus
7744Belen Barros PenaBelen Barros Pena3Improve messaging in empty states when Toaster does not have any layer informationenhancementMediumGUI design pendingRESOLVED
10410Leonardo Sandoval GonzalezDaniela Plascencia3Solve conflict on python-unidiff v1 recipeenhancementMedium+RESOLVED
9707Jianxun ZhangJianxun Zhang1Systemd-boot: Update documents for new EFI bootloaderenhancementMedium+07 Sept 2016: RESOLVEDVERIFIED
9457Leonardo Sandoval GonzalezLeonardo Sandoval Gonzalez10patchtest: document deployment with isolation featuresenhancementHighRESOLVED
10375Leonardo Sandoval GonzalezLeonardo Sandoval Gonzalez2patchtest: result summary must be created inside guestenhancementMedium+RESOLVED
7477Cristian IorgaRobert Yang2runqemu should support running poky tinyenhancementMedium08 August 2016: NEEDINFORESOLVED
7515Ross BurtonMariano Lopez10Add CVE testing toolenhancementMedium+RESOLVED
6238David ReynaMichael Wood2delete projects/builds through the toaster UIenhancementMedium+GUI design availableRESOLVED
8132Belen Barros PenaMichael Wood4Implement deleting custom imagesenhancementMedium+GUI design availableRESOLVED
8162Paul EggletonMichael Halstead4patchwork: clear out the superseded and already merged patchesenhancementMedium+RESOLVED
4209Dave StewartRandy Witt25Extend our developer experience to enable system and app development on Windows or MacOSenhancementMedium+This is a placeholder bug for Eclipse for non Linux platform bug, the estimate will be reflected in the blocking bugsRESOLVED
10119brian averyRandy Witt1eSDK container solution should be extended to run on windows (and mac)enhancementMedium+RESOLVED
10120brian averyRandy Witt5Bitbake container solution should be extended to run on windows (and mac)enhancementMedium+RESOLVED
9737Enrico ScholzRichard Purdie1[PATCH] ui/knotty: give out start time of taskenhancementMedium+RESOLVED
8851Paul EggletonRoss Burton5Add bashism checks for shell script functionsenhancementMedium+RESOLVED
9672Mariano LopezScott Rifenbark2Add documentation for package installation during runtime testingenhancementMedium7 June 2016: ACCEPTEDRESOLVED
10066 Scott Rifenbark1Suggested new section on listing package contentsenhancementMedium07 Sept 2016: RESOLVED/MOVEDRESOLVED
9679Paul EggletonScott Rifenbark1Add a small section on dependencies in the Writing a New Recipe sectionenhancementMedium+04 Oct 2016: RESOLVEDRESOLVED
3442Alexandru GeorgescuTim Orling3Eclipse-plugin for Windows should be documentedenhancementMedium04 May 2015 - ACCEPTEDRESOLVED
10111Tim OrlingTim Orling3.5[eclipse-poky] readme.txt is out of date and not in an obvious locationenhancementMediumRESOLVED
   88.5     

M4 Bugs

IDRequesterAssigneeESummary (184 tasks) SeverityPWhiteboardStatus
10026Yi ZhaoAlejandro Hernandez3Kernel panic for custom qemux86-64 bsp with yocto-bspnormalMedium+RESOLVED
10189David RodriguezAlejandro HernandezCannot install images Genericx86, Genericx86_64, Genericx86_64-lsb from USB, panic message is displayednormalMedium+RESOLVED
10262Francisco PedrazaAlejandro HernandezSD card not being recognized when trying to install the imagenormalMedium+YP 2.2 M4 RC1 BUILD BLOCKING BUGVERIFIED
10157Alexandru MoiseAníbal Limón3rpm: Segmentation fault when running parallel multiple "rpm -qi" commands as rootnormalHighRESOLVED
10225Joshua LockAníbal Limón3Signs of a race in do_testimagenormalHighRESOLVED
10399Benjamin EsquivelAníbal Limón0.3bitbake is unable to handle exceptions past the clean_environment() callcriticalHighRESOLVED
10330Aníbal LimónAníbal Limón3bitbake with memory resident don't report SSTATE progressnormalMedium+YP 2.2 M4 RC1 BUILD BLOCKING BUGRESOLVED
9447LibertadBelen Barros PenaTest bitbake variables - IMAGE_FSTYPES allows you to choose type "tartar.gz"normalLowRESOLVED
9864Belen Barros PenaBelen Barros PenaThe "build summary" link in the left navigation is not active when the URL includes #errors or #warningsminorLowRESOLVED
10037LibertadBelen Barros PenaCustom image page details repeats layer informationnormalLowRESOLVED
10179LibertadBelen Barros PenaDefault Columns in Tasks table include "Recipe Version"minorLowVERIFIED
8034brian averyBelen Barros Pena2typeahead search needs words to indicate it is constrained to the added layers.normalMediumRESOLVED
9611brian averyBelen Barros PenaUnder Project->Bitbake variable, We disallow variables with a '/' in themnormalMediumRESOLVED
9832LibertadBelen Barros Pena(Tasks executed) and (Tasks not executed) link in build summary dont query any task when clicking on themnormalMediumRESOLVED
10370Benjamin EsquivelBenjamin Esquivelselftest: test_invalid_recipe_src_uri fails to locate fetcher errornormalMedium+RESOLVED
10397Benjamin EsquivelBenjamin Esquivel1oe-init-build-env-memres <directory> loops indefinitelymajorMedium+RESOLVED
10199Sujith Hbrian avery5Toaster when fed with custom fixture raises error due to malformed pathnormalMediumRESOLVED
1989Paul EggletonBruce Ashfield4Default module selections need attentionminorMedium+RESOLVED
10341Joshua LockAndré Draszikcve-check-tool fails to build (in master-next)normalMediumRESOLVED
6767Yi ZhaoCalifornia Sullivan2kernel version mismatched on some BSPsminorMediumRESOLVED
10261Jose Perez CCalifornia Sullivan[Test Case 1059] Parselogs is failing giving error: amd_nb: Cannot enumerate AMD northbridgesnormalMediumVERIFIED
10606Juan RamosCalifornia Sullivan[Test Case 196] Install from USB device to HDD on NUC is failingnormalMediumRESOLVED
10291Jose Perez CCalifornia Sullivan[Test Case 1059] Parselogs is failing giving error: genericx86-64 getty[1311]: tcgetattr: Input/output error^MnormalMedium+YP 2.2 M4 RC1 BUILD BLOCKING BUGVERIFIED
9953Leonardo Sandoval GonzalezDaniela Plascencia3patchtest-oe: some series cannot be parse correctly and no checks can be donenormalMedium+RESOLVED
9955Leonardo Sandoval GonzalezDaniela Plascencia5patchtest-oe: string encoding error on some seriesnormalMedium+RESOLVED
10374Leonardo Sandoval GonzalezDaniela Plascencia2patchtest: guest machine halts on power offnormalMedium+RESOLVED
8188Belen Barros PenaDavid Reyna10The variable history is missing the layer namenormalMediumRESOLVED
8812daweidengke2Some util-linux ptests failnormalMediumRESOLVED
9662Carlos Rafael GianiCarlos Rafael Giani1patchdir fails silently if no trailing slash is presentnormalMediumRESOLVED
10201Randy WittEd Bartosh1BBSERVER permutes the hash preventing toaster/(memory resident bitbake) from using sstate generated without BBSERVERnormalHighRESOLVED
10107Belen Barros PenaEd BartoshKernel artifacts not shownnormalMediumRESOLVED
10163brian averyEd Bartosh4having a poky git checkout that mixes http and git: urls for remotes fails to build if it is a local projectnormalMediumRESOLVED
10221Belen Barros PenaEd Bartosh2Builds where you specify a task show as if they had 2 targetsnormalMediumRESOLVED
10306LibertadEd Bartosh1Cant build images in local projectnormalMediumVERIFIED
10185Belen Barros PenaEd Bartosh2Image builds not showing as complete in the UI after finishingnormalMedium+RESOLVED
9551Joshua LockPlauchu Edwin1.5Resolve string formatting issues in unzipnormalMedium+RESOLVED
9752Benjamin EsquivelPlauchu Edwin1ptest results do not include all the components testedmajorMedium+RESOLVED
8576Paul EggletonFrancisco Pedraza2QemuRunner logging for qemu start failure does not log anything to the console in oe-selftestmajorMedium+RESOLVED
9667Henry BruceHenry Bruce2Image types in quick start guide should be appropriate and consistentnormalMedium+03 Oct 2016: IN PROGRESS REVIEWRESOLVED
10207Humberto IbarraHumberto Ibarra1oe-selftest requires to document python-coverage requirementsnormalMedium01 Sept 2016: NEEDINFORESOLVED
10301Yi ZhaoHumberto Ibarra2Update yocto-bsp script for kernel 4.8normalMedium+YP 2.2 M4 RC1 BUILD BLOCKING BUGRESOLVED
10367Maxin B. JohnJianxun Zhang0.5Upgrade to sqlite version 3.14.1 results in increased build time (performance related)normalMedium+RESOLVED
10427Jussi KukkonenJianxun Zhang4installing a intel-corei7-64 image failsnormalMedium+RESOLVED
9652Francisco PedrazaJose Perez C2boot and install from USB shows warning message "(sdx): Volume was not properly unmounted...Please run fsck."majorMedium+Needs to be backported to 1.8.3 RESOLVED
10171Aníbal LimónJoshua Lock2Autobuilder fails to push into buildhistory reponormalHighRESOLVED
10275Yi ZhaoJoshua Lock1Missing i686 toolchain sdk for 2.2 M3 rc1normalHighRESOLVED
10285Jose Perez CJoshua Lockqemuboot.conf has the incorrect values for image_name and qb_default_kernelnormalHighVERIFIED
10419Joshua LockJoshua LockOld images disappear from my $TMPDIR/deploy/images when a new image is builtcriticalHighRESOLVED
10320Joshua LockJoshua Lock2nativesdk signatures changing between certain MACHINE settingsnormalMedium+RESOLVED
10340Joshua LockJoshua Lock0.5nightly-mips-lsb sanity tests timeoutnormalMedium+RESOLVED
10349Anton GerasimovJoshua Lockrenameat() loses extended attributesnormalMedium+RESOLVED
10116Leonardo Sandoval GonzalezJuro Bystrickybusybox parallel make racenormalHighRESOLVED
10274Yi ZhaoJuro Bystricky1Missing build-appliance image for 2.2 M3 rc1normalHighVERIFIED
9281Christopher LarsonJuro Bystricky1Changing SDK_OS hits warnings unless you wipe tmpnormalMedium+RESOLVED
10354Michel D'HOOGEJuro Bystrickygcc-runtime_5.3: misplaced include filesnormalMedium+RESOLVED
10380Juro BystrickyJuro Bystrickymultilib-example2.conf fails testsdknormalMedium+RESOLVED
9849Martin JansaJussi Kukkonen0.5libdrm autodetects dependenciesnormalMediumRESOLVED
10191Yi ZhaoJussi Kukkonen1Fail to build galculator with toolchain SDK on Fedora 24 i686normalMediumRESOLVED
10273Francisco PedrazaJussi KukkonenYou can't add multiple files in media playernormalMediumVERIFIED
10386Jussi KukkonenJussi Kukkonen1matchbox-terminal upgrade increased disk footprint by ~300 MBnormalMediumRESOLVED
9851Martin JansaJussi Kukkonen0.5piglit fails to build on qemux86*normalMedium+RESOLVED
10041David RodriguezJussi Kukkonen0.5mediaplayer fails to play audio on skylake (xv problem)normalMedium+VERIFIED
10290Jussi KukkonenJussi Kukkonengnutls has relocations in .text on x86normalMedium+RESOLVED
10228Joshua LockLeonardo Sandoval Gonzalez3Very frequent SSH connection failures during oe-selftest on qemuppcnormalHighRESOLVED
9978Belen Barros PenaLibertadToaster is showing incorrect task dependency informationnormalMedium+RESOLVED
10024Yi ZhaoRobert Yang5Warning "Child process exit status 4: lock_held" when building imagenormalHighRESOLVED
6957Krzysztof SywulaRobert Yang5[toolchain/uclibc]very long pathsnormalMediumRESOLVED
8939Phil ReidRobert YangPseudo: Lots of [host-user-contaminated] warningnormalMediumRESOLVED
9048Yi ZhaoRobert Yang5Failed to build iptables with extensible sdk on Fedora 23 i686normalMediumVERIFIED
10202Robert YangRobert Yangsgml-common-native: do_populate_sysroot failed (maybe sstate related)normalMediumVERIFIED
10265Robert YangRobert Yang1nativesdk-qemu-helper: runqemu in sdk should check OECORE_NATIVE_SYSROOT and OECORE_TARGET_SYSROOTnormalMedium+RESOLVED
10270Joshua LockRobert Yang1Raciness when invoking multiple instances of runqemu via testimage on the autobuildernormalUndecidedRESOLVED
10313Ming LiuMing Liulibnl fail to build with muslnormalMediumRESOLVED
10319Joshua LockMariano Lopez2cp failures during PublishArtifacts should cause the step to failnormalHighRESOLVED
10114 Mariano Lopez1Insufficent error-handling in SDK installernormalMedium+Should require backport alsoRESOLVED
10324Mark HatleMark HatleWhen running builds in a docker contain, they occasionally fail and close the containernormalUndecidedRESOLVED
10389Mark HatleMark Hatlelinuxloader.bbclass does not understand mips64normalUndecidedRESOLVED
9416Markus LehtonenMarkus Lehtonen3rpm: tmpfile creation failsnormalMedium+RESOLVED
9975Ross BurtonMarkus Lehtonen5Analyse performance regression against 2.1majorMedium+RESOLVED
10186Mark HatleMarkus Lehtonen1Typo in adding an event handler leads to confusing errornormalMedium+RESOLVED
10299 Markus LehtonenDaemon stop after update-alternatives prevent package upgradenormalMedium+YP 2.2 M4 RC1 BUILD BLOCKING BUGRESOLVED
10223Jussi KukkonenMaxin B. Johnlibical build fails after changing machine (QA check for tmpdir in .pc file)normalMediumRESOLVED
10213Francisco PedrazaMaxin B. JohnMedia files can't be played on NUCnormalMedium+VERIFIED
9097Belen Barros PenaMichael Wood4Remove validation messages when layers checkout directory and build directory are correctly setnormalMediumRESOLVED
9936Belen Barros PenaMichael WoodThe "Add layer" button in the import layer page is always disablednormalMediumVERIFIED
10286Belen Barros PenaMichael WoodDeleting builds and projects should be a modal processnormalMediumGUI design pendingRESOLVED
10289Belen Barros PenaMichael WoodDeleting a project while a build is in progress causes the "all builds" page to errornormalMediumGUI design pendingRESOLVED
9455Phlip BalisterMichael Wood4When I try to make a new project toaster cries "Fields missing: projectversion"normalMedium+RESOLVED
10284Joshua LockMichael HalsteadFTP failures on new cluster resulting in bitbake-selfcheck and checkuri failuresnormalHighRESOLVED
10339Joshua LockMichael Halstead1Fedora24 builder fails oe-selftest with "AssertionError: This test needs GnuPG"normalHighRESOLVED
10371Leonardo Sandoval GonzalezMichael Halsteadpatchtest: patchtest-oe: make code publicnormalHighRESOLVED
10109brian averyMichael Halsteadinstall Toaster Mailing list patchwork instance on https://patchwork.openembedded.org/majorMedium+RESOLVED
10192Paul EggletonMichael Halstead0.5layer index recipe parsing brokenmajorMedium+RESOLVED
10279Paul EggletonPaul EggletonPickle protocol used for donestamp is incompatible with older versionsminorMediumRESOLVED
10337Henry BrucePaul Eggletondevtool: fails to add an npm project if nodejs-native is not already builtnormalMediumRESOLVED
10046Yi ZhaoPaul Eggleton1Progress bar sometimes leaves old bars on screennormalMedium+YP 2.2 M4 RC1 BUILD BLOCKING BUGRESOLVED
10209Yi ZhaoPaul Eggletonlist-packageconfig-flags.py doesn't worknormalMedium+RESOLVED
10210Richard PurdiePaul Eggleton1Setting TMPDIR breaks ESDK generationnormalMedium+RESOLVED
10214brian averyPaul Eggleton2The current eclipse plugin cannot launch qemu or make a useable rootfs with the extensible sdknormalMedium+YP 2.2 M4 RC1 BUILD BLOCKING BUGVERIFIED
10328California SullivanPaul GortmakerKernel oops with linux-yocto-rt 4.8normalMedium+YP 2.2 M4 RC1 BUILD BLOCKING BUGRESOLVED
10436Maxin B. JohnPaul Gortmakercore-image-rt for qemux86 fails to bootnormalMedium+RESOLVED
10255 Chen QiSDK siteconfig has HOST information instead of TARGET'smajorHighRESOLVED
8642Robert YangChen Qi3The "32" is a broken symlink in aarch64's mutilib SDKnormalMedium+RESOLVED
9793brian averyRandy WittToaster container solution should be extended to run on windows (and mac)normalMedium+RESOLVED
10148Randy WittRandy Witt1extsdk container: devtool modify fails due to missing git confignormalMedium+RESOLVED
7950Robert YangRichard Purdie2gcc-cross-canadian-i586 doesn't work PREFERRED_VERSIONnormalMediumRESOLVED
8273Ross BurtonRichard Purdie1openjade-native doesn't remove from sysroot correctlynormalMediumRESOLVED
10335Juro BystrickyRichard PurdieTask failure not reflected in Tasks SummarynormalMediumRESOLVED
8771Maxin B. JohnRichard Purdie5test_smart_channel_add (oeqa.runtime.smart.SmartRepoTest) failed in AutobuildernormalMedium+RESOLVED
9513Yi ZhaoRichard Purdie2Failed to install sdk_ext for i686normalMedium+VERIFIED
10030Ross BurtonRichard PurdieSpurious populate_sysroot warningsnormalMedium+RESOLVED
10282brian averyRichard PurdiePrelink: doesn't work on qemux86-64 on the qemu targetnormalMedium+RESOLVED
10420Ross BurtonRoss BurtonException when executing gdkpixbuf completion hookmajorHighRESOLVED
9889Chen QiRoss Burton1cvs is required to be installed on host to support cvs SRC_URInormalMedium29 July 2016: Set documentation flag to "No"RESOLVED
9287Yi ZhaoRoss Burton1Failed to build nativesdk-glibc for qemumips and qemumips64 on Fedora 23 i686normalMedium+YP 2.2 M4 RC1 BUILD BLOCKING BUGVERIFIED
9639Martin JansaRoss Burton1cmake-native autodetects libidn-nativecriticalMedium+RESOLVED
10102Martin JansaRoss Burton2gdk-pixbuf-native missing dependency on pcre needed by glib-2.0-nativenormalMedium+RESOLVED
10272Francisco PedrazaRoss Burton1Wav and Ogg files are not able to playnormalMedium+VERIFIED
10280Paul EggletonRoss Burton1LIC_FILES_CHKSUM error is no longer fatalmajorMedium+RESOLVED
10610Christopher LarsonSaul Woldmeta-intel unconditionally overrides scripts/lib/wic/canned-wks/systemd-bootdisk.wksmajorHighRESOLVED
10251Jonathan LiuSaul Woldlinux-firmware packages include licenses from all firmware packagesnormalMediumRESOLVED
8245Jussi KukkonenSaul Wold0.1dmesg qa check: fbcon_init: detected unhandled fb_set_par error (timeout case)normalMedium+RESOLVED
10278Paul EggletonSaul Wold2Switching PREFERRED_PROVIDER_virtual/kernel leads to errorsnormalMedium+RESOLVED
10347Joshua LockSaul WoldParselog failure on nightly-rpm buildernormalMedium+RESOLVED
10366Maksim E. KozlovSaul Woldtrouble with perf do_installnormalMedium+RESOLVED
10482Benjamin EsquivelSaul WoldSerial terminal shows no output in joule with meta-intelnormalMedium+Possible release blockerRESOLVED
10709Juan RamosSaul Woldcore-image-sato-sdk-intel-quark.wic doesn't bootnormalMedium+RESOLVED
7718Paul EggletonScott Rifenbark0.5target:task syntax not mentioned in --helpminorMedium29 July 2016: RESOLVEDRESOLVED
8019Topi KuutelaScott Rifenbark1Clarification of IMAGE_INSTALL variablenormalMediumRESOLVED
9380 Scott Rifenbark1The manual does not mention automatically added version restrictionsnormalMedium21 July 2016: RESOLVEDRESOLVED
9580Henry BruceScott Rifenbark1Missing package dependency in quick start guide for FedoranormalMedium01 Sept 2016: RESOLVEDRESOLVED
10011 Scott Rifenbark1Suggested addition to the PROVIDES glossary entry to explain virtual targetsnormalMediumRESOLVED
10012 Scott Rifenbark1Suggested rewriting of the (currently semi-nonsensical) INITRAMFS_IMAGE glossary entrynormalMedium01 August 2016: RESOLVEDRESOLVED
10068 Scott Rifenbark1Suggested rewording of the BPN glossary entrynormalMedium08 August 2016: RESOLVEDRESOLVED
10071 Scott Rifenbark1Suggested clarifications to [dirs] and [cleandirs]normalMedium04 August 2016: RESOLVEDRESOLVED
10100 Scott Rifenbark1Suggested documentation for bb.utils.contains(), bb.utils.mkdirhier(), and bb.data.inherits_class()normalMedium07 Sept 2016: RESOLVEDRESOLVED
10138 Scott Rifenbark1Small suggested version/revision-related clarificationsnormalMedium22 August 2016: RESOLVEDRESOLVED
10141 Scott Rifenbark1Suggested fleshing out of the sigdata/siginfo documentationnormalMedium22 August 2016: RESOLVEDRESOLVED
10144 Scott Rifenbark1Very minor nit in '2.3.2. Viewing Variable Values'normalMedium22 August 2016: RESOLVEDRESOLVED
10172 Scott Rifenbark1Suggested new section to clarify stamps, input checksums, and the sstate cachenormalMedium01 Sept 2016: RESOLVEDRESOLVED
10173 Scott Rifenbark1Suggested clarification of the OVERRIDES glossary entrynormalMedium01 Sept 2016: RESOLVEDRESOLVED
10174 Scott Rifenbark1Suggested rewriting of the CLASSOVERRIDE glossary entrynormalMedium01 Sept 2016: RESOLVEDRESOLVED
10175 Scott Rifenbark1Suggested rewriting of the MACHINEOVERRIDES glossary entrynormalMedium01 Sept 2016: RESOLVEDRESOLVED
10176 Scott Rifenbark1Suggested rewriting of the DISTROOVERRIDES glossary entrynormalMedium01 Sept 2016: RESOLVEDRESOLVED
10196 Scott Rifenbark1Suggested (currently missing) documentation for the 'export' keywordnormalMedium01 Sept 2016: RESOLVEDRESOLVED
10197 Scott Rifenbark1Suggested additions to the MLPREFIX glossary entrynormalMedium01 Sept 2016: RESOLVEDRESOLVED
10198 Scott Rifenbark1Suggested new note in the DEPENDS glossary entrynormalMedium01 Sept 2016: IN PROGRESS REVIEWRESOLVED
10248 Scott Rifenbark1Suggested new section on how automatically added runtime dependencies worknormalMedium21 Sept 2016: RESOLVEDRESOLVED
10292 Scott Rifenbark1Suggested addition to complete the description of 'bitbake -e'normalMedium22 Sept 2016: RESOLVEDRESOLVED
10293 Scott Rifenbark1Mention that single quotes can be used when assigning variablesnormalMedium22 Sept 2016: RESOLVEDRESOLVED
10294 Scott Rifenbark1Suggested addition re. empty packages in PACKAGESnormalMedium22 August 2016: RESOLVEDRESOLVED
10295 Scott Rifenbark1Suggested documentation for the 'depchains' automatic dependency mechanismnormalMedium22 Sept 2016: RESOLVEDRESOLVED
10296 Scott Rifenbark1Suggested documentation on using overrides with functionsnormalMedium22 Sept 2016: RESOLVEDRESOLVED
10297 Scott Rifenbark1Two suggested notes in the Other Tips section re. removing tmp/ and searchingnormalMedium22 Sept 2016: RESOLVEDRESOLVED
10298 Scott Rifenbark1Suggested DEPENDS update to demystify the implementation and give more examplesnormalMedium26 Sept 2016: RESOLVEDRESOLVED
10345 Scott Rifenbark1Suggested additions to mention 'bitbake -C' and clarify tainted tasksnormalMedium03 Oct 2016: RESOLVEDRESOLVED
10348 Scott Rifenbark1Suggested note to clarify how native recipes find dependenciesnormalMedium03 Oct 2016: RESOLVEDRESOLVED
9285Yi ZhaoScott Rifenbark1Failed to build gobject-introspection for qemumips64 on i686 hostsnormalMedium+23 Sept 2016: RESOLVEDRESOLVED
9554Ross BurtonScott Rifenbark2Add section for on-target debuggingnormalMedium+03 Oct 2016: RESOLVEDRESOLVED
9950 Scott Rifenbark1Suggested additions to the logging documentationnormalUndecided18 July 2016: RESOLVEDRESOLVED
10069 Scott Rifenbark1Suggested addition to explain how runtime virtual dependencies worknormalUndecided03 August 2016: RESOLVEDRESOLVED
10070 Scott Rifenbark1Make it clear that PARALLEL_MAKE(INST) won't work unless EXTRA_OEMAKE is passed to makenormalUndecided03 August 2016: RESOLVEDRESOLVED
10093 Scott Rifenbark1Suggested fleshing out of the anonymous function documentationnormalUndecided08 August 2016: RESOLVEDRESOLVED
10094 Scott Rifenbark1Small suggested clarifications to the PACKAGES and FILES glossary entriesnormalUndecided08 August 2016: RESOLVEDRESOLVED
10099 Scott Rifenbark1Clarifying and fleshing out debugging with 'bitbake -e'normalUndecided08 August 2016: RESOLVEDRESOLVED
10117 Scott Rifenbark1Suggested rewriting to make '3.9.1. Dependencies Internal to the .bb File' less misleadingnormalUndecided12 August 2016: IN PROGRESS REVIEWRESOLVED
10131 Scott Rifenbark1Suggested rewriting of '2.3.5. Dependency Graphs'normalUndecided12 July 2016: RESOLVEDRESOLVED
10132 Scott Rifenbark1Clarifications/corrections to '2.3.1. Viewing Logs from Failed Tasks'normalUndecided12 July 2016: RESOLVEDRESOLVED
10135 Scott Rifenbark1Some small mostly package-related nitsnormalUndecided12 July 2016: RESOLVEDRESOLVED
10208Tim OrlingScott Rifenbark1Fedora oe-selftest requires python3-GitPython (now that we are python3)normalUndecided01 Sept 2016: RESOLVEDRESOLVED
10216 Scott Rifenbark1Suggested (currently missing) documentation for oe-pkgdata-utilnormalUndecided07 Sept 2016: RESOLVEDRESOLVED
10252 Scott Rifenbark1Suggested small note to avoid confusion re. the version specification in PREFERRED_VERSIONnormalUndecided14 Sept 2016: RESOLVEDRESOLVED
10356 Scott Rifenbark1Suggested addition to explain how the recipe cache worksnormalUndecided03 Oct 2016: RESOLVEDRESOLVED
10360 Scott Rifenbark1Add link to the OpenEmbedded style guidenormalUndecided03 Oct 2016: RESOLVEDRESOLVED
10363 Scott Rifenbark1Suggested note to clarify that bb.fatal() raises an exceptionnormalUndecided04 Oct 2016: RESOLVEDRESOLVED
10364 Scott Rifenbark1Suggested documentation to clarify BitBake-style vs. regular Python functions and bb.build.exec_func()normalUndecided04 Oct 2016: RESOLVEDRESOLVED
10377 Scott Rifenbark1Suggested change to make the SYSROOT_DIRS* variables more discoverablenormalUndecided05 Oct 2016: RESOLVEDRESOLVED
10029Stephano CetolaStephano Cetolatestimage requires sudo password to execute runqemu-ifup and runqemu-ifdownnormalMediumRESOLVED
10264Chen QiStephano Cetola1On-target postinstall failure results in a wrong state of an rpm packagenormalMedium+RESOLVED
10326Paul EggletonStephano Cetoladevtool modify with file entry using subdir no longer works properlynormalMedium+YP 2.2 M4 RC1 BUILD BLOCKING BUGRESOLVED
10346Mikko YlinenStephano CetolaGit should be able to apply patches when in an unconfigured state.normalMedium+YP 2.2 M4 RC1 BUILD BLOCKING BUGRESOLVED
10379Joshua LockStephano CetolaFAIL: test_devtool_update_recipe_local_filesnormalMedium+YP 2.2 M4 RC1 BUILD BLOCKING BUGRESOLVED
10388Michael WoodToaster default assigneeUpdate releases configuration for upcoming releasemajorUndecidedRESOLVED
10336Henry BruceTodor MinchevUnclear error message from SDK installer when host architecture is not compatiblenormalMedium+RESOLVED
   206.4     


M4 Stabilize schedule

Release Candidate and Milestone Release schedule (Full Pass QA test follows every RC build)

  • RC1: 10/3/16
  • RC2: 10/10/16
  • RC3: 10/17/16
  • RC4: 10/24/16
  • M4 release: 10/29/16

Yocto Project 2.2 release unscheduled features/tasks list

These features/tasks are planned for 2.2, but have not been scheduled to any specific milestone. As we move forward, more of these will be scheduled into each milestone, especially during milestone planning for each milestone above.

no bugzilla tickets were found
no bugzilla tickets were found
no bugzilla tickets were found
no bugzilla tickets were found
Personal tools