Qemumips-ltp

From Yocto Project
Jump to: navigation, search

Contents

1.2 M1 RC2

total: 33 (100%)

LTP cases status owner error msg lsb comment bugzilla
vma01 vma01 0 TINFO  : t = 0x40002000

vma01 0 TINFO  : v = 0x40103000 u = 0x40005000 vma01 0 TINFO  : s = 0x40005000, t = 0x40008000 vma01 1 TBROK  : no matched s = 0x40008000 found. vma01 2 TBROK  : Remaining cases broken vma01 0 TINFO  : t = 0x40002000 vma01 0 TINFO  : v = 0x40103000 vma01 1 TBROK  : unexpected VMA found. vma01 2 TBROK  : Remaining cases broken

n/a n/a
getrusage03 getrusage03_child 1 TBROK  : OPTION PARSING ERROR - parse_opts: ERROR - Only short options are allowed

getrusage03_child 2 TBROK  : Remaining cases broken

n/a This is a LTP bug. n/a
ksm05 LTP ksm05 1 TBROK  : open: errno=ENOENT(2): No such file or directory n/a It is a LTP bug. n/a
sockioctl01 LTP sockioctl01 4 TFAIL  : ATMARK on UDP ; returned -1 (expected -1), errno 25 (expected 22) n/a Inappropriate ioctl operation returning EINVAL with newer kernels. It is a LTP bug. n/a
sync_file_range01 sync_file_range01 1 TFAIL  : got unexpected error; expected 9: TEST_ERRNO=EINVAL(22): Invalid argument

sync_file_range01 2 TFAIL  : got unexpected error; expected 29: TEST_ERRNO=EINVAL(22): Invalid argument

n/a n/a
mmap10_2 LTP mmap10 0 TINFO  : add to KSM regions.

mmap10 0 TINFO  : use /dev/zero. mmap10 0 TINFO  : start tests. mmap10 1 TBROK  : madvise: errno=EINVAL(22): Invalid argument mmap10 2 TBROK  : Remaining cases broken

n/a It is a LTP bug. n/a
mmap10_3 LTP mmap10 0 TINFO  : add to KSM regions.

mmap10 0 TINFO  : use anonymous pages. mmap10 0 TINFO  : start tests. mmap10 1 TBROK  : madvise: errno=EINVAL(22): Invalid argument mmap10 2 TBROK  : Remaining cases broken

n/a It is a LTP bug. n/a
mmap10_4 LTP mmap10 0 TINFO  : add to KSM regions.

mmap10 0 TINFO  : use anonymous pages. mmap10 0 TINFO  : start tests. mmap10 1 TBROK  : madvise: errno=EINVAL(22): Invalid argument mmap10 2 TBROK  : Remaining cases broken

n/a It is a LTP bug. n/a
mmap10_5 LTP mmap10 0 TINFO  : add to KSM regions.

mmap10 0 TINFO  : use anonymous pages. mmap10 0 TINFO  : start tests. mmap10 1 TBROK  : madvise: errno=EINVAL(22): Invalid argument mmap10 2 TBROK  : Remaining cases broken

n/a It is a LTP bug. n/a
ld LTP Assertion 1 ..................

-) Assertion 2 .................. 1,4c1,3 < gcc: error: x.obj: No such file or directory < gcc: error: y.obj: No such file or directory < gcc: fatal error: no input files < compilation terminated. --- > gcc: x.obj: No such file or directory > gcc: y.obj: No such file or directory > gcc: No input files FAIL - ld failed to give expected error msg

n/a This is a LTP bug. [bug1162]
sysctl03 qemux86 n/a n/a n/a n/a n/a
syslog01 qemux86 n/a n/a n/a n/a n/a
syslog02 qemux86 n/a n/a n/a n/a n/a
syslog03 qemux86 n/a n/a n/a n/a n/a
syslog04 qemux86 n/a n/a n/a n/a n/a
syslog05 qemux86 n/a n/a n/a n/a n/a
syslog06 n/a n/a n/a n/a n/a
syslog07 qemux86 n/a n/a n/a n/a n/a
syslog08 qemux86 n/a n/a n/a n/a n/a
syslog09 qemux86 n/a n/a n/a n/a n/a
syslog10 qemux86 n/a n/a n/a n/a n/a
mtest06_2 qemux86 n/a n/a n/a n/a n/a
su01 qemux86 n/a n/a n/a n/a n/a
cron02 qemux86 n/a n/a n/a n/a n/a
cron_deny01 qemux86 n/a n/a n/a n/a n/a
cron_allow01 qemux86 n/a n/a n/a n/a n/a
cron_dirs_checks01 qemux86 n/a n/a n/a n/a n/a
file qemux86 n/a /opt/ltp/testcases/bin/file_test.sh: line 549: rpmbuild: command not found n/a n/a n/a
cron qemux86 n/a n/a n/a n/a n/a
logrotate qemux86 n/a n/a n/a n/a n/a
cpio qemux86 n/a n/a n/a n/a n/a
unzip01 qemux86 n/a n/a n/a n/a n/a
gzip01 qemux86 n/a n/a n/a n/a n/a

1.0.2

total: 35 (100%)

LTP cases status owner error msg lsb comment bugzilla
rt_sigqueueinfo01 LTP rt_sigqueueinfo01 1 TFAIL  : Test Failed

rt_sigqueueinfo01 2 TFAIL  : Test Failed

n/a This is a LTP bug. n/a
sync_file_range01 sync_file_range01 1 TFAIL  : got unexpected error; expected 9: TEST_ERRNO=EINVAL(22): Invalid argument

sync_file_range01 2 TFAIL  : got unexpected error; expected 29: TEST_ERRNO=EINVAL(22): Invalid argument

n/a n/a
mmap11 LTP mmap11 0 TINFO  : [471]

mmap11 1 TBROK  : pthread_create: errno=EAGAIN(11): Resource temporarily unavailable mmap11 2 TBROK  : Remaining cases broken

n/a It is a LTP bug. n/a
mmap10_2 LTP mmap10 0 TINFO  : add to KSM regions.

mmap10 0 TINFO  : use /dev/zero. mmap10 0 TINFO  : start tests. mmap10 1 TBROK  : madvise: errno=EINVAL(22): Invalid argument mmap10 2 TBROK  : Remaining cases broken

n/a It is a LTP bug. n/a
mmap10_3 LTP mmap10 0 TINFO  : add to KSM regions.

mmap10 0 TINFO  : use anonymous pages. mmap10 0 TINFO  : start tests. mmap10 1 TBROK  : madvise: errno=EINVAL(22): Invalid argument mmap10 2 TBROK  : Remaining cases broken

n/a It is a LTP bug. n/a
mmap10_4 LTP mmap10 0 TINFO  : add to KSM regions.

mmap10 0 TINFO  : use anonymous pages. mmap10 0 TINFO  : start tests. mmap10 1 TBROK  : madvise: errno=EINVAL(22): Invalid argument mmap10 2 TBROK  : Remaining cases broken

n/a It is a LTP bug. n/a
mmap10_5 LTP mmap10 0 TINFO  : add to KSM regions.

mmap10 0 TINFO  : use anonymous pages. mmap10 0 TINFO  : start tests. mmap10 1 TBROK  : madvise: errno=EINVAL(22): Invalid argument mmap10 2 TBROK  : Remaining cases broken

n/a It is a LTP bug. n/a
ksm01 LTP ksm01 0 TINFO  : KSM merging...

ksm01 1 TBROK  : open: errno=ENOENT(2): No such file or directory ksm01 2 TBROK  : Remaining cases broken

n/a It is a LTP bug. n/a
ksm01_1 LTP ksm01 0 TINFO  : KSM merging...

ksm01 1 TBROK  : open: errno=ENOENT(2): No such file or directory ksm01 2 TBROK  : Remaining cases broken

n/a It is a LTP bug. n/a
ksm03 LTP ksm03 0 TINFO  : KSM merging...

ksm03 1 TBROK  : open: errno=ENOENT(2): No such file or directory ksm03 2 TBROK  : Remaining cases broken

n/a It is a LTP bug. n/a
ksm03_1 LTP ksm03 0 TINFO  : KSM merging...

ksm03 1 TBROK  : open: errno=ENOENT(2): No such file or directory ksm03 2 TBROK  : Remaining cases broken

n/a It is a LTP bug. n/a
shmem_test_05 ERROR [line: 218] shmat failed: Invalid argument n/a n/a
sysctl03 qemux86 n/a n/a n/a n/a n/a
syslog01 qemux86 n/a n/a n/a n/a n/a
syslog02 qemux86 n/a n/a n/a n/a n/a
syslog03 qemux86 n/a n/a n/a n/a n/a
syslog04 qemux86 n/a n/a n/a n/a n/a
syslog05 qemux86 n/a n/a n/a n/a n/a
syslog06 n/a n/a n/a n/a n/a
syslog07 qemux86 n/a n/a n/a n/a n/a
syslog08 qemux86 n/a n/a n/a n/a n/a
syslog09 qemux86 n/a n/a n/a n/a n/a
syslog10 qemux86 n/a n/a n/a n/a n/a
mtest06_2 qemux86 n/a n/a n/a n/a n/a
su01 qemux86 n/a n/a n/a n/a n/a
cron02 qemux86 n/a n/a n/a n/a n/a
cron_deny01 qemux86 n/a n/a n/a n/a n/a
cron_allow01 qemux86 n/a n/a n/a n/a n/a
cron_dirs_checks01 qemux86 n/a n/a n/a n/a n/a
file qemux86 n/a /opt/ltp/testcases/bin/file_test.sh: line 549: rpmbuild: command not found n/a n/a n/a
cron qemux86 n/a n/a n/a n/a n/a
logrotate qemux86 n/a n/a n/a n/a n/a
cpio qemux86 n/a n/a n/a n/a n/a
unzip01 qemux86 n/a n/a n/a n/a n/a
gzip01 qemux86 n/a n/a n/a n/a n/a

1.1/M4 RC4

total: 37 (100%)

LTP cases status owner error msg lsb comment bugzilla
readlink03 LTP readlink03 9 TFAIL  : readlink() failed, Symlink Pathname is empty, errno=22, expected errno=2 n/a When 'Symlink Pathname is empty' the return value was 'ENOENT' but with newer kernels the return value is 'EINVAL'. It is a LTP bug. n/a
sockioctl01 LTP sockioctl01 4 TFAIL  : ATMARK on UDP ; returned -1 (expected -1), errno 25 (expected 22) n/a Inappropriate ioctl operation returning EINVAL with newer kernels. It is a LTP bug. n/a
rt_sigqueueinfo01 LTP rt_sigqueueinfo01 1 TFAIL  : Test Failed

rt_sigqueueinfo01 2 TFAIL  : Test Failed

n/a This is a LTP bug. n/a
sync_file_range01 sync_file_range01 1 TFAIL  : got unexpected error; expected 9: TEST_ERRNO=EINVAL(22): Invalid argument

sync_file_range01 2 TFAIL  : got unexpected error; expected 29: TEST_ERRNO=EINVAL(22): Invalid argument

n/a n/a
mmap11 LTP mmap11 0 TINFO  : [471]

mmap11 1 TBROK  : pthread_create: errno=EAGAIN(11): Resource temporarily unavailable mmap11 2 TBROK  : Remaining cases broken

n/a It is a LTP bug. n/a
mmap10_2 LTP mmap10 0 TINFO  : add to KSM regions.

mmap10 0 TINFO  : use /dev/zero. mmap10 0 TINFO  : start tests. mmap10 1 TBROK  : madvise: errno=EINVAL(22): Invalid argument mmap10 2 TBROK  : Remaining cases broken

n/a It is a LTP bug. n/a
mmap10_3 LTP mmap10 0 TINFO  : add to KSM regions.

mmap10 0 TINFO  : use anonymous pages. mmap10 0 TINFO  : start tests. mmap10 1 TBROK  : madvise: errno=EINVAL(22): Invalid argument mmap10 2 TBROK  : Remaining cases broken

n/a It is a LTP bug. n/a
mmap10_4 LTP mmap10 0 TINFO  : add to KSM regions.

mmap10 0 TINFO  : use anonymous pages. mmap10 0 TINFO  : start tests. mmap10 1 TBROK  : madvise: errno=EINVAL(22): Invalid argument mmap10 2 TBROK  : Remaining cases broken

n/a It is a LTP bug. n/a
mmap10_5 LTP mmap10 0 TINFO  : add to KSM regions.

mmap10 0 TINFO  : use anonymous pages. mmap10 0 TINFO  : start tests. mmap10 1 TBROK  : madvise: errno=EINVAL(22): Invalid argument mmap10 2 TBROK  : Remaining cases broken

n/a It is a LTP bug. n/a
ksm01 LTP ksm01 0 TINFO  : KSM merging...

ksm01 1 TBROK  : open: errno=ENOENT(2): No such file or directory ksm01 2 TBROK  : Remaining cases broken

n/a It is a LTP bug. n/a
ksm01_1 LTP ksm01 0 TINFO  : KSM merging...

ksm01 1 TBROK  : open: errno=ENOENT(2): No such file or directory ksm01 2 TBROK  : Remaining cases broken

n/a It is a LTP bug. n/a
ksm03 LTP ksm03 0 TINFO  : KSM merging...

ksm03 1 TBROK  : open: errno=ENOENT(2): No such file or directory ksm03 2 TBROK  : Remaining cases broken

n/a It is a LTP bug. n/a
ksm03_1 LTP ksm03 0 TINFO  : KSM merging...

ksm03 1 TBROK  : open: errno=ENOENT(2): No such file or directory ksm03 2 TBROK  : Remaining cases broken

n/a It is a LTP bug. n/a
ld LTP Assertion 1 ..................

-) Assertion 2 .................. 1,4c1,3 < gcc: error: x.obj: No such file or directory < gcc: error: y.obj: No such file or directory < gcc: fatal error: no input files < compilation terminated. --- > gcc: x.obj: No such file or directory > gcc: y.obj: No such file or directory > gcc: No input files FAIL - ld failed to give expected error msg

n/a This is a LTP bug. [bug1162]
sysctl03 qemux86 n/a n/a n/a n/a n/a
syslog01 qemux86 n/a n/a n/a n/a n/a
syslog02 qemux86 n/a n/a n/a n/a n/a
syslog03 qemux86 n/a n/a n/a n/a n/a
syslog04 qemux86 n/a n/a n/a n/a n/a
syslog05 qemux86 n/a n/a n/a n/a n/a
syslog06 n/a n/a n/a n/a n/a
syslog07 qemux86 n/a n/a n/a n/a n/a
syslog08 qemux86 n/a n/a n/a n/a n/a
syslog09 qemux86 n/a n/a n/a n/a n/a
syslog10 qemux86 n/a n/a n/a n/a n/a
mtest06_2 qemux86 n/a n/a n/a n/a n/a
su01 qemux86 n/a n/a n/a n/a n/a
cron02 qemux86 n/a n/a n/a n/a n/a
cron_deny01 qemux86 n/a n/a n/a n/a n/a
cron_allow01 qemux86 n/a n/a n/a n/a n/a
cron_dirs_checks01 qemux86 n/a n/a n/a n/a n/a
file qemux86 n/a /opt/ltp/testcases/bin/file_test.sh: line 549: rpmbuild: command not found n/a n/a n/a
cron qemux86 n/a n/a n/a n/a n/a
logrotate qemux86 n/a n/a n/a n/a n/a
cpio qemux86 n/a n/a n/a n/a n/a
unzip01 qemux86 n/a n/a n/a n/a n/a
gzip01 qemux86 n/a n/a n/a n/a n/a

1.1/M4 RC3

total: 37 (100%)

LTP cases status owner error msg lsb comment bugzilla
readlink03 LTP readlink03 9 TFAIL  : readlink() failed, Symlink Pathname is empty, errno=22, expected errno=2 n/a When 'Symlink Pathname is empty' the return value was 'ENOENT' but with newer kernels the return value is 'EINVAL'. It is a LTP bug. n/a
sockioctl01 LTP sockioctl01 4 TFAIL  : ATMARK on UDP ; returned -1 (expected -1), errno 25 (expected 22) n/a Inappropriate ioctl operation returning EINVAL with newer kernels. It is a LTP bug. n/a
rt_sigqueueinfo01 LTP rt_sigqueueinfo01 1 TFAIL  : Test Failed

rt_sigqueueinfo01 2 TFAIL  : Test Failed

n/a This is a LTP bug. n/a
sync_file_range01 sync_file_range01 1 TFAIL  : got unexpected error; expected 9: TEST_ERRNO=EINVAL(22): Invalid argument

sync_file_range01 2 TFAIL  : got unexpected error; expected 29: TEST_ERRNO=EINVAL(22): Invalid argument

n/a n/a
mmap11 LTP mmap11 0 TINFO  : [471]

mmap11 1 TBROK  : pthread_create: errno=EAGAIN(11): Resource temporarily unavailable mmap11 2 TBROK  : Remaining cases broken

n/a It is a LTP bug. n/a
mmap10_2 LTP mmap10 0 TINFO  : add to KSM regions.

mmap10 0 TINFO  : use /dev/zero. mmap10 0 TINFO  : start tests. mmap10 1 TBROK  : madvise: errno=EINVAL(22): Invalid argument mmap10 2 TBROK  : Remaining cases broken

n/a It is a LTP bug. n/a
mmap10_3 LTP mmap10 0 TINFO  : add to KSM regions.

mmap10 0 TINFO  : use anonymous pages. mmap10 0 TINFO  : start tests. mmap10 1 TBROK  : madvise: errno=EINVAL(22): Invalid argument mmap10 2 TBROK  : Remaining cases broken

n/a It is a LTP bug. n/a
mmap10_4 LTP mmap10 0 TINFO  : add to KSM regions.

mmap10 0 TINFO  : use anonymous pages. mmap10 0 TINFO  : start tests. mmap10 1 TBROK  : madvise: errno=EINVAL(22): Invalid argument mmap10 2 TBROK  : Remaining cases broken

n/a It is a LTP bug. n/a
mmap10_5 LTP mmap10 0 TINFO  : add to KSM regions.

mmap10 0 TINFO  : use anonymous pages. mmap10 0 TINFO  : start tests. mmap10 1 TBROK  : madvise: errno=EINVAL(22): Invalid argument mmap10 2 TBROK  : Remaining cases broken

n/a It is a LTP bug. n/a
ksm01 LTP ksm01 0 TINFO  : KSM merging...

ksm01 1 TBROK  : open: errno=ENOENT(2): No such file or directory ksm01 2 TBROK  : Remaining cases broken

n/a It is a LTP bug. n/a
ksm01_1 LTP ksm01 0 TINFO  : KSM merging...

ksm01 1 TBROK  : open: errno=ENOENT(2): No such file or directory ksm01 2 TBROK  : Remaining cases broken

n/a It is a LTP bug. n/a
ksm03 LTP ksm03 0 TINFO  : KSM merging...

ksm03 1 TBROK  : open: errno=ENOENT(2): No such file or directory ksm03 2 TBROK  : Remaining cases broken

n/a It is a LTP bug. n/a
ksm03_1 LTP ksm03 0 TINFO  : KSM merging...

ksm03 1 TBROK  : open: errno=ENOENT(2): No such file or directory ksm03 2 TBROK  : Remaining cases broken

n/a It is a LTP bug. n/a
ld LTP Assertion 1 ..................

-) Assertion 2 .................. 1,4c1,3 < gcc: error: x.obj: No such file or directory < gcc: error: y.obj: No such file or directory < gcc: fatal error: no input files < compilation terminated. --- > gcc: x.obj: No such file or directory > gcc: y.obj: No such file or directory > gcc: No input files FAIL - ld failed to give expected error msg

n/a This is a LTP bug. [bug1162]
sysctl03 qemux86 n/a n/a n/a n/a n/a
syslog01 qemux86 n/a n/a n/a n/a n/a
syslog02 qemux86 n/a n/a n/a n/a n/a
syslog03 qemux86 n/a n/a n/a n/a n/a
syslog04 qemux86 n/a n/a n/a n/a n/a
syslog05 qemux86 n/a n/a n/a n/a n/a
syslog06 n/a n/a n/a n/a n/a
syslog07 qemux86 n/a n/a n/a n/a n/a
syslog08 qemux86 n/a n/a n/a n/a n/a
syslog09 qemux86 n/a n/a n/a n/a n/a
syslog10 qemux86 n/a n/a n/a n/a n/a
mtest06_2 qemux86 n/a n/a n/a n/a n/a
su01 qemux86 n/a n/a n/a n/a n/a
cron02 qemux86 n/a n/a n/a n/a n/a
cron_deny01 qemux86 n/a n/a n/a n/a n/a
cron_allow01 qemux86 n/a n/a n/a n/a n/a
cron_dirs_checks01 qemux86 n/a n/a n/a n/a n/a
file qemux86 n/a /opt/ltp/testcases/bin/file_test.sh: line 549: rpmbuild: command not found n/a n/a n/a
cron qemux86 n/a n/a n/a n/a n/a
logrotate qemux86 n/a n/a n/a n/a n/a
cpio qemux86 n/a n/a n/a n/a n/a
unzip01 qemux86 n/a n/a n/a n/a n/a
gzip01 qemux86 n/a n/a n/a n/a n/a

1.1/M4 RC2

total: 37 (100%)

LTP cases status owner error msg lsb comment bugzilla
readlink03 NEW readlink03 9 TFAIL  : readlink() failed, Symlink Pathname is empty, errno=22, expected errno=2 n/a When 'Symlink Pathname is empty' the return value was 'ENOENT' but with newer kernels the return value is 'EINVAL'. It is a LTP bug. n/a
sockioctl01 NEW sockioctl01 4 TFAIL  : ATMARK on UDP ; returned -1 (expected -1), errno 25 (expected 22) n/a Inappropriate ioctl operation returning EINVAL with newer kernels. It is a LTP bug. n/a
rt_sigqueueinfo01 LTP rt_sigqueueinfo01 1 TFAIL  : Test Failed

rt_sigqueueinfo01 2 TFAIL  : Test Failed

n/a This is a LTP bug. n/a
sync_file_range01 sync_file_range01 1 TFAIL  : got unexpected error; expected 9: TEST_ERRNO=EINVAL(22): Invalid argument

sync_file_range01 2 TFAIL  : got unexpected error; expected 29: TEST_ERRNO=EINVAL(22): Invalid argument

n/a n/a
mmap11 LTP mmap11 0 TINFO  : [471]

mmap11 1 TBROK  : pthread_create: errno=EAGAIN(11): Resource temporarily unavailable mmap11 2 TBROK  : Remaining cases broken

n/a It is a LTP bug. n/a
mmap10_2 LTP mmap10 0 TINFO  : add to KSM regions.

mmap10 0 TINFO  : use /dev/zero. mmap10 0 TINFO  : start tests. mmap10 1 TBROK  : madvise: errno=EINVAL(22): Invalid argument mmap10 2 TBROK  : Remaining cases broken

n/a It is a LTP bug. n/a
mmap10_3 LTP mmap10 0 TINFO  : add to KSM regions.

mmap10 0 TINFO  : use anonymous pages. mmap10 0 TINFO  : start tests. mmap10 1 TBROK  : madvise: errno=EINVAL(22): Invalid argument mmap10 2 TBROK  : Remaining cases broken

n/a It is a LTP bug. n/a
mmap10_4 LTP mmap10 0 TINFO  : add to KSM regions.

mmap10 0 TINFO  : use anonymous pages. mmap10 0 TINFO  : start tests. mmap10 1 TBROK  : madvise: errno=EINVAL(22): Invalid argument mmap10 2 TBROK  : Remaining cases broken

n/a It is a LTP bug. n/a
mmap10_5 LTP mmap10 0 TINFO  : add to KSM regions.

mmap10 0 TINFO  : use anonymous pages. mmap10 0 TINFO  : start tests. mmap10 1 TBROK  : madvise: errno=EINVAL(22): Invalid argument mmap10 2 TBROK  : Remaining cases broken

n/a It is a LTP bug. n/a
ksm01 LTP ksm01 0 TINFO  : KSM merging...

ksm01 1 TBROK  : open: errno=ENOENT(2): No such file or directory ksm01 2 TBROK  : Remaining cases broken

n/a It is a LTP bug. n/a
ksm01_1 LTP ksm01 0 TINFO  : KSM merging...

ksm01 1 TBROK  : open: errno=ENOENT(2): No such file or directory ksm01 2 TBROK  : Remaining cases broken

n/a It is a LTP bug. n/a
ksm03 LTP ksm03 0 TINFO  : KSM merging...

ksm03 1 TBROK  : open: errno=ENOENT(2): No such file or directory ksm03 2 TBROK  : Remaining cases broken

n/a It is a LTP bug. n/a
ksm03_1 LTP ksm03 0 TINFO  : KSM merging...

ksm03 1 TBROK  : open: errno=ENOENT(2): No such file or directory ksm03 2 TBROK  : Remaining cases broken

n/a It is a LTP bug. n/a
ld LTP Assertion 1 ..................

-) Assertion 2 .................. 1,4c1,3 < gcc: error: x.obj: No such file or directory < gcc: error: y.obj: No such file or directory < gcc: fatal error: no input files < compilation terminated. --- > gcc: x.obj: No such file or directory > gcc: y.obj: No such file or directory > gcc: No input files FAIL - ld failed to give expected error msg

n/a This is a LTP bug. [bug1162]
sysctl03 qemux86 n/a n/a n/a n/a n/a
syslog01 qemux86 n/a n/a n/a n/a n/a
syslog02 qemux86 n/a n/a n/a n/a n/a
syslog03 qemux86 n/a n/a n/a n/a n/a
syslog04 qemux86 n/a n/a n/a n/a n/a
syslog05 qemux86 n/a n/a n/a n/a n/a
syslog06 n/a n/a n/a n/a n/a
syslog07 qemux86 n/a n/a n/a n/a n/a
syslog08 qemux86 n/a n/a n/a n/a n/a
syslog09 qemux86 n/a n/a n/a n/a n/a
syslog10 qemux86 n/a n/a n/a n/a n/a
mtest06_2 qemux86 n/a n/a n/a n/a n/a
su01 qemux86 n/a n/a n/a n/a n/a
cron02 qemux86 n/a n/a n/a n/a n/a
cron_deny01 qemux86 n/a n/a n/a n/a n/a
cron_allow01 qemux86 n/a n/a n/a n/a n/a
cron_dirs_checks01 qemux86 n/a n/a n/a n/a n/a
file qemux86 n/a /opt/ltp/testcases/bin/file_test.sh: line 549: rpmbuild: command not found n/a n/a n/a
cron qemux86 n/a n/a n/a n/a n/a
logrotate qemux86 n/a n/a n/a n/a n/a
cpio qemux86 n/a n/a n/a n/a n/a
unzip01 qemux86 n/a n/a n/a n/a n/a
gzip01 qemux86 n/a n/a n/a n/a n/a

1.1/M3

total: 36 (100%)

LTP cases status owner error msg lsb comment bugzilla
rt_sigqueueinfo01 NEW rt_sigqueueinfo01 1 TFAIL  : Test Failed

rt_sigqueueinfo01 2 TFAIL  : Test Failed

n/a n/a n/a
shmat01 NEW shmat01 1 TFAIL  : shmat call failed: TEST_ERRNO=EINVAL(22): Invalid argument n/a n/a n/a
sync_file_range01 NEW sync_file_range01 1 TFAIL  : got unexpected error; expected 9: TEST_ERRNO=EINVAL(22): Invalid argument

sync_file_range01 2 TFAIL  : got unexpected error; expected 29: TEST_ERRNO=EINVAL(22): Invalid argument sync_file_range01 3 TPASS  : got expected error: TEST_ERRNO=EINVAL(22): Invalid argument sync_file_range01 4 TPASS  : got expected error: TEST_ERRNO=EINVAL(22): Invalid argument sync_file_range01 5 TPASS  : got expected error: TEST_ERRNO=EINVAL(22): Invalid argument

n/a n/a n/a
mmap11 NEW mmap11 0 TINFO  : [471]

mmap11 1 TBROK  : pthread_create: errno=EAGAIN(11): Resource temporarily unavailable mmap11 2 TBROK  : Remaining cases broken

n/a n/a n/a
mmap10_2 NEW mmap10 0 TINFO  : add to KSM regions.

mmap10 0 TINFO  : use /dev/zero. mmap10 0 TINFO  : start tests. mmap10 1 TBROK  : madvise: errno=EINVAL(22): Invalid argument mmap10 2 TBROK  : Remaining cases broken

n/a n/a n/a
mmap10_3 NEW mmap10 0 TINFO  : add to KSM regions.

mmap10 0 TINFO  : use anonymous pages. mmap10 0 TINFO  : start tests. mmap10 1 TBROK  : madvise: errno=EINVAL(22): Invalid argument mmap10 2 TBROK  : Remaining cases broken

n/a n/a n/a
mmap10_4 NEW mmap10 0 TINFO  : add to KSM regions.

mmap10 0 TINFO  : use anonymous pages. mmap10 0 TINFO  : start tests. mmap10 1 TBROK  : madvise: errno=EINVAL(22): Invalid argument mmap10 2 TBROK  : Remaining cases broken

n/a n/a n/a
mmap10_5 NEW mmap10 0 TINFO  : add to KSM regions.

mmap10 0 TINFO  : use anonymous pages. mmap10 0 TINFO  : start tests. mmap10 1 TBROK  : madvise: errno=EINVAL(22): Invalid argument mmap10 2 TBROK  : Remaining cases broken

n/a n/a n/a
ksm01 NEW ksm01 0 TINFO  : KSM merging...

ksm01 1 TBROK  : open: errno=ENOENT(2): No such file or directory ksm01 2 TBROK  : Remaining cases broken

n/a n/a n/a
ksm01_1 NEW ksm01 0 TINFO  : KSM merging...

ksm01 1 TBROK  : open: errno=ENOENT(2): No such file or directory ksm01 2 TBROK  : Remaining cases broken

n/a n/a n/a
ksm03 NEW ksm03 0 TINFO  : KSM merging...

ksm03 1 TBROK  : open: errno=ENOENT(2): No such file or directory ksm03 2 TBROK  : Remaining cases broken

n/a n/a n/a
ksm03_1 NEW ksm03 0 TINFO  : KSM merging...

ksm03 1 TBROK  : open: errno=ENOENT(2): No such file or directory ksm03 2 TBROK  : Remaining cases broken

n/a n/a n/a
ld LTP Assertion 1 ..................

-) Assertion 2 .................. 1,4c1,3 < gcc: error: x.obj: No such file or directory < gcc: error: y.obj: No such file or directory < gcc: fatal error: no input files < compilation terminated. --- > gcc: x.obj: No such file or directory > gcc: y.obj: No such file or directory > gcc: No input files FAIL - ld failed to give expected error msg

n/a This is a LTP bug. [bug1162]
sysctl03 qemux86 n/a n/a n/a n/a n/a
syslog01 qemux86 n/a n/a n/a n/a n/a
syslog02 qemux86 n/a n/a n/a n/a n/a
syslog03 qemux86 n/a n/a n/a n/a n/a
syslog04 qemux86 n/a n/a n/a n/a n/a
syslog05 qemux86 n/a n/a n/a n/a n/a
syslog06 NEW n/a n/a n/a n/a n/a
syslog07 qemux86 n/a n/a n/a n/a n/a
syslog08 qemux86 n/a n/a n/a n/a n/a
syslog09 qemux86 n/a n/a n/a n/a n/a
syslog10 qemux86 n/a n/a n/a n/a n/a
mtest06_2 qemux86 n/a n/a n/a n/a n/a
su01 qemux86 n/a n/a n/a n/a n/a
cron02 qemux86 n/a n/a n/a n/a n/a
cron_deny01 qemux86 n/a n/a n/a n/a n/a
cron_allow01 qemux86 n/a n/a n/a n/a n/a
cron_dirs_checks01 qemux86 n/a n/a n/a n/a n/a
file qemux86 n/a /opt/ltp/testcases/bin/file_test.sh: line 549: rpmbuild: command not found n/a n/a n/a
cron qemux86 n/a n/a n/a n/a n/a
logrotate qemux86 n/a n/a n/a n/a n/a
cpio qemux86 n/a n/a n/a n/a n/a
unzip01 qemux86 n/a n/a n/a n/a n/a
gzip01 qemux86 n/a n/a n/a n/a n/a

1.1/M2

total: 26 (100%)

LTP cases status owner error msg lsb comment bugzilla
ld LTP Assertion 1 ..................

-) Assertion 2 .................. 1,4c1,3 < gcc: error: x.obj: No such file or directory < gcc: error: y.obj: No such file or directory < gcc: fatal error: no input files < compilation terminated. --- > gcc: x.obj: No such file or directory > gcc: y.obj: No such file or directory > gcc: No input files FAIL - ld failed to give expected error msg

n/a This is a LTP bug. [bug1162]
fallocate01 fallocate(6, 0, 49152, 4096) failed: TEST_ERRNO=EFBIG(27): File too large n/a This case is expected to return -EOPNOSUPP and then LTP will skip it. However on qemuarm/qemumips -EFBIG is returned earlier, and thus trigger this failure.

Actually I don't understand why this will happen, and any offset/length returns same failure. fallocate from util-linux could trigger this failure too.

[bug678]
fallocate02 fallocate(6, 0, 49152, 4096) failed: TEST_ERRNO=EFBIG(27): File too large n/a same as fallocate01 [bug678]
fallocate03 fallocate(6, 0, 49152, 4096) failed: TEST_ERRNO=EFBIG(27): File too large n/a same as fallocate01 [bug678]
sysctl03 qemux86 n/a n/a n/a n/a n/a
syslog01 qemux86 n/a n/a n/a n/a n/a
syslog02 qemux86 n/a n/a n/a n/a n/a
syslog03 qemux86 n/a n/a n/a n/a n/a
syslog04 qemux86 n/a n/a n/a n/a n/a
syslog05 qemux86 n/a n/a n/a n/a n/a
syslog07 qemux86 n/a n/a n/a n/a n/a
syslog08 qemux86 n/a n/a n/a n/a n/a
syslog09 qemux86 n/a n/a n/a n/a n/a
syslog10 qemux86 n/a n/a n/a n/a n/a
mtest06_2 qemux86 n/a n/a n/a n/a n/a
su01 qemux86 n/a n/a n/a n/a n/a
cron02 qemux86 n/a n/a n/a n/a n/a
cron_deny01 qemux86 n/a n/a n/a n/a n/a
cron_allow01 qemux86 n/a n/a n/a n/a n/a
cron_dirs_checks01 qemux86 n/a n/a n/a n/a n/a
file qemux86 n/a /opt/ltp/testcases/bin/file_test.sh: line 549: rpmbuild: command not found n/a n/a n/a
cron qemux86 n/a n/a n/a n/a n/a
logrotate qemux86 n/a n/a n/a n/a n/a
cpio qemux86 n/a n/a n/a n/a n/a
unzip01 qemux86 n/a n/a n/a n/a n/a
gzip01 qemux86 n/a n/a n/a n/a n/a

1.1/M1

total: 57 (100%)

When using unfs, there are some new failures happened, so we re-test it by using local image instead of unfs and update the status in comment section.

LTP cases status owner error msg lsb comment bugzilla
chmod01 NEW chmod01 6 TFAIL  : testfile: Incorrect modes 0777, Expected 02777

chmod01 7 TFAIL  : testfile: Incorrect modes 0777, Expected 04777 chmod01 8 TFAIL  : testfile: Incorrect modes 0777, Expected 06777

n/a PASS by using local image instead of unfs n/a
chmod05 NEW chmod05 1 TFAIL  : testdir: Incorrect modes 043777, Expected 041777 n/a PASS by using local image instead of unfs n/a
chmod06 NEW chmod06 1 TFAIL  : chmod() returned 0, expected -1, errno:1 n/a PASS by using local image instead of unfs n/a
chown02 NEW fchown02 2 TFAIL  : testfile2: Incorrect mode permissions 0100700, Expected 0102700 n/a PASS by using local image instead of unfs n/a
chown02_16 NEW fchown02 2 TFAIL  : testfile2: Incorrect mode permissions 0100700, Expected 0102700 n/a PASS by using local image instead of unfs n/a
chown04 NEW chown04 1 TFAIL  : chown() returned 0, expected -1, errno:1 n/a PASS by using local image instead of unfs n/a
chown04_16 NEW chown04 1 TFAIL  : chown() returned 0, expected -1, errno:1 n/a PASS by using local image instead of unfs n/a
fchmod05 NEW fchmod05 1 TFAIL  : testdir: Incorrect modes 043777, Expected 041777 n/a PASS by using local image instead of unfs n/a
fchmod06 NEW fchmod06 1 TFAIL  : fchmod() returned 0, expected -1, errno:1 n/a PASS by using local image instead of unfs n/a
fchmod07 NEW fchmod07 6 TFAIL  : testfile: Incorrect modes 0777, Expected 02777

fchmod07 7 TFAIL  : testfile: Incorrect modes 0777, Expected 04777 fchmod07 8 TFAIL  : testfile: Incorrect modes 0777, Expected 06777

n/a PASS by using local image instead of unfs n/a
fchown02 NEW fchown02 2 TFAIL  : testfile2: Incorrect mode permissions 0100700, Expected 0102700 n/a PASS by using local image instead of unfs n/a
fchown02_16 NEW fchown02 2 TFAIL  : testfile2: Incorrect mode permissions 0100700, Expected 0102700 n/a PASS by using local image instead of unfs n/a
fchown04 NEW fchown04 1 TFAIL  : fchown() returned 0, expected -1, errno:1 n/a PASS by using local image instead of unfs n/a
fchown04_16 NEW fchown04 1 TFAIL  : fchown() returned 0, expected -1, errno:1 n/a PASS by using local image instead of unfs n/a
fcntl16 NEW fcntl16 0 TINFO  : Entering block 1

fcntl16 0 TINFO  : Test case 1: without manadatory locking PASSED fcntl16 0 TINFO  : Exiting block 1 fcntl16 0 TINFO  : Entering block 2 fcntl16 1 TFAIL  : First parent lock failed fcntl16 2 TFAIL  : Test case 1, errno = 46 fcntl16 0 TINFO  : Test case 2: with mandatory record locking FAILED fcntl16 0 TINFO  : Exiting block 2 fcntl16 0 TINFO  : Entering block 3 fcntl16 3 TFAIL  : First parent lock failed fcntl16 4 TFAIL  : Test case 1, errno = 46 fcntl16 0 TINFO  : Test case 3: mandatory locking with NODELAY FAILED fcntl16 0 TINFO  : Exiting block 3 fcntl16 0 TWARN  : tst_rmdir(): rmobj(/opt/tmp/ltp-XXXXFqi5ud/fcnUtwbwx) failed: unlink(/opt/tmp/ltp-XXXXFqi5ud/fcnUtwbwx/.nfs000000002158e21d00000010) failed; errno=16: Device or resource busy

n/a PASS by using local image instead of unfs n/a
fcntl16_64 NEW fcntl16 0 TINFO  : Entering block 1

fcntl16 1 TFAIL  : Third parent lock failed fcntl16 2 TFAIL  : Test case 3, errno = 22 fcntl16 0 TINFO  : Test case 1: without mandatory locking FAILED fcntl16 0 TINFO  : Exiting block 1 fcntl16 0 TINFO  : Entering block 2 fcntl16 3 TFAIL  : First parent lock failed fcntl16 4 TFAIL  : Test case 1, errno = 46 fcntl16 0 TINFO  : Test case 2: with mandatory record locking FAILED fcntl16 0 TINFO  : Exiting block 2 fcntl16 0 TINFO  : Entering block 3 fcntl16 5 TFAIL  : First parent lock failed fcntl16 6 TFAIL  : Test case 1, errno = 46 fcntl16 0 TINFO  : Test case 3: mandatory locking with NODELAY FAILED fcntl16 0 TINFO  : Exiting block 3 fcntl16 0 TWARN  : tst_rmdir(): rmobj(/opt/tmp/ltp-XXXXFqi5ud/fcnlohkGD) failed: unlink(/opt/tmp/ltp-XXXXFqi5ud/fcnlohkGD/.nfs000000002158e21f00000013) failed; errno=16: Device or resource busy

n/a PASS by using local image instead of unfs n/a
ioctl03 Qemuarm n/a n/a n/a PASS by using local image instead of unfs n/a
inotify02 NEW inotify02 8 TFAIL  : don't get event: mask=74657374

inotify02 9 TFAIL  : don't get event: mask=0

n/a PASS by using local image instead of unfs n/a
lchown02 qemux86 n/a n/a n/a PASS by using local image instead of unfs n/a
lchown02_16 qemux86 n/a n/a n/a PASS by using local image instead of unfs n/a
link06 NEW link06 1 TFAIL  : link() returned 0,expected -1, errno=13 n/a PASS by using local image instead of unfs n/a
mkdir02 NEW mkdir02 1 TFAIL  : mkdir() FAILED to inherit the group ID 2 from parent directory 65534

mkdir02 1 TFAIL  : Test to attempt to make a directory inherits group ID FAILED

n/a PASS by using local image instead of unfs n/a
mknod03 NEW mknod03 1 TFAIL  : tnode_16527: Incorrect group n/a PASS by using local image instead of unfs n/a
mknod04 NEW mknod04 1 TFAIL  : tnode_16528: Incorrect group n/a PASS by using local image instead of unfs n/a
open10 NEW open10 1 TPASS  : Test passed in block0.

open10 2 TPASS  : Test passed in block1. open10 3 TFAIL  : open10.testdir.B.28362/nosetgid: Incorrect group (got 65534 and 2) open10 4 TFAIL  : open10.testdir.B.28362/setgid: Incorrect group (got 65534 and 2) open10 5 TFAIL  : Test failed in block2. open10 6 TFAIL  : open10.testdir.B.28362/root_setgid: Incorrect group (got 65534 and 2) open10 7 TFAIL  : Test failed in block3. open10 8 TFAIL  : Test failed because of above failures.

n/a PASS by using local image instead of unfs n/a
rmdir02 NEW rmdir02 1 TPASS  : expected failure - errno = 93 : Directory not empty

rmdir02 0 TINFO  : mkdir failed in creae_longpath() rmdir02 2 TFAIL  : call succeeded unexpectedly rmdir02 3 TPASS  : expected failure - errno = 2 : No such file or directory rmdir02 4 TPASS  : expected failure - errno = 20 : Not a directory rmdir02 5 TPASS  : expected failure - errno = 14 : Bad address rmdir02 6 TPASS  : expected failure - errno = 14 : Bad address rmdir02 7 TFAIL  : failed in clean abcdefghivwxyzabcdefgmopqrsqrsrsthmopqrsqrsrstijklmnopjklmnopqrstuvwxyzabcdefghijklmnopqrstuvwxyzabcdabcdefghijklmopqrsqrsrstmnopqrqrstuvwxyzabcdefghijklmnopqrstmnopqrstuvwxyz_28663/, errno: 2

n/a PASS by using local image instead of unfs n/a
utime04 NEW utime04 1 TFAIL  : tmp_file access and modification times not set n/a PASS by using local image instead of unfs n/a
utime05 NEW utime05 1 TFAIL  : tmp_file access and modification times not set n/a PASS by using local image instead of unfs n/a
utimes01 NEW EXPECT: return value(ret)=(N >= 0) errno=0 (Success), r/w check=OK

RESULT: return value(ret)= 0 errno=0 (Success), r/w check=NG EXPECT: return value(ret)=(N >= 0) errno=0 (Success), r/w check=OK RESULT: return value(ret)= 0 errno=0 (Success), r/w check=NG EXPECT: return value(ret)=-1 errno=13 (Permission denied) RESULT: return value(ret)=-1 errno=13 (Permission denied) EXPECT: return value(ret)=-1 errno=2 (No such file or directory) RESULT: return value(ret)=-1 errno=2 (No such file or directory) EXPECT: return value(ret)=-1 errno=14 (Bad address) RESULT: return value(ret)=-1 errno=14 (Bad address) utimes01 0 TINFO  : (case00) START utimes01 0 TINFO  : E:0,1000 <=> R:62400,62400 utimes01 0 TINFO  : (case00) END => NG utimes01 0 TINFO  : (case01) START utimes01 0 TINFO  : E:1000,0 <=> R:62400,62400 utimes01 0 TINFO  : (case01) END => NG utimes01 0 TINFO  : (case02) START utimes01 0 TINFO  : (case02) END => OK utimes01 0 TINFO  : (case03) START utimes01 0 TINFO  : (case03) END => OK utimes01 0 TINFO  : (case04) START utimes01 0 TINFO  : (case04) END => OK utimes01 1 TFAIL  : utimes01 failed - errno = 0 : Success utimes01 0 TINFO  : NG

n/a PASS by using local image instead of unfs n/a
utimenstat01 NEW Testing read-only file, owned by self
          • Testing times==NULL case *****

Pathname test Failed to set correct times on test file /opt/tmp/ltp-XXXXFqi5ud/utimensat_tests/utimensat.test_file

n/a PASS by using local image instead of unfs n/a
mmapstress10 NEW file data okay

mmapstress10 1 TPASS  : Test passed

mmapstress10 0 TWARN  : tst_rmdir(): rmobj(/opt/tmp/ltp-XXXXFqi5ud/mmafrPxVo) failed: unlink(/opt/tmp/ltp-XXXXFqi5ud/mmafrPxVo/.nfs000000002158e238000001cf) failed; errno=16: Device or resource busy

n/a PASS by using local image instead of unfs n/a
ld NEW Assertion 1 ..................

-) Assertion 2 .................. 1,4c1,3 < gcc: error: x.obj: No such file or directory < gcc: error: y.obj: No such file or directory < gcc: fatal error: no input files < compilation terminated. --- > gcc: x.obj: No such file or directory > gcc: y.obj: No such file or directory > gcc: No input files FAIL - ld failed to give expected error msg

n/a [bug1162]
fallocate01 fallocate(6, 0, 49152, 4096) failed: TEST_ERRNO=EFBIG(27): File too large n/a This case is expected to return -EOPNOSUPP and then LTP will skip it. However on qemuarm/qemumips -EFBIG is returned earlier, and thus trigger this failure.

Actually I don't understand why this will happen, and any offset/length returns same failure. fallocate from util-linux could trigger this failure too.

[bug678]
fallocate02 fallocate(6, 0, 49152, 4096) failed: TEST_ERRNO=EFBIG(27): File too large n/a same as fallocate01 [bug678]
fallocate03 fallocate(6, 0, 49152, 4096) failed: TEST_ERRNO=EFBIG(27): File too large n/a same as fallocate01 [bug678]
sysctl03 qemux86 n/a n/a n/a n/a n/a
syslog01 qemux86 n/a n/a n/a n/a n/a
syslog02 qemux86 n/a n/a n/a n/a n/a
syslog03 qemux86 n/a n/a n/a n/a n/a
syslog04 qemux86 n/a n/a n/a n/a n/a
syslog05 qemux86 n/a n/a n/a n/a n/a
syslog07 qemux86 n/a n/a n/a n/a n/a
syslog08 qemux86 n/a n/a n/a n/a n/a
syslog09 qemux86 n/a n/a n/a n/a n/a
syslog10 qemux86 n/a n/a n/a n/a n/a
mtest06_2 qemux86 n/a n/a n/a n/a n/a
su01 qemux86 n/a n/a n/a n/a n/a
cron02 qemux86 n/a n/a n/a n/a n/a
cron_deny01 qemux86 n/a n/a n/a n/a n/a
cron_allow01 qemux86 n/a n/a n/a n/a n/a
cron_dirs_checks01 qemux86 n/a n/a n/a n/a n/a
file qemux86 n/a /opt/ltp/testcases/bin/file_test.sh: line 549: rpmbuild: command not found n/a n/a n/a
cron qemux86 n/a n/a n/a n/a n/a
logrotate qemux86 n/a n/a n/a n/a n/a
cpio qemux86 n/a n/a n/a n/a n/a
unzip01 qemux86 n/a n/a n/a n/a n/a
gzip01 qemux86 n/a n/a n/a n/a n/a

1.0/M4 -RC2

total: 27

  • NEW Introduced: 0
  • LTP: 0
  • NAB: 0
  • Fixed: 0
  • Duplicated: 27
  • pending: 0
  • not started: 0
  • Disappear without fixing patch: 2(shmem_test_05, tar)

similarity: 27 (100.00%):


1.0/M4 -RC1

total: 27

  • NEW Introduced: 0
  • LTP: 0
  • NAB: 0
  • Fixed: 0
  • Duplicated: 27
  • pending: 0
  • not started: 0
  • Disappear without fixing patch: 2(shmem_test_05, tar)

similarity: 27 (100.00%):

LTP cases status owner error msg lsb comment bugzilla
fallocate01 Qemuarm n/a n/a n/a n/a n/a
fallocate02 Qemuarm n/a n/a n/a n/a n/a
fallocate03 Qemuarm n/a n/a n/a n/a n/a
lchown02 qemux86 n/a n/a n/a n/a n/a
lchown02_16 qemux86 n/a n/a n/a n/a n/a
sysctl03 qemux86 n/a n/a n/a n/a n/a
syslog01 qemux86 n/a n/a n/a n/a n/a
syslog02 qemux86 n/a n/a n/a n/a n/a
syslog03 qemux86 n/a n/a n/a n/a n/a
syslog04 qemux86 n/a n/a n/a n/a n/a
syslog05 qemux86 n/a n/a n/a n/a n/a
syslog07 qemux86 n/a n/a n/a n/a n/a
syslog08 qemux86 n/a n/a n/a n/a n/a
syslog09 qemux86 n/a n/a n/a n/a n/a
syslog10 qemux86 n/a n/a n/a n/a n/a
mtest06_2 qemux86 n/a n/a n/a n/a n/a
su01 qemux86 n/a n/a n/a n/a n/a
cron02 qemux86 n/a n/a n/a n/a n/a
cron_deny01 qemux86 n/a n/a n/a n/a n/a
cron_allow01 qemux86 n/a n/a n/a n/a n/a
cron_dirs_checks01 qemux86 n/a n/a n/a n/a n/a
file qemux86 n/a n/a n/a n/a n/a
cron qemux86 n/a n/a n/a n/a n/a
logrotate qemux86 n/a n/a n/a n/a n/a
cpio qemux86 n/a n/a n/a n/a n/a
unzip01 qemux86 n/a n/a n/a n/a n/a
gzip01 qemux86 n/a n/a n/a n/a n/a


1.0/M2

total: 37 (100% audited)

  • LTP: 1
  • NAB: 1
  • Fixed: 0
  • Duplicated: 35
  • pending: 0
  • not started: 0

similarity: 29 (78.00%):

       chdir01A fallocate01 fallocate02 fallocate03 splice02 utimensat01 shmem_test_05 hackbench01 
LTP cases status owner error msg lsb comment bugzilla
shmem_test_05 LTP Kevin Tian ERROR [line: 222] shmat failed: Invalid argument n/a shmem_test_05 attaches to a piece of shm on a set of fixed addresses among (0x30000000-0x32000000).

Actually this is a bogus test as we don't know which address segments have been occupied already. In this specific case, there're quite a few segments occupied by ld.so and libc.so within that range, and thus -EINVAL is returned.

This doesn't happen on other archs just because they happen to not have that range occupied.

n/a
splice02 NAB Kevin Tian splice failed - errno = 28 : No space left on device n/a this is because no "-d tmpdir" specified when running this test, while standard /dev/hda only have limited space
utimensat01 Qemuarm n/a n/a n/a n/a n/a
hackbench01 Qemuarm n/a n/a n/a n/a n/a
chdir01A Qemuarm n/a n/a n/a n/a n/a
fallocate01 Qemuarm n/a n/a n/a n/a n/a
fallocate02 Qemuarm n/a n/a n/a n/a n/a
fallocate03 Qemuarm n/a n/a n/a n/a n/a
lchown02 qemux86 n/a n/a n/a n/a n/a
lchown02_16 qemux86 n/a n/a n/a n/a n/a
sysctl03 qemux86 n/a n/a n/a n/a n/a
syslog01 qemux86 n/a n/a n/a n/a n/a
syslog02 qemux86 n/a n/a n/a n/a n/a
syslog03 qemux86 n/a n/a n/a n/a n/a
syslog04 qemux86 n/a n/a n/a n/a n/a
syslog05 qemux86 n/a n/a n/a n/a n/a
syslog07 qemux86 n/a n/a n/a n/a n/a
syslog08 qemux86 n/a n/a n/a n/a n/a
syslog09 qemux86 n/a n/a n/a n/a n/a
syslog10 qemux86 n/a n/a n/a n/a n/a
mtest06 qemux86 n/a n/a n/a n/a n/a
mtest06_2 qemux86 n/a n/a n/a n/a n/a
mmapstress06 qemux86 n/a n/a n/a n/a n/a
su01 qemux86 n/a n/a n/a n/a n/a
cron02 qemux86 n/a n/a n/a n/a n/a
cron_deny01 qemux86 n/a n/a n/a n/a n/a
cron_allow01 qemux86 n/a n/a n/a n/a n/a
cron_dirs_checks01 qemux86 n/a n/a n/a n/a n/a
ld qemux86 n/a n/a n/a n/a n/a
ldd qemux86 n/a n/a n/a n/a n/a
file qemux86 n/a n/a n/a n/a n/a
tar qemux86 n/a n/a n/a n/a n/a
cron qemux86 n/a n/a n/a n/a n/a
logrotate qemux86 n/a n/a n/a n/a n/a
cpio qemux86 n/a n/a n/a n/a n/a
unzip01 qemux86 n/a n/a n/a n/a n/a
gzip01 qemux86 n/a n/a n/a n/a n/a
Personal tools