Old resolved bugs and features

From Yocto Project
Jump to: navigation, search

Contents

Old Milestone - Bugs Need Verification - BY OWNER (3.X)

IDQAESummary (16 tasks) PAssigneeMilestoneStatusResolutionWhiteboard
   0      
 
13394 qemu-arm hang whilst generating imageMediumUnassigned3.0RESOLVEDOBSOLETE
13403 libidn2 has build paths in libidn2.pcMediumRoss Burton (Arm)3.0RESOLVEDFIXED
13268 dump_sigtask create filenname longer as 255 charactersMedium+Robert Yang3.1 M1RESOLVEDFIXED
13405 perl ships build pathsMediumJoshua Watt3.1 M1RESOLVEDFIXED
13590 runqemu: High resolution timer deactivated for no reason (highres=off)Medium+Jörg Vehlow3.1 M1RESOLVEDFIXED
13592 python3-config symlink is missing from python3-coreMedium+Ross Burton (Arm)3.1 M1RESOLVEDFIXEDBACKPORT 3.0.1
13601 [master-next & stable/warrior-nmut] oe-selftest-fedora test_devtool_deploy_target failed fedora30-ty-1HighRichard Purdie3.1 M1RESOLVEDFIXED
13633 Reproducibility issue in opkg-utils-docHighJoshua Watt3.1 M1RESOLVEDDUPLICATE
13635 devtool fails when reproducible_build class is inheritedMedium+Paul Eggleton3.1 M1RESOLVEDFIXED
13636 recipetool unbound variable when reproducible_build class is inheritedHighRichard Purdie3.1 M1RESOLVEDFIXED
13637 recipetool license failure when reproducible_build class is inheritedHighPaul Eggleton3.1 M1RESOLVEDFIXED
13638 opkg double free when reproducibile builds enabledHighAlejandro del Castillo3.1 M1RESOLVEDFIXED
13673 python3 too old on perf-centos7HighMichael Halstead3.1 M1RESOLVEDFIXED
13775 sudo doc reproducibility issueHighRichard Purdie3.1 M1RESOLVEDFIXED
13778 libxshmfence reproducibility issue (SHMDIR changes)HighRichard Purdie3.1 M1RESOLVEDFIXED
   15      
Francisco Pedraza
13539Francisco PedrazaeSDK: performance issues when assembling sstate for full SDKMedium+Unassigned3.1 M1RESOLVEDFIXED
   1      

Old Milestone - Bugs Need Verification - BY OWNER (2.X)

IDQAESummary (1771 tasks) PAssigneeMilestoneStatusResolutionWhiteboard
   0      
 
4018 1webkit-gtk should recommend video codecsMediumRoss Burton (Arm)2.1RESOLVEDOBSOLETE
6169 4Toaster data collection fails due to lack of support for PROVIDESMediumEd Bartosh2.1RESOLVEDFIXEDGUI design available
6774 3Daisy 1.6.1 - matchbox-keyboard doesn't "pop up" automatically any moreMediumMaxin B. John2.1RESOLVEDFIXED
7717 build issues with Thumb-1, when building for qemuarm (armv5te)MediumAlexander Kanavin2.1RESOLVEDFIXED
8047 2Building a packagegroup with rpm5 then rpm4 does not rebuild the packageLowRichard Purdie2.1RESOLVEDFIXED
8177 4Do not enable CONFIG_DEBUG_KERNEL and related options by defaultMediumCalifornia Sullivan2.1RESOLVEDFIXED
8510 2TargetDumper.dump_target() from dump.py sometimes puts output in the wrong fileMediumMariano Lopez2.1RESOLVEDFIXED
8521 Webkitgtk JIT causes render failure on arm7MediumRobert Yang2.1RESOLVEDDUPLICATE
8633 Add LICENSE_CREATE_PACKAGE to the Variables GlossaryMediumPaul Eggleton2.1RESOLVEDFIXED3 Feb 2016: RESOLVED
8645 fetch.decodeurl throws exception with trailing ; in URLLowPaul Eggleton2.1RESOLVEDFIXED
8660 1uninative.bbclass causes build to fail strangely when expected tarball is missingMediumPaul Eggleton2.1RESOLVEDFIXED
8696 Quick Start - Build Host Packages suggests dnf on CentOSUndecidedScott Rifenbark2.1RESOLVEDFIXED18 Nov 2015: FIXED/RESOLVED
8766 attr-ptest missing dependence of attrMediumRoss Burton (Arm)2.1RESOLVEDFIXED
8830 0.3pTest - pango tests fail for 2.1_M1.rc1MediumJussi Kukkonen2.1RESOLVEDFIXED
8845 freetype-native fails to re-execute do_configureMediumRoss Burton (Arm)2.1RESOLVEDFIXED
8864 git fetcher does not support non git url format based requestsMediumRichard Purdie2.1RESOLVEDFIXED
8900 Bitbake never exists when it runs out of inotify watchesMediumEd Bartosh2.1RESOLVEDFIXED
8911 Storing build history in a Git submodule breaks due to a bad Git repository checkMediumMarkus Lehtonen2.1RESOLVEDFIXED
8916 5oe-selftest: add the ability to run/search tests matched by a search expressionMediumHumberto Ibarra2.1RESOLVEDFIXED
8929 extensible SDK - remove requirement that BUILD_ARCH == SDK_ARCHMediumRandy Witt2.1RESOLVEDDUPLICATE
8950 Clean operation not done with externalsrc when S = BMediumMarkus Lehtonen2.1RESOLVEDFIXED
9065 0.5wrong message for directory displayed in case of errorMediumPaul Eggleton2.1RESOLVEDFIXED
9077 3The creation of manifests is incompleteMediumRichard Purdie2.1RESOLVEDFIXED
9092 1ca-certificates-native needs to be added into postinst recipes listMediumMing Liu2.1RESOLVEDFIXED
9094 2create_image.wic is missing u-boot SPL fileMediumOliver Graute2.1RESOLVEDWORKSFORME
9095 2Spurious tasks related to wic executed even if wic image not selected.MediumEd Bartosh2.1RESOLVEDFIXED
9103 0.5hwclock from util-linux doesn't override hwclock from busyboxMediumRoss Burton (Arm)2.1RESOLVEDFIXED
9307 python detects tkinter againMediumAlejandro Hernandez2.1RESOLVEDFIXED
9323 1legacy _thumb overrides is still being used in libmad recipeMediumRoss Burton (Arm)2.1RESOLVEDFIXED
9328 0.25/meta/recipes-devtools/gcc/gcc-common.inc bb.error print incorrectMediumJoshua Lock2.1RESOLVEDFIXED
9332 Error message could be improved, for incorrect syntaxMediumRichard Purdie2.1RESOLVEDFIXED
9334 0.5oe-selftest: error output shown with --coverage when coverage module not installedMediumHumberto Ibarra2.1RESOLVEDFIXED
9339 eSDK doesn't build correctly if environment variables are usedMediumPaul Eggleton2.1RESOLVEDFIXED
8581 2Install permission error after sourcing 32 bit buildtools-tarball.MediumJuro Bystricky2.1 M1RESOLVEDFIXED
8235 2Password utilities are removed when package management is disabledMediumMariano Lopez2.1 M2RESOLVEDFIXED
8693 1do_rootfs isn't re-run when wic variables (e.g. IMAGE_BOOT_FILES) changeMediumMariano Lopez2.1 M2RESOLVEDFIXED
8768 1No output during build if curses.tigetstr("cuu") fails in knotty.pyMediumRichard Purdie2.1 M2RESOLVEDFIXED
8813 0.1Frequent fetch problemsMediumJuro Bystricky2.1 M2RESOLVEDFIXED
8863 dbus did not support large-file for stat64MediumHongxu Jia2.1 M2RESOLVEDFIXED
5635 Changing LICENSE_CREATE_PACKAGE doesn't always take effectMediumRoss Burton (Arm)2.1 M3RESOLVEDFIXED
5963 4Large images fail in bizarre ways as live imagesMediumRobert Yang2.1 M3RESOLVEDFIXED
8670 3enhance command_variables() in image.bbclassMediumChen Qi2.1 M3RESOLVEDFIXED
8684 1Missing python-ast package in generate-menifest-2.7.pyMediumRoss Burton (Arm)2.1 M3RESOLVEDFIXED
8722 2Warnings when running hddimg in runqemuMediumPatrick Ohly2.1 M3RESOLVEDFIXED
8741 2nativesdk-libpam: QA issue: installed-vs-shippedMediumdengke2.1 M3RESOLVEDFIXED
8767 1Fix systemd ptest supportMedium+Jussi Kukkonen2.1 M3RESOLVEDFIXED
8882 fontconfig is built when build lib32-imageUndecidedRobert Yang2.1 M3RESOLVEDDUPLICATE
8922 1insane.bbclass: strange characters in file-rdepsMediumRobert Yang2.1 M3RESOLVEDFIXED
9031 Intermittent loss of file attributes during do_packagedataMedium+Seebs2.1 M3RESOLVEDFIXED
9035 bitbake-prserv not exiting on SIGTERM when run in daemon modeMediumRichard Purdie2.1 M3RESOLVEDFIXED
9036 bitbake-prserv should not force umask in daemon modeMediumRichard Purdie2.1 M3RESOLVEDFIXED
9127 DNS resolution of mirror.linux.org.au fails on AB workersLowMichael Halstead2.1 M3RESOLVEDWONTFIX
9150 0.5Enable rpm-native to be built with bundled beecryptUndecidedJoshua Lock2.1 M3RESOLVEDFIXED
9155 update_font_cache postinst failing with read-only filesystemMedium+Martin Jansa2.1 M3RESOLVEDFIXED
9162 python-setuptools: incorrectly do_install which missing filesUndecidedHongxu Jia2.1 M3RESOLVEDNOTABUG
9225 recipetool: missing shrinkwrap/lockdown files for npm modulesMedium+Paul Eggleton2.1 M3RESOLVEDFIXED
9275 1right now, bitbake server has a concept of single_use which has the server auto exit in anonymous port caseMedium+Ed Bartosh2.1 M3RESOLVEDFIXED
7937 7https://www.yoctoproject.org/sites/default/files/kernel-lab-1.6.pdf is really nice and should be updated to 2.0MediumTom Zanussi2.2 M1RESOLVEDFIXED
8397 3ROOTLESS_X should be used as default for Poky BSPMediumAlejandro Hernandez2.2 M1RESOLVEDNOTABUG
8652 1meta/recipes-devtools/ruby/ uses --disable-versioned-paths, but no such option existsLow 2.2 M1RESOLVEDOBSOLETE
8742 2nativesdk-coreutils: a lot of warningsMediumdengke2.2 M1RESOLVEDFIXED
9159 0.5if recipe = git, 18 pages shownMediumElliot Smith2.2 M1RESOLVEDFIXED
9199 3[meta-swupd] Enable updating of configuration files in swupd-clientMediumJoshua Lock2.2 M1RESOLVEDFIXED
9211 0.3base.bbclass: insufficient error handling for LIC_FILES_CHKSUMMediumAníbal Limón2.2 M1RESOLVEDFIXED
9407 3bitbake reports log_check warning without stating in which log/recipe the problem occurredMediumHeinz Wrobel2.2 M1RESOLVEDFIXED
9501 'yocto-bsp create xxxx arm' generates bbappend file with 'bbapend' extensionMediumLeonardo Sandoval Gonzalez2.2 M1RESOLVEDNOTABUG
9512 5insane.bbclass: package_qa_check_license -> do_qa_populate_licMediumRobert Yang2.2 M1RESOLVEDFIXED
9528 1dbus-test: installs libtool wrapper for binariesMedium+Ross Burton (Arm)2.2 M1RESOLVEDFIXED
9605 Extensible SDK installer fails if the local.conf used to build it contains variable in DL_DIRMediumPaul Eggleton2.2 M1RESOLVEDFIXED
9608 pkg-config 0.29 compilation error after gcc update (5.3 -> 6.1)Medium+Khem Raj2.2 M1RESOLVEDFIXED
9695 Add UUID to toolchain JSON filesMediumTim Orling2.2 M1RESOLVEDWONTFIX
9705 3Runtime testing fails to import tests from other layersUndecidedMariano Lopez2.2 M1RESOLVEDFIXED
9712 buildhistory-diff depends on python3-git, which is not in Debian StableMedium+Ed Bartosh2.2 M1RESOLVEDFIXED8 June 2016: IN PROGRESS REVIEW
9714 Avahi 0.6.32 build with uclibc failedMedium+Jussi Kukkonen2.2 M1RESOLVEDFIXED
9741 0.2buildhistory-diff should recommend python3 version of GitPythonMedium+Ed Bartosh2.2 M1RESOLVEDFIXED
9744 0.5distrodata class don't work with python3UndecidedAníbal Limón2.2 M1RESOLVEDFIXED
9803 cooker.py blew up on failed build (serialization issue?)UndecidedEd Bartosh2.2 M1RESOLVEDFIXED
9855 0.5xsltproc is required on all build slavesUndecidedMichael Halstead2.2 M1RESOLVEDFIXED
1882 5Verify and document package feed creation for each package management backendMediumJoshua Lock2.2 M2RESOLVEDFIXED16 June 2016: Set doc flag to done.
7963 2Release process needs to generate correct toasterconf.json files for tar.gz releasesMediumBill Randle2.2 M2RESOLVEDFIXED
8477 5ALTERNATIVE_PRIORITY conflictsMediumRobert Yang2.2 M2RESOLVEDFIXED
9249 1patchwork: test that CVE patches contain the proper formattingMedium+Mariano Lopez2.2 M2RESOLVEDFIXED
9315 2nightly-world & nightly-world-lsb failed at PublishingArtifactsMediumBill Randle2.2 M2RESOLVEDFIXED
9422 3oe-init-build-env: read SSTATE_DIR and DL_DIR from env varUndecidedRobert Yang2.2 M2RESOLVEDDUPLICATE
9683 13.10 says d.getVar("X", expand=False) but that's wrong for 2.1MediumScott Rifenbark2.2 M2RESOLVEDFIXED9 June 2016: IN PROGRESS REVIEW
9704 layer index update script needs to handle python 3 for masterHighPaul Eggleton2.2 M2RESOLVEDFIXED
9750 1yocto-bsp create: no graceful error message for wrong format in input fileMediumHumberto Ibarra2.2 M2RESOLVEDFIXED
9771 meta-intel is unconditionally modifying linux-firmwareMediumSaul Wold2.2 M2RESOLVEDFIXED
9791 CODI server fails to register all toolchains if multiple containers are launched simultaneouslyMediumTodor Minchev2.2 M2RESOLVEDFIXED
9804 meta-intel: standard/intel/bxt-rebase lacks sounds/pci/hda bug fixMediumCalifornia Sullivan2.2 M2RESOLVEDFIXED
9829 2WIC error when using rawcopyMediumEd Bartosh2.2 M2RESOLVEDFIXED
9834 1with python upgraded to version 3, "yocto-kernel patch add" script failedMediumHumberto Ibarra2.2 M2RESOLVEDFIXED
9910 pstree isn't pretty since Py3MediumRoss Burton (Arm)2.2 M2RESOLVEDFIXED
1018 3runqemu script has bugs with the audio optionLowRobert Yang2.2 M3RESOLVEDFIXED
3388 2perf: enable man pages for basic 'help' functionalityMediumdengke2.2 M3RESOLVEDFIXED
6120 5perf top command does not work on QemuPPCMediumdengke2.2 M3RESOLVEDNOTABUG
6996 10cyclic symlinks in rootfs cause user-space qemu to infinite loop on startupMediumAníbal Limón2.2 M3RESOLVEDFIXED
7254 7PATCHRESOLVE's devshell opens up multiple new terminalsMediumAlejandro Hernandez2.2 M3RESOLVEDFIXED
7418 3Perf/kernel-devsrc raceMediumBruce Ashfield2.2 M3RESOLVEDWORKSFORMEWaiting for 4.7 release
7436 1kbd build raceMediumMaxin B. John2.2 M3RESOLVEDFIXED
7552 1Generated SDK has "expect" headers in wrong locationMediumRandy Witt2.2 M3RESOLVEDFIXED
7554 0.5Ownership issue in package contentsMediumRobert Yang2.2 M3RESOLVEDFIXED
8289 4kernel_configme step should use "oldnoconfig" instead of "allnoconfig" when silently upgrading user defconfigMediumBruce Ashfield2.2 M3RESOLVEDFIXED
8784 IMAGE_LINGUAS did not support multilib correctlyMediumHongxu Jia2.2 M3RESOLVEDWONTFIX
8810 3Some strace ptests failMediumdengke2.2 M3RESOLVEDINVALID
8884 1Locked signature warning is shown even if package can be fetched from SSTATE_MIRRORSMedium+Paul Eggleton2.2 M3RESOLVEDFIXED
8970 5test_kernel_module fails with AssertionError: 137 != 0 : cd /usr/src/kernel && make scriptsMediumBruce Ashfield2.2 M3RESOLVEDWORKSFORME
9351 1Issues using bitbake with externalsrc and gitMedium+Markus Lehtonen2.2 M3RESOLVEDFIXED
9415 5IMAGE_FSTYPES: split image type and compress formatUndecidedRobert Yang2.2 M3RESOLVEDNOTABUG
9491 Enable explicit removal of support packages when not neededMedium+Stephano Cetola2.2 M3RESOLVEDFIXED
9495 5Can't boot efi image (iso or vmdk) in virtualboxMediumRobert Yang2.2 M3RESOLVEDINVALID
9499 1license.bbclass find_license_files does not process LICENSE_pn variables correctlyMedium+Markus Lehtonen2.2 M3RESOLVEDFIXED
9510 2gcc-cross-initial parallel make problem / build break (found on aarch64)MediumTristan Van Berkom2.2 M3RESOLVEDWORKSFORME
9575 5Test SDK EXT failed on core-image-sato for MIPS architectureMedium+Chen Qi2.2 M3RESOLVEDWORKSFORME
9577 3gen-lockedsig-cache fails when populating sdk ext on PPC architectureMedium+Chen Qi2.2 M3RESOLVEDWORKSFORME
9757 1python3-git requires operator and enum modulesMedium+Alejandro Hernandez2.2 M3RESOLVEDFIXED
9815 SSTATE_MIRRORS does not support http* with basic authenticationMedium+Stephano Cetola2.2 M3RESOLVEDFIXED
9857 3sstate install doesn't preserve extended attributes on filesMedium+Joshua Lock2.2 M3RESOLVEDFIXED
9863 Changing files in packages-split with populate_packages_prepend does not impact rpm packages, while it does for deb and ipkMedium+Ed Bartosh2.2 M3RESOLVEDNOTABUG
9865 "inherit" invalid in .inc file when included in distro configMediumPatrick Ohly2.2 M3RESOLVEDINVALID
9890 gettext-native (0.16.1 version) do_populate_sysroot failsMediumChen Qi2.2 M3RESOLVEDFIXED
9896 groff_1.18.1.4 do_compile failureMediumHongxu Jia2.2 M3RESOLVEDFIXED
9922 Need a webhook service for CROPS that allows us to kick off actions based on eventsMediumRandy Witt2.2 M3RESOLVEDFIXED
9926 2testimage/testexport: When installed packages if there is more than json file just one will be processedMediumMariano Lopez2.2 M3RESOLVEDFIXED
9929 pseudo 1.8.1: potential performance regressionHighJoshua Lock2.2 M3RESOLVEDFIXED
9959 1patchtest-oe: the check for 'signed-off-by' format is failing on unicode namesMedium+Daniela Plascencia2.2 M3RESOLVEDFIXED
9964 1Suggested fleshing out of the do_compile documentationMediumScott Rifenbark2.2 M3RESOLVEDFIXED29 July 2016: IN PROGRESS REVIEW
9965 1Suggested fleshing out of the do_configure documentationMediumScott Rifenbark2.2 M3RESOLVEDFIXED18 July 2016: IN PROGRESS REVIEW
9966 1Suggested fleshing out of the do_install documentationUndecidedScott Rifenbark2.2 M3RESOLVEDFIXED18 July 2016: IN PROGRESS REVIEW
9972 recipetool: setvar fails on empty bbappend fileMediumPaul Eggleton2.2 M3RESOLVEDFIXED
9985 1Suggested clarification and motivation for the override-style operatorsMediumScott Rifenbark2.2 M3RESOLVEDFIXED01 August 2016: IN PROGRESS REVIEW
9987 sysprof has floating dependency on polkitMediumMaxin B. John2.2 M3RESOLVEDFIXED
9994 yocto-uninative.inc: please create and use a new uninative tarballMedium+Ross Burton (Arm)2.2 M3RESOLVEDFIXED
10002 1Suggested glossary entries for PATH and EXTRANATIVEPATHMediumPaul Eggleton2.2 M3RESOLVEDFIXED01 August 2016: RESOLVED
10003 1Mention what happens when non-existent variables are expandedUndecidedScott Rifenbark2.2 M3RESOLVEDFIXED22 July 2016: IN PROGRESS REVIEW
10004 mail command missing on ubuntu1604 workerUndecidedMichael Halstead2.2 M3RESOLVEDFIXED
10010 CheckOutLayers build step fails if OPTIMIZED_GIT_CLONE is not TrueUndecidedBill Randle2.2 M3RESOLVEDFIXED
10013 1Suggested changes to the INITRAMFS_IMAGE_BUNDLE glossary entryMediumScott Rifenbark2.2 M3RESOLVEDFIXED01 August 2016: RESOLVED
10015 1oe-selftest --coverage produces empty coverage report on OpenSUSEMedium+Humberto Ibarra2.2 M3RESOLVEDNOTABUG
10019 0.2build-perf-test-wrapper.sh failing to execute performance testMediumAníbal Limón2.2 M3RESOLVEDFIXED
10020 Handle oe-core layer version 9HighBill Randle2.2 M3RESOLVEDFIXED
10023 recipetool create breaks on github tarballsMediumPaul Eggleton2.2 M3RESOLVEDFIXED
10028 Fail to build sudoku-savant with toolchain SDKMediumRoss Burton (Arm)2.2 M3RESOLVEDFIXED
10036 ncurses-native fails at do_install using make 4.2MediumJuro Bystricky2.2 M3RESOLVEDFIXED
10040 Some recipes use DEBIAN_MIRROR for SRC_URIMediumMaxin B. John2.2 M3RESOLVEDFIXEDBackport to Krogoth
10045 Media player cannot be closed Minnow32MediumMaxin B. John2.2 M3RESOLVEDFIXED
10049 2patchtest-oe: use a template when on the scripts that creates the final summaryMedium+Daniela Plascencia2.2 M3RESOLVEDFIXED
10051 0.2Error log links (err.html and err.text) in build page show tracebacks from buildsteps.pyMediumAníbal Limón2.2 M3RESOLVEDFIXED
10052 Stop known selftest failures making it to error reportingHighRoss Burton (Arm)2.2 M3RESOLVEDFIXED
10065 patchtest-oe: replace 'subject' for 'shortlog'Medium+Daniela Plascencia2.2 M3RESOLVEDFIXED
10074 hdparm: invalid usage of LICENSE and LICENSE_<pkg>MediumMaxin B. John2.2 M3RESOLVEDFIXED
10082 Use sendmail, rather than mail for sending QA emailsMediumBill Randle2.2 M3RESOLVEDFIXED
10105 Add musl world build on autobuilderUndecidedBill Randle2.2 M3RESOLVEDFIXED
10106 Using local mirror in SSTATE_MIRRORS results in "changed cwd" warningsMedium+Ross Burton (Arm)2.2 M3RESOLVEDFIXED
10115 Stack overflow on persist_data moduleMedium+Richard Purdie2.2 M3RESOLVEDFIXED
10129 gcc-runtime fails to build if libunwind in sysroot with muslHighRichard Purdie2.2 M3RESOLVEDFIXED
10134 UNINATIVE_CHECKSUM configuration failure on core-image-minimal's do_populate_sdk_ext taskMediumPaul Eggleton2.2 M3RESOLVEDFIXED
10139 CVE-2016-5696 kernel: challenge ACK counter information disclosure.HighBruce Ashfield2.2 M3RESOLVEDFIXED
10149 Crash in image.bbclassMedium+Paul Eggleton2.2 M3RESOLVEDFIXED
10154 Eclipse-poky-neon requires java 1.8.0 to buildUndecidedMichael Halstead2.2 M3RESOLVEDFIXED
10155 usersetup in the extsdk container is not doing a sudo -H so our user is getting the wrong $HOMEMedium+Randy Witt2.2 M3RESOLVEDFIXED
10162 oe-selftest: When using xml reporting runqemu failsHighMariano Lopez2.2 M3RESOLVEDFIXED
10164 0.01RM_OLD_IMAGE = "1" doesn't remove old .vdi and .hdddirect imagesUndecidedJonathan Liu2.2 M3RESOLVEDFIXED
10211 New runqemu makes it harder to use on hosts other than the build machineMedium+Joshua Lock2.2 M3RESOLVEDFIXED
10227 nightly-oecore do_testimage fails with "core-image-sato - FAILED to start qemu - check the task log and the boot log"HighRichard Purdie2.2 M3RESOLVEDFIXED
10238 0.5new runqemu fails when you change the DEPLOY_IMAGE_DIR variable for the testMedium+Joshua Lock2.2 M3RESOLVEDFIXED
10240 Python3 runqemu doesn't support calling testimage on QEMU artefacts copied from another host/build dirMedium+Joshua Lock2.2 M3RESOLVEDFIXED
10244 smart runtime testing sometimes fails with obtuse errorsMedium+Markus Lehtonen2.2 M3RESOLVEDFIXED
10245 qemu 2.7.0 target recipe fails to buildHighJianxun Zhang2.2 M3RESOLVEDFIXED
1989 4Default module selections need attentionMedium+Bruce Ashfield2.2 M4RESOLVEDFIXED
6767 2kernel version mismatched on some BSPsMediumCalifornia Sullivan2.2 M4RESOLVEDFIXED
6957 5[toolchain/uclibc]very long pathsMediumRobert Yang2.2 M4RESOLVEDINVALID
7718 0.5target:task syntax not mentioned in --helpMediumScott Rifenbark2.2 M4RESOLVEDFIXED29 July 2016: RESOLVED
7950 2gcc-cross-canadian-i586 doesn't work PREFERRED_VERSIONMediumRichard Purdie2.2 M4RESOLVEDFIXED
8019 1Clarification of IMAGE_INSTALL variableMediumScott Rifenbark2.2 M4RESOLVEDFIXED
8034 2typeahead search needs words to indicate it is constrained to the added layers.MediumBelen Barros Pena2.2 M4RESOLVEDFIXED
8188 10The variable history is missing the layer nameMediumDavid Reyna2.2 M4RESOLVEDFIXED
8273 1openjade-native doesn't remove from sysroot correctlyMediumRichard Purdie2.2 M4RESOLVEDFIXED
8576 2QemuRunner logging for qemu start failure does not log anything to the console in oe-selftestMedium+Francisco Pedraza2.2 M4RESOLVEDFIXED
8642 3The "32" is a broken symlink in aarch64's mutilib SDKMedium+Chen Qi2.2 M4RESOLVEDFIXED
8771 5test_smart_channel_add (oeqa.runtime.smart.SmartRepoTest) failed in AutobuilderMedium+Richard Purdie2.2 M4RESOLVEDFIXED
8812 2Some util-linux ptests failMediumdengke2.2 M4RESOLVEDFIXED
8939 Pseudo: Lots of [host-user-contaminated] warningMediumRobert Yang2.2 M4RESOLVEDFIXED
9281 1Changing SDK_OS hits warnings unless you wipe tmpMedium+Juro Bystricky2.2 M4RESOLVEDFIXED
9380 1The manual does not mention automatically added version restrictionsMediumScott Rifenbark2.2 M4RESOLVEDFIXED21 July 2016: RESOLVED
9416 3rpm: tmpfile creation failsMedium+Markus Lehtonen2.2 M4RESOLVEDFIXED
9554 2Add section for on-target debuggingMedium+Scott Rifenbark2.2 M4RESOLVEDFIXED03 Oct 2016: RESOLVED
9580 1Missing package dependency in quick start guide for FedoraMediumScott Rifenbark2.2 M4RESOLVEDFIXED01 Sept 2016: RESOLVED
9639 1cmake-native autodetects libidn-nativeMedium+Ross Burton (Arm)2.2 M4RESOLVEDFIXED
9662 1patchdir fails silently if no trailing slash is presentMediumCarlos Rafael Giani2.2 M4RESOLVEDWORKSFORME
9667 2Image types in quick start guide should be appropriate and consistentMedium+Henry Bruce2.2 M4RESOLVEDFIXED03 Oct 2016: IN PROGRESS REVIEW
9752 1ptest results do not include all the components testedMedium+Plauchu Edwin2.2 M4RESOLVEDFIXED
9849 0.5libdrm autodetects dependenciesMediumJussi Kukkonen2.2 M4RESOLVEDFIXED
9851 0.5piglit fails to build on qemux86*Medium+Jussi Kukkonen2.2 M4RESOLVEDFIXED
9889 1cvs is required to be installed on host to support cvs SRC_URIMediumRoss Burton (Arm)2.2 M4RESOLVEDFIXED29 July 2016: Set documentation flag to "No"
9950 1Suggested additions to the logging documentationUndecidedScott Rifenbark2.2 M4RESOLVEDFIXED18 July 2016: RESOLVED
9953 3patchtest-oe: some series cannot be parse correctly and no checks can be doneMedium+Daniela Plascencia2.2 M4RESOLVEDFIXED
9955 5patchtest-oe: string encoding error on some seriesMedium+Daniela Plascencia2.2 M4RESOLVEDFIXED
9975 5Analyse performance regression against 2.1Medium+Markus Lehtonen2.2 M4RESOLVEDFIXED
10011 1Suggested addition to the PROVIDES glossary entry to explain virtual targetsMediumScott Rifenbark2.2 M4RESOLVEDFIXED
10012 1Suggested rewriting of the (currently semi-nonsensical) INITRAMFS_IMAGE glossary entryMediumScott Rifenbark2.2 M4RESOLVEDFIXED01 August 2016: RESOLVED
10024 5Warning "Child process exit status 4: lock_held" when building imageHighRobert Yang2.2 M4RESOLVEDFIXED
10029 testimage requires sudo password to execute runqemu-ifup and runqemu-ifdownMediumStephano Cetola2.2 M4RESOLVEDFIXED
10030 Spurious populate_sysroot warningsMedium+Richard Purdie2.2 M4RESOLVEDFIXED
10068 1Suggested rewording of the BPN glossary entryMediumScott Rifenbark2.2 M4RESOLVEDFIXED08 August 2016: RESOLVED
10069 1Suggested addition to explain how runtime virtual dependencies workUndecidedScott Rifenbark2.2 M4RESOLVEDFIXED03 August 2016: RESOLVED
10070 1Make it clear that PARALLEL_MAKE(INST) won't work unless EXTRA_OEMAKE is passed to makeUndecidedScott Rifenbark2.2 M4RESOLVEDFIXED03 August 2016: RESOLVED
10071 1Suggested clarifications to [dirs] and [cleandirs]MediumScott Rifenbark2.2 M4RESOLVEDFIXED04 August 2016: RESOLVED
10093 1Suggested fleshing out of the anonymous function documentationUndecidedScott Rifenbark2.2 M4RESOLVEDFIXED08 August 2016: RESOLVED
10094 1Small suggested clarifications to the PACKAGES and FILES glossary entriesUndecidedScott Rifenbark2.2 M4RESOLVEDFIXED08 August 2016: RESOLVED
10099 1Clarifying and fleshing out debugging with 'bitbake -e'UndecidedScott Rifenbark2.2 M4RESOLVEDFIXED08 August 2016: RESOLVED
10100 1Suggested documentation for bb.utils.contains(), bb.utils.mkdirhier(), and bb.data.inherits_class()MediumScott Rifenbark2.2 M4RESOLVEDFIXED07 Sept 2016: RESOLVED
10102 2gdk-pixbuf-native missing dependency on pcre needed by glib-2.0-nativeMedium+Ross Burton (Arm)2.2 M4RESOLVEDFIXED
10114 1Insufficent error-handling in SDK installerMedium+Mariano Lopez2.2 M4RESOLVEDFIXEDShould require backport also
10116 busybox parallel make raceHighJuro Bystricky2.2 M4RESOLVEDFIXED
10117 1Suggested rewriting to make '3.9.1. Dependencies Internal to the .bb File' less misleadingUndecidedScott Rifenbark2.2 M4RESOLVEDFIXED12 August 2016: IN PROGRESS REVIEW
10131 1Suggested rewriting of '2.3.5. Dependency Graphs'UndecidedScott Rifenbark2.2 M4RESOLVEDFIXED12 July 2016: RESOLVED
10132 1Clarifications/corrections to '2.3.1. Viewing Logs from Failed Tasks'UndecidedScott Rifenbark2.2 M4RESOLVEDFIXED12 July 2016: RESOLVED
10135 1Some small mostly package-related nitsUndecidedScott Rifenbark2.2 M4RESOLVEDFIXED12 July 2016: RESOLVED
10138 1Small suggested version/revision-related clarificationsMediumScott Rifenbark2.2 M4RESOLVEDFIXED22 August 2016: RESOLVED
10141 1Suggested fleshing out of the sigdata/siginfo documentationMediumScott Rifenbark2.2 M4RESOLVEDFIXED22 August 2016: RESOLVED
10144 1Very minor nit in '2.3.2. Viewing Variable Values'MediumScott Rifenbark2.2 M4RESOLVEDFIXED22 August 2016: RESOLVED
10148 1extsdk container: devtool modify fails due to missing git configMedium+Randy Witt2.2 M4RESOLVEDDUPLICATE
10157 3rpm: Segmentation fault when running parallel multiple "rpm -qi" commands as rootHighAníbal Limón2.2 M4RESOLVEDFIXED
10171 2Autobuilder fails to push into buildhistory repoHighJoshua Lock2.2 M4RESOLVEDFIXED
10172 1Suggested new section to clarify stamps, input checksums, and the sstate cacheMediumScott Rifenbark2.2 M4RESOLVEDFIXED01 Sept 2016: RESOLVED
10173 1Suggested clarification of the OVERRIDES glossary entryMediumScott Rifenbark2.2 M4RESOLVEDFIXED01 Sept 2016: RESOLVED
10174 1Suggested rewriting of the CLASSOVERRIDE glossary entryMediumScott Rifenbark2.2 M4RESOLVEDFIXED01 Sept 2016: RESOLVED
10175 1Suggested rewriting of the MACHINEOVERRIDES glossary entryMediumScott Rifenbark2.2 M4RESOLVEDFIXED01 Sept 2016: RESOLVED
10176 1Suggested rewriting of the DISTROOVERRIDES glossary entryMediumScott Rifenbark2.2 M4RESOLVEDFIXED01 Sept 2016: RESOLVED
10186 1Typo in adding an event handler leads to confusing errorMedium+Markus Lehtonen2.2 M4RESOLVEDFIXED
10191 1Fail to build galculator with toolchain SDK on Fedora 24 i686MediumJussi Kukkonen2.2 M4RESOLVEDFIXED
10192 0.5layer index recipe parsing brokenMedium+Michael Halstead2.2 M4RESOLVEDFIXED
10196 1Suggested (currently missing) documentation for the 'export' keywordMediumScott Rifenbark2.2 M4RESOLVEDFIXED01 Sept 2016: RESOLVED
10197 1Suggested additions to the MLPREFIX glossary entryMediumScott Rifenbark2.2 M4RESOLVEDFIXED01 Sept 2016: RESOLVED
10198 1Suggested new note in the DEPENDS glossary entryMediumScott Rifenbark2.2 M4RESOLVEDFIXED01 Sept 2016: IN PROGRESS REVIEW
10201 1BBSERVER permutes the hash preventing toaster/(memory resident bitbake) from using sstate generated without BBSERVERHighEd Bartosh2.2 M4RESOLVEDFIXED
10207 1oe-selftest requires to document python-coverage requirementsMediumHumberto Ibarra2.2 M4RESOLVEDFIXED01 Sept 2016: NEEDINFO
10208 1Fedora oe-selftest requires python3-GitPython (now that we are python3)UndecidedScott Rifenbark2.2 M4RESOLVEDFIXED01 Sept 2016: RESOLVED
10216 1Suggested (currently missing) documentation for oe-pkgdata-utilUndecidedScott Rifenbark2.2 M4RESOLVEDFIXED07 Sept 2016: RESOLVED
10223 libical build fails after changing machine (QA check for tmpdir in .pc file)MediumMaxin B. John2.2 M4RESOLVEDFIXED
10225 3Signs of a race in do_testimageHighAníbal Limón2.2 M4RESOLVEDFIXED
10248 1Suggested new section on how automatically added runtime dependencies workMediumScott Rifenbark2.2 M4RESOLVEDFIXED21 Sept 2016: RESOLVED
10251 linux-firmware packages include licenses from all firmware packagesMediumSaul Wold2.2 M4RESOLVEDFIXED
10252 1Suggested small note to avoid confusion re. the version specification in PREFERRED_VERSIONUndecidedScott Rifenbark2.2 M4RESOLVEDFIXED14 Sept 2016: RESOLVED
10255 SDK siteconfig has HOST information instead of TARGET'sHighChen Qi2.2 M4RESOLVEDFIXED
10264 1On-target postinstall failure results in a wrong state of an rpm packageMedium+Stephano Cetola2.2 M4RESOLVEDNOTABUG
10270 1Raciness when invoking multiple instances of runqemu via testimage on the autobuilderUndecidedRobert Yang2.2 M4RESOLVEDFIXED
10278 2Switching PREFERRED_PROVIDER_virtual/kernel leads to errorsMedium+Saul Wold2.2 M4RESOLVEDFIXED
10279 Pickle protocol used for donestamp is incompatible with older versionsMediumPaul Eggleton2.2 M4RESOLVEDFIXED
10280 1LIC_FILES_CHKSUM error is no longer fatalMedium+Ross Burton (Arm)2.2 M4RESOLVEDFIXED
10282 Prelink: doesn't work on qemux86-64 on the qemu targetMedium+Richard Purdie2.2 M4RESOLVEDFIXED
10284 FTP failures on new cluster resulting in bitbake-selfcheck and checkuri failuresHighMichael Halstead2.2 M4RESOLVEDFIXED
10290 gnutls has relocations in .text on x86Medium+Jussi Kukkonen2.2 M4RESOLVEDFIXED
10292 1Suggested addition to complete the description of 'bitbake -e'MediumScott Rifenbark2.2 M4RESOLVEDFIXED22 Sept 2016: RESOLVED
10293 1Mention that single quotes can be used when assigning variablesMediumScott Rifenbark2.2 M4RESOLVEDFIXED22 Sept 2016: RESOLVED
10294 1Suggested addition re. empty packages in PACKAGESMediumScott Rifenbark2.2 M4RESOLVEDFIXED22 August 2016: RESOLVED
10295 1Suggested documentation for the 'depchains' automatic dependency mechanismMediumScott Rifenbark2.2 M4RESOLVEDFIXED22 Sept 2016: RESOLVED
10296 1Suggested documentation on using overrides with functionsMediumScott Rifenbark2.2 M4RESOLVEDFIXED22 Sept 2016: RESOLVED
10297 1Two suggested notes in the Other Tips section re. removing tmp/ and searchingMediumScott Rifenbark2.2 M4RESOLVEDFIXED22 Sept 2016: RESOLVED
10298 1Suggested DEPENDS update to demystify the implementation and give more examplesMediumScott Rifenbark2.2 M4RESOLVEDFIXED26 Sept 2016: RESOLVED
10299 Daemon stop after update-alternatives prevent package upgradeMedium+Markus Lehtonen2.2 M4RESOLVEDFIXEDYP 2.2 M4 RC1 BUILD BLOCKING BUG
10313 libnl fail to build with muslMediumMing Liu2.2 M4RESOLVEDNOTABUG
10319 2cp failures during PublishArtifacts should cause the step to failHighMariano Lopez2.2 M4RESOLVEDFIXED
10320 2nativesdk signatures changing between certain MACHINE settingsMedium+Joshua Lock2.2 M4RESOLVEDFIXED
10324 When running builds in a docker contain, they occasionally fail and close the containerUndecidedMark Hatle2.2 M4RESOLVEDFIXED
10326 devtool modify with file entry using subdir no longer works properlyMedium+Stephano Cetola2.2 M4RESOLVEDFIXEDYP 2.2 M4 RC1 BUILD BLOCKING BUG
10328 Kernel oops with linux-yocto-rt 4.8Medium+Paul Gortmaker2.2 M4RESOLVEDFIXEDYP 2.2 M4 RC1 BUILD BLOCKING BUG
10330 3bitbake with memory resident don't report SSTATE progressMedium+Aníbal Limón2.2 M4RESOLVEDFIXEDYP 2.2 M4 RC1 BUILD BLOCKING BUG
10335 Task failure not reflected in Tasks SummaryMediumRichard Purdie2.2 M4RESOLVEDFIXED
10336 Unclear error message from SDK installer when host architecture is not compatibleMedium+Todor Minchev2.2 M4RESOLVEDFIXED
10337 devtool: fails to add an npm project if nodejs-native is not already builtMediumPaul Eggleton2.2 M4RESOLVEDFIXED
10339 1Fedora24 builder fails oe-selftest with "AssertionError: This test needs GnuPG"HighMichael Halstead2.2 M4RESOLVEDFIXED
10340 0.5nightly-mips-lsb sanity tests timeoutMedium+Joshua Lock2.2 M4RESOLVEDFIXED
10341 cve-check-tool fails to build (in master-next)MediumAndré Draszik2.2 M4RESOLVEDFIXED
10345 1Suggested additions to mention 'bitbake -C' and clarify tainted tasksMediumScott Rifenbark2.2 M4RESOLVEDFIXED03 Oct 2016: RESOLVED
10346 Git should be able to apply patches when in an unconfigured state.Medium+Stephano Cetola2.2 M4RESOLVEDFIXEDYP 2.2 M4 RC1 BUILD BLOCKING BUG
10348 1Suggested note to clarify how native recipes find dependenciesMediumScott Rifenbark2.2 M4RESOLVEDFIXED03 Oct 2016: RESOLVED
10349 renameat() loses extended attributesMedium+Joshua Lock2.2 M4RESOLVEDFIXED
10354 gcc-runtime_5.3: misplaced include filesMedium+Juro Bystricky2.2 M4RESOLVEDFIXED
10356 1Suggested addition to explain how the recipe cache worksUndecidedScott Rifenbark2.2 M4RESOLVEDFIXED03 Oct 2016: RESOLVED
10360 1Add link to the OpenEmbedded style guideUndecidedScott Rifenbark2.2 M4RESOLVEDFIXED03 Oct 2016: RESOLVED
10363 1Suggested note to clarify that bb.fatal() raises an exceptionUndecidedScott Rifenbark2.2 M4RESOLVEDFIXED04 Oct 2016: RESOLVED
10364 1Suggested documentation to clarify BitBake-style vs. regular Python functions and bb.build.exec_func()UndecidedScott Rifenbark2.2 M4RESOLVEDFIXED04 Oct 2016: RESOLVED
10366 trouble with perf do_installMedium+Saul Wold2.2 M4RESOLVEDFIXED
10367 0.5Upgrade to sqlite version 3.14.1 results in increased build time (performance related)Medium+Jianxun Zhang2.2 M4RESOLVEDFIXED
10370 selftest: test_invalid_recipe_src_uri fails to locate fetcher errorMedium+Benjamin Esquivel2.2 M4RESOLVEDFIXED
10371 patchtest: patchtest-oe: make code publicHighMichael Halstead2.2 M4RESOLVEDFIXED
10374 2patchtest: guest machine halts on power offMedium+Daniela Plascencia2.2 M4RESOLVEDFIXED
10377 1Suggested change to make the SYSROOT_DIRS* variables more discoverableUndecidedScott Rifenbark2.2 M4RESOLVEDFIXED05 Oct 2016: RESOLVED
10379 FAIL: test_devtool_update_recipe_local_filesMedium+Stephano Cetola2.2 M4RESOLVEDFIXEDYP 2.2 M4 RC1 BUILD BLOCKING BUG
10380 multilib-example2.conf fails testsdkMedium+Juro Bystricky2.2 M4RESOLVEDFIXED
10386 1matchbox-terminal upgrade increased disk footprint by ~300 MBMediumJussi Kukkonen2.2 M4RESOLVEDFIXED
10389 linuxloader.bbclass does not understand mips64UndecidedMark Hatle2.2 M4RESOLVEDFIXED
10397 1oe-init-build-env-memres <directory> loops indefinitelyMedium+Benjamin Esquivel2.2 M4RESOLVEDFIXED
10399 0.3bitbake is unable to handle exceptions past the clean_environment() callHighAníbal Limón2.2 M4RESOLVEDFIXED
10419 Old images disappear from my $TMPDIR/deploy/images when a new image is builtHighJoshua Lock2.2 M4RESOLVEDFIXED
10420 Exception when executing gdkpixbuf completion hookHighRoss Burton (Arm)2.2 M4RESOLVEDFIXED
10427 4installing a intel-corei7-64 image failsMedium+Jianxun Zhang2.2 M4RESOLVEDFIXED
10436 core-image-rt for qemux86 fails to bootMedium+Paul Gortmaker2.2 M4RESOLVEDFIXED
10606 [Test Case 196] Install from USB device to HDD on NUC is failingMediumCalifornia Sullivan2.2 M4RESOLVEDDUPLICATE
10610 meta-intel unconditionally overrides scripts/lib/wic/canned-wks/systemd-bootdisk.wksHighSaul Wold2.2 M4RESOLVEDFIXED
10709 core-image-sato-sdk-intel-quark.wic doesn't bootMedium+Saul Wold2.2 M4RESOLVEDFIXED
6153 2Archiver causes manifest warnings for the toolchainMediumRoss Burton (Arm)2.3RESOLVEDOBSOLETE
8074 1Graphic display using Virtual Box differs from VMwareMediumJuro Bystricky2.3RESOLVEDNOTABUG
8173 2Wrong dynamic loader because of missing -mfloat-abi=hard in LDFLAGS (in scons)MediumRichard Purdie2.3RESOLVEDWONTFIX
8278 0.5devtool: update compressed patches gracefullyMediumPaul Eggleton2.3RESOLVEDFIXED
8302 1sstate_create_package fails to chmod fileMediumRoss Burton (Arm)2.3RESOLVEDDUPLICATE
8447 1Host contamination in glibc-localesMediumJuro Bystricky2.3RESOLVEDDUPLICATE
8779 update-alternatives.bbclass automatic renaming doesn't happen in sysrootsMediumRichard Purdie2.3RESOLVEDWONTFIX
9531 5Need a proper way to fix mismatched arch generated with bare-bone kernel recipeMediumSaul Wold2.3RESOLVEDWONTFIX
9948 0.5"-fstack-protector-strong" seems unnecessary in SECURITY_LDFLAGSMediumJoshua Lock2.3RESOLVEDWONTFIX
10288 0.5mesa and wayland: mesa master now requires native wayland-scanner in order to buildMediumJussi Kukkonen2.3RESOLVEDFIXED
10384 knotty errors out sometimes when running many cores over tmux/sshMediumbrian avery2.3RESOLVEDFIXED
10393 4bitbake fails: ERROR: local variable 'value' referenced before assignmentMediumMarkus Lehtonen2.3RESOLVEDFIXED
10403 [PATCH] configure --cflags breaks when CFLAGS contain commasMediumMark Hatle2.3RESOLVEDFIXED
10438 1Possible to infinite loop eSDK creationMediumRoss Burton (Arm)2.3RESOLVEDFIXED
10464 0.25recipetool: create: shows warning when fetching npm modulesMediumPaul Eggleton2.3RESOLVEDFIXED
10483 genericx86-64 does not boot in jouleMediumSaul Wold2.3RESOLVEDWORKSFORME
10497 3Adding master release fails to get default layersLowMichael Wood2.3RESOLVEDFIXED
10591 0.5oe.lsb.distro_identifier() doesn't always return the same value for CentOS 7MediumJoshua Lock2.3RESOLVEDFIXED
10601 1distrodata: replace MeeGo with ClearMediumRoss Burton (Arm)2.3RESOLVEDFIXED
10799 2compatibility with rm_work.bbclassMediumAaron Zinghini2.3RESOLVEDFIXED
10800 RMC installs incorrectly with multilibMediumRoss Burton (Arm)2.3RESOLVEDFIXED
10809 usb 1-1.2: device descriptor read/all, error -110MediumCalifornia Sullivan2.3RESOLVEDWONTFIX
10839 5RMC: Clarify to use RMC_BOARD_DATA_DIRS to specify board data directoriesMediumJianxun Zhang2.3RESOLVEDFIXED
10857 3sstate: .siginfo files are not accessed from local or NFS-mounted SSTATE_MIRRORMediumEd Bartosh2.3RESOLVEDFIXED
10897 1license.bbclass attempts chown(root.root) in build host context, hiding errorsMediumMarkus Lehtonen2.3RESOLVEDFIXED
10925 meta-intel: Update systemd-boot versionMediumJianxun Zhang2.3RESOLVEDFIXED
10938 1non-deterministic oe-terminal spawningMediumJuro Bystricky2.3RESOLVEDFIXED
10952 0.25no_proxy handling has changedMediumJoshua Lock2.3RESOLVEDFIXED
10955 1ed: upgradeMediumAlexander Kanavin2.3RESOLVEDFIXED
10965 2SDKTARGETSYSROOT and the other variables don't automatically get updated when OVERRIDES updates.MediumRichard Purdie2.3RESOLVEDFIXED
10969 1slang fails to configureMediumRoss Burton (Arm)2.3RESOLVEDFIXED
11001 Failure in do_prepare_recipe_sysroot after interrupted buildMediumRichard Purdie2.3RESOLVEDFIXED
11003 wic plugin rootfs_pcbios_ext crashesMediumAdrian2.3RESOLVEDOBSOLETE
11004 gstreamer1.0-plugins-bad: missing x11 packageconfigMediumJussi Kukkonen2.3RESOLVEDINVALID
11044 2wic should support multiple boot labels such as boot and install targetsMediumEd Bartosh2.3RESOLVEDFIXED
11047 1add cmake tool to sdk generation for published sdk'sMediumbrian avery2.3RESOLVEDFIXED
11061 2RMC DB: qemu virtual machines need serial console settings (or default?)MediumDmitry Rozhkov2.3RESOLVEDFIXED
11112 Building gcc-source fails when $PATH contains spacesLowRichard Purdie2.3RESOLVEDWONTFIX
11115 7Downloading cvs tarball for buildcvs.py selftest shouldn't use /tmpMediumyeoh ee peng2.3RESOLVEDFIXED
11229 Different major versions of QEMU produce different RMC fingerprintsMediumTodor Minchev2.3RESOLVEDWONTFIX
8223 1bbwarn warnings during do_rootfs printed twiceMediumPaul Eggleton2.3 M1RESOLVEDFIXED
9373 1ptest for perl hangMediumAníbal Limón2.3 M1RESOLVEDDUPLICATE
9941 2patchwork: ensure series are created for all submittersHighJose Lamego2.3 M1RESOLVEDFIXED
9942 2patchwork: ensure patches are not marked as Accepted when a newer Series revision is modifiedMedium+Jose Lamego2.3 M1RESOLVEDFIXED
10153 1patchwork: create new patchwork staging instanceMedium+Michael Halstead2.3 M1RESOLVEDFIXED
10250 2qemumips64 + systemd + pam results in login failureMediumChen Qi2.3 M1RESOLVEDFIXED
10369 1Performance degradation on eSDK, install time is twice on 2.1Medium+Paul Eggleton2.3 M1RESOLVEDFIXED
10392 1Some suggested changes in '5.3.20.5. Packaging Externally Produced Binaries'UndecidedScott Rifenbark2.3 M1RESOLVEDFIXED11 Oct 2016: RESOLVED
10400 1Explaining what datastore funcs. do when a variable does not existUndecidedScott Rifenbark2.3 M1RESOLVEDFIXED11 Oct 2016: RESOLVED
10401 1Suggested fleshing out of the 'addtask' documentationUndecidedScott Rifenbark2.3 M1RESOLVEDFIXED11 Oct 2016: RESOLVED
10411 5Provide a working python-pylint recipeMedium+Daniela Plascencia2.3 M1RESOLVEDFIXED
10444 1Suggested documentation to explain line joiningUndecidedScott Rifenbark2.3 M1RESOLVEDFIXED19 Oct 2016: RESOLVED
10445 1RDEPENDS doc should cross-reference EXTENDPKGVMediumScott Rifenbark2.3 M1RESOLVEDFIXED08 Nov 2016: RESOLVED
10462 1mega manual: the building images section lacks sub-sectionsMediumScott Rifenbark2.3 M1RESOLVEDFIXED27 Oct 2016: RESOLVED
10484 0.5devtool: finish command fails if destination layer isn't in bblayers.confMediumPaul Eggleton2.3 M1RESOLVEDFIXED
10561 0.5SDK_OLDEST_KERNEL does not influence nativesdk-glibcMediumPaul Eggleton2.3 M1RESOLVEDFIXED
10608 1.29[Test Case 1059] dmesg log shows various error on NUC with image corei7MediumCalifornia Sullivan2.3 M1RESOLVEDFIXED
10612 2Don't perform git clone on shared volumeHighStephano Cetola2.3 M1RESOLVEDFIXED
10645 1oe-core builds need uninative enabledHighRoss Burton (Arm)2.3 M1RESOLVEDDUPLICATE
10654 5Investigate binary component functionalityMedium+Stephano Cetola2.3 M1RESOLVEDFIXED
10665 0.5swupd + tar extraction errors + IMAMediumPatrick Ohly2.3 M1RESOLVEDFIXED
10666 0.5pack-from-0-*.tar lacks symlinksMediumPatrick Ohly2.3 M1RESOLVEDFIXED
10670 1AUH: Upgrade status email should indicate the URL of the log folder instead of the tar's URLMedium+Plauchu Edwin2.3 M1RESOLVEDFIXED
10721 2patchtest-oe: improve issue and fix strings for test_mbox_format testMedium+Daniela Plascencia2.3 M1RESOLVEDFIXED
10759 1patchwork: post-receive git hook is not functionalUndecidedJose Lamego2.3 M1RESOLVEDFIXED
10860 patchwork: security certificate expired on patchwork siteHighMichael Halstead2.3 M1RESOLVEDFIXED
10866 tinfoil2 breaks the prserv functionalityHighRichard Purdie2.3 M1RESOLVEDFIXED
7142 3cmake.bbclass fails when rebuilding after MACHINE changesMediumRoss Burton (Arm)2.3 M2RESOLVEDFIXEDNIF 11/13, 11/20, 11/27, 12/04
8192 5python3.4.3 os.fork and os.waitpid (prelink related)MediumPlauchu Edwin2.3 M2RESOLVEDDUPLICATE
9553 1INHIBIT_PACKAGE_STRIP docs need to be expandedMediumScott Rifenbark2.3 M2RESOLVEDFIXED08 Nov 2016: RESOLVED
9620 2Update layer index to django 1.8 ltsMedium+Michael Halstead2.3 M2RESOLVEDFIXED
9997 1oe-selftest: make available unittest-xml-reporting at the autobuilder workersMediumMichael Halstead2.3 M2RESOLVEDFIXED
10076 3Docs should have pointer to latest manual at the topMediumScott Rifenbark2.3 M2RESOLVEDFIXED05 Feb 2017: RESOLVED
10178 1Python version should be updated to 3.4 on Quick Start and Mega ManualMediumScott Rifenbark2.3 M2RESOLVEDFIXED08 Nov 2016: RESOLVED
10183 1Needs documentation for PACKAGECONFIG_CONFARGS variableMediumScott Rifenbark2.3 M2RESOLVEDFIXED08 Nov 2016: RESOLVED
10212 5Support to deploy non-bootloader-specific files in EFI partition when build hddimg imageMediumTodor Minchev2.3 M2RESOLVEDFIXED
10267 1workaround for missing --with-libtool-sysroot has wrong sysrootMediumScott Rifenbark2.3 M2RESOLVEDFIXED08 Nov 2016: RESOLVED
10332 3gummiboot: purge all gummiboot features and support from OEMediumAlejandro Hernandez2.3 M2RESOLVEDFIXED
10376 4patchtest: deploy patchtest on serverMedium+Michael Halstead2.3 M2RESOLVEDFIXED
10428 2*.qemuboot.conf files are left in DEPLOY_DIR after other image artifacts are removedMedium+Robert Yang2.3 M2RESOLVEDFIXED
10433 2syslog-ng rc5.d symlinks missing after install, broken postinstMedium+Markus Lehtonen2.3 M2RESOLVEDFIXEDNeed backport to 2.2.1
10440 3Create a reference HW design and a python controlling library for a single power control unitMediumPlauchu Edwin2.3 M2RESOLVEDFIXED
10449 3tar-native - task do_populate_sysroot_setscene fails - likely raceMedium+Ross Burton (Arm)2.3 M2RESOLVEDFIXED
10498 2adwaita install failed on autobuilderMedium+Ross Burton (Arm)2.3 M2RESOLVEDFIXED
10500 4Benchmark meta-intel build VS generic-x86* build in OEMedium+Todor Minchev2.3 M2RESOLVEDFIXED
10501 do_image_wic fails with "Error: Couldn't find HDDDIR, exiting"MediumEd Bartosh2.3 M2RESOLVEDWORKSFORME
10507 3Patchwork: Create Patchtest results viewMedium+Jose Lamego2.3 M2RESOLVEDFIXED
10669 2apt package missing systemd filesMedium 2.3 M2RESOLVEDFIXED
10686 8oeqa: migrate runtime to use the new frameworkMedium+Mariano Lopez2.3 M2RESOLVEDFIXED
10695 sqlite: upstream performance problemMedium+Maxin B. John2.3 M2RESOLVEDFIXED
10734 1patchwork: fail tests should send email to submitter and mailing listMedium+Jose Lamego2.3 M2RESOLVEDNOTABUG
10735 2patchwork: patchtest email should reply to the original patchesMedium+Jose Lamego2.3 M2RESOLVEDNOTABUG
10764 0.5patchwork: Make "PATCH" prefix in subject mandatory for emails to be considered patchesMedium+Jose Lamego2.3 M2RESOLVEDFIXED
10765 patchtest: patchtest guest execution yields a 'Too many open files' message before haltingMedium+Leonardo Sandoval Gonzalez2.3 M2RESOLVEDNOTABUG
10766 2patchtest: patchtest deletes the content of .git/config in openembedded-coreHighLeonardo Sandoval Gonzalez2.3 M2RESOLVEDNOTABUG
10788 0.5Should default to not publishing artefactsMediumJoshua Lock2.3 M2RESOLVEDFIXED
10792 ARM-LPAE-Invalidate-the-TLB-for-module-addresses-dur.patch fails to applyMedium+Bruce Ashfield2.3 M2RESOLVEDWONTFIX
10795 1patchtest:patchtest-oe: clean import statements on both projectsMediumDaniela Plascencia2.3 M2RESOLVEDFIXED
10796 1devtool: sdk-update fails as git detects changes in layers/poky/bitbake/lib/bb/pysh/pyshtables.pyMediumRichard Purdie2.3 M2RESOLVEDFIXED
10797 1ESDK can contain path to build sysroot as SDK sysrootMedium+Paul Eggleton2.3 M2RESOLVEDFIXED
10815 wic does not obey ROOTFS_SIZE / IMAGE_ROOTFS_EXTRA_SPACEMediumEd Bartosh2.3 M2RESOLVEDFIXED
10816 2wic: errors from exec_cmd don't show the error outputMediumEd Bartosh2.3 M2RESOLVEDFIXED
10821 0.5oe-selftest: "import git" fails on Ubuntu 14.04UndecidedEd Bartosh2.3 M2RESOLVEDFIXED
10836 0.1Files with names containing square brackets populated by sstate may not be removed properlyMediumPaul Eggleton2.3 M2RESOLVEDFIXED
10861 perl is not compiling on a OpenSUSE distroMedium+Daniela Plascencia2.3 M2RESOLVEDINVALID
10863 1RRS hasn't updated itself since early DecemberMedium+Aníbal Limón2.3 M2RESOLVEDFIXED
10871 0.2RRS: "Commit" link points to non-existing URLMedium+Aníbal Limón2.3 M2RESOLVEDFIXED
10875 2oe-selftest failure in test_find_path (oeqa.selftest.pkgdata.OePkgdataUtilTests) on autobuilderMedium+Jose Lamego2.3 M2RESOLVEDWORKSFORME
10876 2oe-selftest failure in test_list_pkgs (oeqa.selftest.pkgdata.OePkgdataUtilTests) on autobuilderMedium+Jose Lamego2.3 M2RESOLVEDWORKSFORME
10877 0.5Patchwork is creating new series and/or revisions on behalf of user replies to the original seriesMedium+Jose Lamego2.3 M2RESOLVEDFIXED
10886 1Improve event documentationMediumScott Rifenbark2.3 M2RESOLVEDFIXED23 Jan 2017: RESOLVED
10894 1.5Zephyr BOARD value in local.conf is ignoredMedium+Juro Bystricky2.3 M2RESOLVEDFIXED
10908 devtool needs to check to see if locales are set properly for utf-8Medium+Paul Eggleton2.3 M2RESOLVEDFIXED
10909 1.5build-appliance-image requires pip3 but it isn't installed everywhereMedium+Scott Rifenbark2.3 M2RESOLVEDFIXED25 Jan 2017: RESOLVED
10914 0.5[meta-mingw] nativesdk-mingw-w64-runtime_3.1.0.bb fails in do_configureMedium+Juro Bystricky2.3 M2RESOLVEDFIXED
10916 lib/oe/rootfs: alternative symlinks not reliably removedHighAndré Draszik2.3 M2RESOLVEDFIXED
10933 None-validated host distro such as debian-testing results in oe-selftest failuresMedium+Joshua Lock2.3 M2RESOLVEDFIXED
8525 1selftest needs to control distro configurationMedium+Leonardo Sandoval Gonzalez2.3 M3RESOLVEDFIXED
8570 2problems with gdk-pixbuf and pango loading on multilibMedium+Robert Yang2.3 M3RESOLVEDINVALID
9540 1.5Resolve string formatting issues in console-toolsMediumChen Qi2.3 M3RESOLVEDFIXED
9609 4.1.x: musb fails to compileMediumBruce Ashfield2.3 M3RESOLVEDFIXED
9799 Ctrl-c does'nt stop the build for the ostro cli containerMediumbrian avery2.3 M3RESOLVEDFIXED
9859 1setcap doesn't workMediumSeebs2.3 M3RESOLVEDFIXED
10075 nettle 2.7.1: inconsistency between LICENSE and LICENSE_<pkg>MediumMaxin B. John2.3 M3RESOLVEDFIXED
10101 2When power cycling in masterimage.py, 'shutdown -h now' can return a non-zero exit status because the ssh connection is cutMedium+Nic Donaldson2.3 M3RESOLVEDFIXED
10323 1Sample script to create source release for specific licences failsMediumHenry Bruce2.3 M3RESOLVEDFIXED14 Mar 2017: Marked doc flag to "done"
10402 1ACPI: No IRQ available for PCI Interrupt Link [LNKD]. Try pci=noacpi or acpi=offMedium+Bruce Ashfield2.3 M3RESOLVEDFIXED
10471 3runqemu handling of machine not specified needs improvementMedium+Robert Yang2.3 M3RESOLVEDFIXED
10623 0.25removing hardlink removes xattrsMedium+Joshua Lock2.3 M3RESOLVEDFIXED
10697 10x32 world build fails badlyMedium+Saul Wold2.3 M3RESOLVEDMOVED
10698 5meta-intel doesn't support x32Medium+Saul Wold2.3 M3RESOLVEDMOVEDNeed to further evaluate and possibly file more bugs
10700 2buildtools + deb packaging: Package nativesdk-buildtools-perl-dummy not foundMedium+Ross Burton (Arm)2.3 M3RESOLVEDFIXED
10739 2patchwork: pw should not create new revisions from comments/replies containing patch-like contentMediumJose Lamego2.3 M3RESOLVEDFIXED
10755 1AUTOREV: morty definition results in a RecursionError when setting PV=SRCPV as documentedMediumbrian avery2.3 M3RESOLVEDWORKSFORME06 Jan 2017: NEEDINFO
10756 1patchwork: New patch revision messages should be processed even if they have a duplicated message-idMedium+Jose Lamego2.3 M3RESOLVEDFIXED
10761 1Building Debugfs with nfs-utils-client and ipkgMedium+Ross Burton (Arm)2.3 M3RESOLVEDFIXED
10783 2wic should not be writing out to /var/tmp/wicMedium+Ed Bartosh2.3 M3RESOLVEDFIXED
10794 5Update sanity tests to cope with minimal eSDK installerMedium+Ross Burton (Arm)2.3 M3RESOLVEDFIXED
10814 1populate-volatile.sh causes confusing boot messages with read-only-rootfsMedium+Ross Burton (Arm)2.3 M3RESOLVEDFIXED
10818 1add documentation on stabilizing host build machine performance for kernel>=4.3 and systemd>=228MediumScott Rifenbark2.3 M3RESOLVEDFIXED10 Jan 2017: RESOLVED
10835 2WIC should not rely on hddimg creation for finding all needed artifactsMediumEd Bartosh2.3 M3RESOLVEDFIXED
10845 2test-image: compile and load a kernel module under the qemu-lsb image is failingMediumBruce Ashfield2.3 M3RESOLVEDNOTABUG
10881 1Add warning message to the esdk installer if version (build_host_gcc) > (install_host_gcc)Medium+Ed Bartosh2.3 M3RESOLVEDFIXED
10889 1Zephyr kernel tests fail to start if python module pexpect is not installedMediumJuro Bystricky2.3 M3RESOLVEDFIXED24 Jan 2017: RESOLVED
10935 0.5systemd tests should automatically be run on systemd imagesMedium+Mariano Lopez2.3 M3RESOLVEDFIXED
10942 linux-firmware-ath9k fw ver 1.4.0 in main packageMedium+Saul Wold2.3 M3RESOLVEDFIXED
10958 LIBXML2 error package requirements libxml-2.0 >= 2.6.26 on eSDKMedium+Francisco Pedraza2.3 M3RESOLVEDFIXED
10960 Using distrodata.bbclass causes task mismatch errorsMedium+Ross Burton (Arm)2.3 M3RESOLVEDFIXED
10961 1Toolchain environment variables cleaned from environment during devtool usageMedium+Paul Eggleton2.3 M3RESOLVEDFIXED
10963 0.5devtool sdk-update fails at subsequent runsMedium+Paul Eggleton2.3 M3RESOLVEDFIXED
10967 Merged commits are no longer sent to openembedded-commits MLMedium+Michael Halstead2.3 M3RESOLVEDFIXED
10970 pybootchartgui.py has not been migrated to python3MediumLeonardo Sandoval Gonzalez2.3 M3RESOLVEDWONTFIX
10971 1[meta-mingw] nativesdk-pthreads-win32 fails to build with poky master & meta-mingw masterMedium+Juro Bystricky2.3 M3RESOLVEDFIXED
10973 0.5changing state of patch fails?MediumJose Lamego2.3 M3RESOLVEDFIXED
10976 0.5Broken openssl-native symlinksHighRichard Purdie2.3 M3RESOLVEDFIXED
10978 1oeqa: add validation to avoid importing build-insMediumMariano Lopez2.3 M3RESOLVEDFIXED
10979 1testimage.bbclass: Add a check to not run tests with empty suitesMediumMariano Lopez2.3 M3RESOLVEDFIXED
10985 1Dbus recipe fails when systemd is enabledMedium+Ross Burton (Arm)2.3 M3RESOLVEDFIXED
10986 0.25Re-Enable distro_check and distrodata on Main AutobuilderMedium+Joshua Lock2.3 M3RESOLVEDFIXED
10991 eSDK: Update decoratorsMediumFrancisco Pedraza2.3 M3RESOLVEDFIXED
10999 meta-intel: Recipes multimedia:libva need to be updated to point to github upstream projectsMedium+Saul Wold2.3 M3RESOLVEDFIXED
11002 1dbus: user-session dbus.socket contains path from native sysrootMedium+Ross Burton (Arm)2.3 M3RESOLVEDFIXED
11008 poky-morty meta-networking tries to download from samba.org via HTTP and it is no longer supportedUndecidedStephano Cetola2.3 M3RESOLVEDWONTFIX
11009 2patchelf inflates filesize and causes performance problemsMedium+Stephano Cetola2.3 M3RESOLVEDFIXED
11010 1documentation for NO_RECOMMENDATIONS is incorrectUndecidedScott Rifenbark2.3 M3RESOLVEDFIXED03 Feb 2017: RESOLVED
11014 package_qa_check_dbg tries to call a dict as a functionMedium+Ross Burton (Arm)2.3 M3RESOLVEDFIXED
11019 1Fix chameleonsocks so it works with Docker Toolbox terminalMedium+Todor Minchev2.3 M3RESOLVEDFIXED
11026 1cve-check: Error in executing cve-check-updateMedium+Jussi Kukkonen2.3 M3RESOLVEDFIXED
11041 LSB 4.1: lsb_release script incompatible with busybox head and findMedium+Athanasios Oikonomou2.3 M3RESOLVEDFIXED
11052 pseudo x32 target build failsMedium+Joshua Lock2.3 M3RESOLVEDWORKSFORME
11054 1selftest: Signing packages failing on ubuntu 16.10 with gpg (GnuPG) 2.1.15Medium+Markus Lehtonen2.3 M3RESOLVEDINVALID
11069 1rpm: signing fails with too many subpackagesMedium+Markus Lehtonen2.3 M3RESOLVEDFIXED
11078 does not boot on NUCMediumMikko Ylinen2.3 M3RESOLVEDFIXED
11098 3Wikilog logs jumbled up when multiple controllers reporting to the same pageMedium+Joshua Lock2.3 M3RESOLVEDFIXED
11099 0.5nightly-wic build: Autobuilder should build wic-toolsHighJoshua Lock2.3 M3RESOLVEDFIXED
11111 3enable running oe-selftest tests in CIMediumOlev Kartau2.3 M3RESOLVEDFIXED
11123 Stripping fixincl fails in gcc-cross-arm and gcc-cross-initial-arm do_populate_sysroot on Debian 9Medium+Richard Purdie2.3 M3RESOLVEDFIXED
11270 RefKit: populate_sdk_ext fails with SDK_EXT_TYPE="minimal"MediumMikko Ylinen2.3 M3RESOLVEDFIXED
11272 RefKit: Full extensible SDK fails to installMediumMikko Ylinen2.3 M3RESOLVEDFIXED
6016 5CrossTap has issues on running scheduler script against qemuppcMediumChen Qi2.3 M4RESOLVEDDUPLICATE
6128 2Incorrect wildcard unpack behaviour in fetcherMediumAníbal Limón2.3 M4RESOLVEDOBSOLETE
6129 2Local directories unpack to a different location than local filesMediumAníbal Limón2.3 M4RESOLVEDOBSOLETE
8078 3useradd.bbclass: useradd_preinst not run when rebuilding on second MACHINEMedium+Maxin B. John2.3 M4RESOLVEDFIXED
9001 2bootimg.bbclass does not document GRUB boot lodader supportMediumScott Rifenbark2.3 M4RESOLVEDFIXED12 May 2017: RESOLVED
9349 2Jethro build fails for core-image-x11 with package_debMediumAníbal Limón2.3 M4RESOLVEDOBSOLETE
9404 3Smart will remove RECOMMENDS during a remove commandMediumRobert Yang2.3 M4RESOLVEDINVALID
9541 2Resolve string formatting issues in cmakeMediumJussi Kukkonen2.3 M4RESOLVEDFIXED
9542 1.5Resolve string formatting issues in expectMediumAlexander Kanavin2.3 M4RESOLVEDFIXED
9544 1.5Resolve string formatting issues in gettextMediumRobert Yang2.3 M4RESOLVEDFIXED
9545 1.5Resolve string formatting issues in kexec-toolsMediumJussi Kukkonen2.3 M4RESOLVEDFIXED
9660 3Create a YP-2.3 test plan for SWUpdMedium+Libertad2.3 M4RESOLVEDFIXED
10095 1Suggested documentation for the currently undocumented *_task-foo override syntaxMediumScott Rifenbark2.3 M4RESOLVEDFIXED10 April 2017: RESOLVED
10224 2oeqa/utils/sshcontrol.py:SSHProcess decode stdout data failMediumdawei2.3 M4RESOLVEDOBSOLETE
10271 3KeyError exception when pushing buildhistory failsMedium+Ross Burton (Arm)2.3 M4RESOLVEDWORKSFORME
10342 2Lots of debug noise "while parsing exportTests"MediumMariano Lopez2.3 M4RESOLVEDFIXED
10350 4devtool: deploy-target: deploy run time dependenciesMedium+Scott Rifenbark2.3 M4RESOLVEDFIXED12 April 2017: RESOLVED
10382 5master - nightly-mips-lsb failedMedium+Michael Halstead2.3 M4RESOLVEDFIXED
   500      
Warnings were generated during the execution of function
  1. Report truncated - count greater than max allowed 501 > 500

Old Milestone - Bugs Need Verification - BY OWNER (1.X)

IDQAESummary (1276 tasks) PAssigneeMilestoneStatusResolutionWhiteboard
   0      
 
580 5poky-qemu does not make proper use of CROSSPATH (breaking distcc)LowScott Garman1.4RESOLVEDOBSOLETE
970 14yocto 1.0 sato-sdk 336 errors from zypper verifyMediumMark Hatle1.4RESOLVEDINVALID
1046 Recipe gobject-introspection does not buildMediumSaul Wold1.4RESOLVEDOBSOLETEMaybe impossible, base source is needed for m4 macros (08-Aug-2011)
1138 [LTP] Some growfiles cases failed with Yocto 1.1 M1 buildLowDarren Hart1.4RESOLVEDFIXEDsuggestion is post 1.1. test cases still fail with eglibc 4.5.1(June 16)
1609 20selinux patch integrationMediumXin Ouyang1.4RESOLVEDFIXED
1870 5[DEB] meta-toolchain-gmae: do_populate_sdk failed with package_debMediumSaul Wold1.4RESOLVEDFIXED
2010 0.5Some unnecessary packages installed cause AutoBuilder built failedMedium+Michael Halstead1.4RESOLVEDFIXED(Development) Status: Tested. Estimate: 4 hours
2349 Fix rpm-based image generation to enforce sensible package install orderingMediumMark Hatle1.4RESOLVEDFIXED
2410 linux-yocto-dev kernel boot issues on qemumips64MediumBruce Ashfield1.4RESOLVEDFIXED
2430 [mpc8315e-rdb] mpc8315e-rdb core-minimal-image boot failed with 20120505 buildMediumYang Shi1.4RESOLVEDFIXED
2431 5RRECOMMENDS and RDEPENDS are basically the same with opkgMediumAndrei Gherzan1.4RESOLVEDFIXED
2486 2netbase includes init scriptMediumConstantin Musca1.4RESOLVEDFIXED4cb7c9a7ca3632c15414177e6e3ee399ad48ba08
2551 5EMGD requires video accelerationLowNitin Kamble1.4RESOLVEDFIXED(P2) Nitin: patch reivew
2669 libiconv external recipe has RPATH QA issueLowBogdan Marinescu1.4RESOLVEDFIXED
2684 Need additional information on configuring and using the PR serverMediumScott Rifenbark1.4RESOLVEDFIXED11 Feb 2013: Resolved
2712 1All BSP README files for the meta-intel BSPs should note the 10-day timer feature for unaltered imagesMedium+Beth Flanagan1.4RESOLVEDFIXED
2759 qt4-native-4.8.1-r14.1 build error with long TMPDIR: initializer-string for array of chars is too long [-fpermissive]MediumPaul Eggleton1.4RESOLVEDFIXED
2790 unpatched make 3.82 breaks eglibc-initialMediumScott Rifenbark1.4RESOLVEDFIXED8 Feb 2013: Resolved
2810 rpcbind: Could we replace portmap with rpcbindLowCristian Iorga1.4RESOLVEDFIXED9a1c99916bfc8b599e1fd567b0a61b979576b254
2827 Cross-debugging instructions not really effectiveMediumScott Rifenbark1.4RESOLVEDFIXED21 March 2013 - Resolved/Fixed
2837 update lttng UST to 2.0MediumPaul Barrette1.4RESOLVEDFIXED
2843 glib-2.0-native: do_compile failed if no python-xml installed, on SLED11.2MediumScott Rifenbark1.4RESOLVEDFIXED28 Nov 2012 - RESOLVED
2856 meta-intel: gnupg version out of sync with poky layerLowDarren Hart1.4RESOLVEDOBSOLETE(autobuilder)
2874 [Autobuilder] Killing triggered builds via the autobuilder is painfulMediumBeth Flanagan1.4RESOLVEDFIXED
2880 Building bash 4.2 on beagleboard fails with gcc version 4.7.1 and throwing an error message gcc:internal compiler error : Segmentation fault (program cc1).MediumRadu Moisan1.4RESOLVEDWORKSFORME
2881 Under pseudo rm of files > 2GB fail with errno 75 = Value too large for defined data typeMediumSeebs1.4RESOLVEDFIXED
2909 devshell documentation obsoleteMediumScott Rifenbark1.4RESOLVEDFIXED27 Nov 2012 - Resolved
2915 Don't use /usr/libexecMediumSaul Wold1.4RESOLVEDFIXED(patch review)
3021 The Yocto.bc.ui plugin should not depend on JDT UIMediumJessica1.4RESOLVEDFIXED
3050 linux-yocto-3.0 Kernel is not being tested with 1.3 Poky branchesMediumLaurentiu Serban1.4RESOLVEDFIXED
3068 [FRI2]MMC detection FastBoot firmwareMedium+Darren Hart1.4RESOLVEDINVALID
3084 PolicyKit support should be a distro featureMediumRoss Burton (Arm)1.4RESOLVEDOBSOLETE
3092 PR goes backwards with PR-server enabledMedium+Constantin Musca1.4RESOLVEDWORKSFORME
3139 opkg package name which don't match the regular expression [a-z0-9.+-]\+ will fail while do_package_write_ipkMediumConstantin Musca1.4RESOLVEDFIXED86204fbc69197ac113a5c8429a6c330bad560cee
3154 gdk-pixbuf-native cannot build without X11 on the host systemMediumLaurentiu Palcu1.4RESOLVEDFIXED
3177 String literal parser too greedyMediumRichard Purdie1.4RESOLVEDFIXED
3187 Useless suggestion when version not foundMediumRichard Purdie1.4RESOLVEDFIXED
3191 Install-conflict message could be a lot more usefulMediumSaul Wold1.4RESOLVEDFIXED
3193 [HOB] Key / Values format check before savingMediumJessica1.4RESOLVEDDUPLICATE
3216 Race for /usr/share/aclocal in sysrootMediumRichard Purdie1.4RESOLVEDFIXEDRelease note (patch out for review, likely master only)
3219 arm tune files share the same TUNE_PKGARCH with different TUNE_CCARGSMediumRichard Purdie1.4RESOLVEDFIXED
3220 sstate: fetcher should download sstate packages directly to right prefixMediumRichard Purdie1.4RESOLVEDFIXED
3225 linux-yocto SRCPV is changed after every MACHINE switchMediumConstantin Musca1.4RESOLVEDFIXED
3232 autoconf-2.69 segfaults since it was upgraded in oe-coreMediumSaul Wold1.4RESOLVEDWORKSFORME
3238 5crownbay: build has warningsMediumNitin Kamble1.4RESOLVEDFIXED
3249 xf86-video-intel: needs updatingMediumLaurentiu Palcu1.4RESOLVEDFIXED
3250 Fetcher errors when looking for sstate package in do_package_write_ipk_setsceneMediumRichard Purdie1.4RESOLVEDWORKSFORME
3262 Glossary entry for "STAMP" variable doesn't match the softwareMediumScott Rifenbark1.4RESOLVEDFIXED15 Nov 2012 - resolved
3267 apr and apr-util config scripts produce incorrect pathsMediumSaul Wold1.4RESOLVEDFIXED
3280 meta-cedartrail: Clutter on OpenGL fails to initializeMedium+Rahul Saxena1.4RESOLVEDINVALID
3284 bitbake -c menuconfig doesn't check errors returned by make menuconfigMediumRichard Purdie1.4RESOLVEDDUPLICATE
3287 qemugl still being installed into x86 imagesMediumRichard Purdie1.4RESOLVEDFIXED
3289 1building an image for emenlow BSP produces warningsMediumNitin Kamble1.4RESOLVEDFIXED
3292 *_FEATURES variables documentation is inadequateMediumScott Rifenbark1.4RESOLVEDFIXED11 Feb 2013 - resolved/fixed
3295 2meta-intel BSPs: mesa_demos compile error on autobuilderMedium+Nitin Kamble1.4RESOLVEDFIXED
3307 Cannot disable "already stripped" warningMediumRobert Yang1.4RESOLVEDNOTABUG
3312 glib-2.0 fails to build in a multimachine tmpdirMediumSaul Wold1.4RESOLVEDNOTABUG
3315 Confusing error message if build/tmp/deploy is deleted between runsLowRichard Purdie1.4RESOLVEDFIXED
3324 'x11' not in DISTRO_FEATURES while building BARYONMediumPaul Eggleton1.4RESOLVEDFIXED
3330 cannot compile sudoku project using a user build toolchain for denzilMediumJessica1.4RESOLVEDNOTABUG
3337 Running sanity test for qemuarm core-image-minimal failedLowYi Zhao1.4RESOLVEDOBSOLETE
3340 python-setuptools fails to buildMediumSaul Wold1.4RESOLVEDWORKSFORME
3344 git: unpackaged python files in git_remote_helpersMediumSaul Wold1.4RESOLVEDFIXED
3348 5sugarbay: video doesn't work after vaapi upgradeMedium+Nitin Kamble1.4RESOLVEDFIXED
3356 press “ctrl+c” in vncviewer lead to standard input(keyboard) doesn't work correctly when running x11vnc by terminalMediumLaurentiu Palcu1.4RESOLVEDNOTABUG
3365 [meta-cedartrail] cdv-pvr-driver fails to re-installMediumRahul Saxena1.4RESOLVEDOBSOLETE
3368 5emenlow kernel prints lot of messages while running glxgearsMediumNitin Kamble1.4RESOLVEDFIXED
3370 guile-native cannot be restored from sstateMedium+Ross Burton (Arm)1.4RESOLVEDFIXED(Patch Review)
3373 3meta-intel: VA_FEATURES unnecessarily causes X11 dependency via libvaMediumNitin Kamble1.4RESOLVEDFIXEDpatch reivew
3386 adt-installer points to non-existent repositoryMediumJessica1.4RESOLVEDNOTABUG
3390 Different PACKAGE_ARCH in recipe only for some package or MACHINE causes missing ipk files in deployMediumRichard Purdie1.4RESOLVEDFIXED
3394 Different all architecture for some packagegroup recipes when building for e.g. arm and x86MediumPaul Eggleton1.4RESOLVEDFIXED
3395 Wrong paths in eglibc-initial sstate manifestMediumSaul Wold1.4RESOLVEDFIXED
3399 [cedartrail] unable enter UI Interface, have x-server init errorMedium+Rahul Saxena1.4RESOLVEDWONTFIX
3400 [cedartrail] unable enter UI Interface, have x-server init errorMedium+Rahul Saxena1.4RESOLVEDDUPLICATE
3409 meta-toolchain-qte fails to find c++ headers when relocatedMediumLaurentiu Palcu1.4RESOLVEDFIXED
3422 Correct commentary and possibly code assumptions about the existence of KMETAMediumBruce Ashfield1.4RESOLVEDFIXED
3445 development manual lacks mentioning that eclipse need pde plugin installed.MediumScott Rifenbark1.4RESOLVEDFIXED28 Nov 2012 - RESOLVED
3456 Provide Build/Host information to "Build configuration" summaryLowRichard Purdie1.4RESOLVEDFIXED
3460 python-pygtk: do_compile failed when parallel buildingMediumBogdan Marinescu1.4RESOLVEDFIXED
3461 FLAC text relocation warningsMediumRoss Burton (Arm)1.4RESOLVEDFIXED(Patch Review)
3464 binutils-native-2.22-r17: do_compile failed on ubuntu 12.10MediumHongxu Jia1.4RESOLVEDOBSOLETE
3469 1mesa-demos fail to build if using other GL libraryMediumRoss Burton (Arm)1.4RESOLVEDFIXED
3474 RPM -dev packages with pkgconfig files depend on pkgconfigMedium+Bogdan Marinescu1.4RESOLVEDWORKSFORME
3479 bitbake hangs while building pseudoMediumRichard Purdie1.4RESOLVEDNOTABUG
3482 1A lot of -dbg packages don't get installed on beagleboard platformMediumMing Liu1.4RESOLVEDFIXED
3484 do_package_write_* reexecuted on checksum change even with OEBasicMediumRichard Purdie1.4RESOLVEDFIXED
3499 neon-native package build hangs at do_configureMediumSaul Wold1.4RESOLVEDFIXED
3500 Host user not recognized when building meta-toolchain-sdkMediumLaurentiu Palcu1.4RESOLVEDFIXED
3514 Doesn't checks if the kernel fits in the memoryMediumMichel Thebeau1.4RESOLVEDFIXED
3521 Warnings from sstate overwriting files in sysrootMediumRichard Purdie1.4RESOLVEDFIXED
3528 [qemuarm] runqemu qemuarm throwing few errors on consoleMediumAndrei Dinu1.4RESOLVEDFIXED
3530 meta-baryon:Can't create baryon-image.MediumKevin Strasser1.4RESOLVEDFIXED
3534 incremental RPM generation does not workMediumRobert Yang1.4RESOLVEDINVALID
3551 bitbake -c populate_sdk core-image-minimal fails due to missing dependency of bashMediumPaul Eggleton1.4RESOLVEDFIXED
3552 The FILESEXTRAPATHS variable needs a more accurate description.MediumScott Rifenbark1.4RESOLVEDFIXED11 Feb 2013: Resolved
3554 "all" tasks don't affect all packages?MediumRichard Purdie1.4RESOLVEDNOTABUG
3555 non-GPLv3 build failsMediumSaul Wold1.4RESOLVEDDUPLICATE
3561 bitbake: vardeps aren't obeyed for functions run from non-task-contextMediumRichard Purdie1.4RESOLVEDFIXED
3565 [multilib] avoid creating multilib variants for allarch recipesMediumConstantin Musca1.4RESOLVEDFIXED1674541ed83fa4645f2e078f65fe0f878527ee6e
3568 kernel-dev should be excluded for multilib and possibly x32MediumConstantin Musca1.4RESOLVEDFIXED1674541ed83fa4645f2e078f65fe0f878527ee6e
3594 Add tmux support in devshellLowChristopher Larson1.4RESOLVEDFIXED
3596 cogl fails to build on arm - world buildsMediumLaurentiu Palcu1.4RESOLVEDFIXED
3597 sat-solver failes to build for arm worldMediumBogdan Marinescu1.4RESOLVEDFIXED
3616 buildhistory triggers an error if a package URI is changed and versions are the sameMediumConstantin Musca1.4RESOLVEDWORKSFORME
3620 bibake doesn't reparse the recipes after task dependency update in bbclassMediumRichard Purdie1.4RESOLVEDWORKSFORME
3622 select preferred provider for multiple runtime providersMediumRichard Purdie1.4RESOLVEDNOTABUG
3626 building cairo-native failed on ubuntu 11.10MediumSaul Wold1.4RESOLVEDNOTABUG
3627 lsb image build fails with error: Can't install libz-dev-1.2.7-r0@i586: no package provides pkgconfigMedium+Paul Eggleton1.4RESOLVEDDUPLICATE
3628 sudoku-savant configure failed on toolchain installed by adt_installer (nightly build 20121219-5)MediumJessica1.4RESOLVEDWORKSFORME
3632 8[Autobuilder] fri2-noemgd build failed on autobuilder due to stale NFS HandleMediumMichael Halstead1.4RESOLVEDFIXED
3640 sanity.bbclass sometimes failing to find saved_tmpdir when tmp-eglibc was deletedMediumRichard Purdie1.4RESOLVEDFIXED
3644 [Matchbox]Click multiple times on the “stroke recogniser” icon lead to process waste and memory leakMediumRoss Burton (Arm)1.4RESOLVEDOBSOLETE
3645 Using wrong data when 2 recipes provide same runtime packageMediumRichard Purdie1.4RESOLVEDFIXED
3661 In variable glossary, definition of FILESPATH is incorrectMediumScott Rifenbark1.4RESOLVEDFIXED29 Jan 2013: Resolved
3662 Some layer-related variables need adding/editing in the variable glossaryMediumScott Rifenbark1.4RESOLVEDFIXED11 April 2013
3663 Ch 4 refers to meta-intel layer as if it's essential for the upcoming workMediumScott Rifenbark1.4RESOLVEDFIXED29 Jan 2013: In progress review
3664 If bbappend file is not adding any files, point out no need to prepend to FILESEXTRAPATHSMediumScott Rifenbark1.4RESOLVEDFIXED1 Feb 2013: needs review
3666 Missing procps package in sato and sato-sdk imageMediumSaul Wold1.4RESOLVEDNOTABUG
3668 [Autobuilder] directfb fail for qemux86MediumLaurentiu Palcu1.4RESOLVEDWORKSFORME
3676 PulseAudio build problemsMediumConstantin Musca1.4RESOLVEDFIXED
3681 smart: Can't install multilib gcc into rootfsMediumBogdan Marinescu1.4RESOLVEDFIXED
3684 The default signature handler is not correct in ref manualMediumScott Rifenbark1.4RESOLVEDFIXED12 Feb 2013: Needinfo
3698 [Autobuilder] meta-intel builds failed, missing provider for xorg-abi-video-8MediumLaurentiu Palcu1.4RESOLVEDWORKSFORME
3717 oprofile on PPC needs libpfmHighMatthew McClintock1.4RESOLVEDFIXED
3728 page numbers not visible in printed manualsLowScott Rifenbark1.4RESOLVEDFIXED11 Feb 2013: Resolved
3730 0.25Compliance link in meta-bsp_name README is broken.LowNitin Kamble1.4RESOLVEDFIXED
3741 deb packages problem on arm (gnueabi) architectureMediumConstantin Musca1.4RESOLVEDFIXED9d076dcba1531686241dab62ff0f973537d40ca6
3749 populate_sdk keeps pulling in ssh_dropbearMediumRichard Purdie1.4RESOLVEDFIXED
3750 harfbuzz: license warningsLowBeth Flanagan1.4RESOLVEDFIXED
3754 bind: nslookup is not shipped, its man page should not be shipped as wellLowWenzong.Fan1.4RESOLVEDFIXED
3770 populate_sdk_base.bbclass: cannot install 32 bit SDK on 64 bit hostMediumLaurentiu Palcu1.4RESOLVEDFIXED
3793 Missing /etc/init.d directory while using jffs2 imagesMediumSaul Wold1.4RESOLVEDNOTABUG
3794 add more BSPs to meta-intel targetMediumBeth Flanagan1.4RESOLVEDFIXED
3796 [Autobuilder] harfbuzz fails to compile on ARM and MIPSMediumLaurentiu Palcu1.4RESOLVEDWORKSFORME
3797 [Autobuilder] qemuimage-testlib causes build failureLowDarren Hart1.4RESOLVEDDUPLICATE
3798 [AUtobuilder] nightly-x86-64-lsb build fails due to rsync errorMediumMichael Halstead1.4RESOLVEDWORKSFORME
3814 FRI2 audio playback is brokenLowDarren Hart1.4RESOLVEDFIXED
3815 connman-gnome: fails to configure due to missing dependency to intltool-nativeMediumMing Liu1.4RESOLVEDFIXED
3818 [autobuilder] qemux86-world: qt-x11-free-native fails to compileMediumLaurentiu Palcu1.4RESOLVEDWORKSFORME
3820 missing dependency on libudev.ro while building with pam enabled and systemdMediumBogdan Marinescu1.4RESOLVEDWORKSFORME
3822 qmmp compile failureMedium+Paul Eggleton1.4RESOLVEDFIXED
3825 netcat-openbsd do_compile failed with dependency errorLowZhu Yanjun1.4RESOLVEDINVALID
3827 sstate: some native sstate files can't be re-used between mips and other archsMediumRichard Purdie1.4RESOLVEDFIXED
3831 meta/recipes-bsp/v86d/v86d_0.1.10.bb SRC_URI outdatedMediumAndy Dalton1.4RESOLVEDFIXED
3834 bitbake requires whitespace before +=MediumRichard Purdie1.4RESOLVEDFIXEDA candidate for 1.3.3
3835 meta-toolchain is failing to buildMediumBogdan Marinescu1.4RESOLVEDFIXED
3838 Alternatives Section 7.3 obsoleteMediumScott Rifenbark1.4RESOLVEDFIXED6 Feb 2013: resolved
3841 apr-util-native do_compile fails when using ccache-nativeMediumRoss Burton (Arm)1.4RESOLVEDWORKSFORME
3857 ERROR: Package version for package matchbox-wm-staticdev went backwards which would break package feedsMediumBeth Flanagan1.4RESOLVEDFIXEDautobuilder
3859 valgrind configuration isn't deterministicMediumBogdan Marinescu1.4RESOLVEDOBSOLETE
3878 arm-oe-linux-gnueabi-ld: unrecognized option '-Wl,-O1'MediumBogdan Marinescu1.4RESOLVEDFIXED
3881 When smart is installed on the host system, failures can occur when using smart-native to construct filesystemsMediumBogdan Marinescu1.4RESOLVEDFIXED
3891 adt-installer fails to build due to failed kconfig-frontends-native configureMediumJessica1.4RESOLVEDFIXED
3905 ipkg/opkg data does not track dependency on version numbersMediumRichard Purdie1.4RESOLVEDWORKSFORME
3912 Warning: avahi: Files/directories were installed but not shippedMediumCristian Iorga1.4RESOLVEDDUPLICATE
3920 Recipe for meta-toolchain creates an environment script with bad LDFLAGSMediumRichard Purdie1.4RESOLVEDNOTABUG
3926 Parse error isn't handled correctlyMedium+Christopher Larson1.4RESOLVEDFIXED
3943 Binutils compile failureMediumKhem Raj1.4RESOLVEDFIXED
3944 syslinux.bbclass needs some work to add serial support and a real menuMediumJason Wessel1.4RESOLVEDFIXED
3945 connman-properties gives segfaultMediumMihai Prica1.4RESOLVEDFIXED
3970 Runtime initialization error: Cannot create link over existing -/tmp-.MediumChen Qi1.4RESOLVEDFIXED
4023 Missing g77 and gfortran in toolchain sdkMediumLaurentiu Palcu1.4RESOLVEDFIXED
4038 2util-linux: systemd unit files installed but not shippedMediumChen Qi1.4RESOLVEDFIXED
4042 The Qemu Kernel path from Preferences is marked as changed while typing only if there was a wrong path beforeLowJessica1.4RESOLVEDFIXED
4049 The man page for bitbake does not include the -u optionLowRichard Purdie1.4RESOLVEDFIXED21 March 2013 - reviewed
4051 bitbake world has error on qemumips. alsa/alsa-tools_1.0.26.1.bb compile failed.MediumSaul Wold1.4RESOLVEDFIXED
4054 No hg support in bb-filesMediumRichard Purdie1.4RESOLVEDNOTABUG
4066 iptables: autoconf warningsMediumLaurentiu Palcu1.4RESOLVEDFIXED
4067 The 'Open my images' dialog should be modalMediumAndrei Dinu1.4RESOLVEDWONTFIX
4077 possible issue with new stat cachingMediumRichard Purdie1.4RESOLVEDWORKSFORME
4086 TCMODE = "external-linaro" shows" ERROR: QA Issue: No GNU_HASH in the elf binary ...."Medium+Marcin Juszkiewicz1.4RESOLVEDINVALID
4136 libudev-dev not installed in sdkMediumPaul Eggleton1.4RESOLVEDFIXED
5370 elfutils fails to build for Ubuntu 13.10, AMD 64. for QEMU64 demoMediumPaul Eggleton1.4RESOLVEDFIXED
3175 2failed to build image on vmware with build-applianceMediumCristian Iorga1.4 M1RESOLVEDFIXEDCommit: d4a4d00fb6961d3db8db6e8794066fdc29a79c46
3257 2EMGD installs duplicate libraries instead of symlinksMediumNitin Kamble1.4 M1RESOLVEDFIXEDreview
3258 2EMGD should package MIX separatelyMediumNitin Kamble1.4 M1RESOLVEDDUPLICATE
3347 3[FRI2]Xorg server fails to start with runlevel 5MediumDarren Hart1.4 M1RESOLVEDWORKSFORME
3451 [p1022ds] Some error messages with dmesgMediumMatthew McClintock1.4 M1RESOLVEDDUPLICATE
2461 4list_installed_packages seems to retrieve incomplete list.MediumBeth Flanagan1.4 M2RESOLVEDFIXED(Pending)
2563 4[Build Appliance] - Virtual machine does not shut down cleanly with "shutdown -h now"MediumAndrei Dinu1.4 M2RESOLVEDWORKSFORME
2758 1Update the output folder name of eclipse plugin from indigo to junoMediumBeth Flanagan1.4 M2RESOLVEDFIXED
3311 core-image-minimal does not boot when built with poky-tinyMedium+Saul Wold1.4 M2RESOLVEDDUPLICATE
3408 TMPDIR cannot contain ../MediumSaul Wold1.4 M2RESOLVEDFIXED
3476 Autobuilder failing on fsl-ppcMedium+Matthew McClintock1.4 M2RESOLVEDFIXED(autobuilder)
3495 [romley] xf86-video-mga fails to configureMediumRoss Burton (Arm)1.4 M2RESOLVEDFIXED(autobuilder)
3503 additions to IMAGE_INSTALL_append go unnoticedMedium+Richard Purdie1.4 M2RESOLVEDFIXED
3545 Autobuilder fail for python-smartpm under qemux86Medium+Bogdan Marinescu1.4 M2RESOLVEDFIXED(autobuilder)
3546 Autobuilder fails for util-linux under qemux86Medium+Saul Wold1.4 M2RESOLVEDFIXED(autobuilder)
3550 Errors appear in eclipse when debugging and using a relocated SDKMedium+Jessica1.4 M2RESOLVEDWORKSFORME
3556 udev fails to settle on atom-pcMedium+Alexandru Damian1.4 M2RESOLVEDINVALID
3558 guile fails to compile in world build - maybe parallelism issueMedium+Bogdan Marinescu1.4 M2RESOLVEDFIXED
3571 Home Smart icon does not workMedium+ 1.4 M2RESOLVEDFIXED
3572 QT/Phonon integration on imx.6Medium+ 1.4 M2RESOLVEDFIXED
3584 lsbinitscripts build breaks due to referencing build host filesMediumSaul Wold1.4 M2RESOLVEDFIXED
3589 lttng-modules crashes while doing do_make_scripts taskMedium+Tom Zanussi1.4 M2RESOLVEDFIXED
3610 kconfig-frontends fails with newer autoconfMediumSaul Wold1.4 M2RESOLVEDWORKSFORME
3617 meta-fsl-arm: X11 widows manager is not working properlyMedium+Otavio Salvador1.4 M2RESOLVEDWORKSFORME
3623 meta-toolchain build error: Can't install libpng-dev-1.5.13-r0Medium+Bogdan Marinescu1.4 M2RESOLVEDWORKSFORME
3624 [Autobuilder] nightly-fsl-arm failed to build on autobuilderMediumBeth Flanagan1.4 M2RESOLVEDFIXED
3625 [Autobuilder] fail for qt-x11-free-3.3.5 on nightly-mips-lsbMedium+Saul Wold1.4 M2RESOLVEDFIXED
3208 5Enable GMA500 for -noemgd meta-intel BSPsMediumNitin Kamble1.4 M3RESOLVEDFIXED
3411 Preserve siginfo filesMedium+Paul Eggleton1.4 M3RESOLVEDFIXED
3418 2Update meta-data to use explicit scc references onlyLowBruce Ashfield1.4 M3RESOLVEDFIXED
3615 /unit_tests/mxc_epdc_x11_fb_test.out will not work for imx6Low 1.4 M3RESOLVEDFIXED
3653 adt_installer.tar.bz2 missed with nightly build 20121226-1Medium+Beth Flanagan1.4 M3RESOLVEDWORKSFORME
3667 [Autobuilder] avahi fail on nightly-fsl-armMediumOtavio Salvador1.4 M3RESOLVEDFIXEDautobuilder
3679 libtelepathy is not using python-native while buildingMediumCristian Iorga1.4 M3RESOLVEDFIXED0624d147f2a0edc5cab39278972db66e48db95f0
3699 [Autobuilder] cedartrail: no package provides perl(IPC::Open2)MediumPaul Eggleton1.4 M3RESOLVEDFIXEDPatch sent for review
3753 rpm2cpio fails to unpack emgd 1.16 binary rpmsMedium+Saul Wold1.4 M3RESOLVEDFIXED
1094 2module.bbclass is well out of sync with the version in openembeddedLowDarren Hart1.4 M4RESOLVEDWONTFIX
2773 2[multilib] no provider for lib64-perf/lsb-imageMediumTom Zanussi1.4 M4RESOLVEDWORKSFORME
2821 libowl do_fetch errorMedium+Michael Halstead1.4 M4RESOLVEDWORKSFORME
3227 connman sanity tests fail (autobuilder)Medium+Cristian Iorga1.4 M4RESOLVEDFIXED
3397 /var/log and /var/cache should not be on volatile storage (tmpfs)MediumChen Qi1.4 M4RESOLVEDNOTABUG
3415 1Only print kernel_configcheck warnings with a verbose settingMediumBruce Ashfield1.4 M4RESOLVEDFIXED
3421 3Cleanup standard-nocfg.sccMediumBruce Ashfield1.4 M4RESOLVEDFIXED
3447 3Configure oprofile to use 'operf' perf_events mode rather than legacy modeMedium+Tom Zanussi1.4 M4RESOLVEDFIXEDpatchset posted to oe-core maling list
3563 glib-2.0-native:do_configure failed with gcc version 4.3.4 on x86MediumHongxu Jia1.4 M4RESOLVEDFIXED
3611 sysv init scripts does not regard the kernel command line parametersMediumChen Qi1.4 M4RESOLVEDNOTABUG
3612 sysv init scripts don't take the consistent format.MediumChen Qi1.4 M4RESOLVEDNOTABUG
3614 3usb3 boot not supportedMedium+Nitin Kamble1.4 M4RESOLVEDINVALID
3725 guilt: unsupported version of git (1.8.0.2)MediumBruce Ashfield1.4 M4RESOLVEDFIXED
3726 [Autobuilder] valgrind: Can't install valgrind-3.7.0-r8@x86_64: no package provides libmpi.so.1MediumPaul Eggleton1.4 M4RESOLVEDFIXEDPatch sent for review
3731 2yocto-bsp creates kernel bbappend files that override settings even when other machines are activeMediumTom Zanussi1.4 M4RESOLVEDFIXED
3756 2crosstap and stap fail in core-image-sato-sdk (pre 1.4M3)MediumTom Zanussi1.4 M4RESOLVEDFIXED
3764 2[Autobuilder] Missing provider for libva-intel-driverMediumNitin Kamble1.4 M4RESOLVEDFIXED
3768 0.5smart: --yaml option doesn't workMediumPaul Eggleton1.4 M4RESOLVEDFIXED
3775 0.25Kernel recipe fails for sys940x on the autobuilderUndecidedNitin Kamble1.4 M4RESOLVEDFIXED
3776 2core-image-lsb-sdk image build for crownbay BSP fails on emgd installMedium+Nitin Kamble1.4 M4RESOLVEDFIXED
3779 0.5core-image-lsb-sdk USB boot failedMediumNitin Kamble1.4 M4RESOLVEDDUPLICATE
3784 Inconsistency in the SDK produced by OE/YoctoMediumLaurentiu Palcu1.4 M4RESOLVEDFIXED
3785 kernel build for cedar-trail bsp is failingMedium+Rahul Saxena1.4 M4RESOLVEDWONTFIX
3787 unable to build external kernel modules with linux-yocto 3.4Medium+Darren Hart1.4 M4RESOLVEDFIXED
3790 [Autobuilder] Multiple build failures due to perl not being providedMedium+Darren Hart1.4 M4RESOLVEDDUPLICATE
3791 [Autobuilder] unable to install perf due to perl module issueMediumPaul Eggleton1.4 M4RESOLVEDDUPLICATE
3792 Missed development packages using IMAGE_FEATURES+="dev-pkgs"MediumPaul Eggleton1.4 M4RESOLVEDFIXED
3799 [Autobuilder] nightly-x86-64 dmesg sanity failed (modprobe gpf)Medium+Darren Hart1.4 M4RESOLVEDFIXED
3802 5udev provided by systemd always installed regardless of the init managerMediumChen Qi1.4 M4RESOLVEDNOTABUG
3803 [AUtobuilder] multiple build failures due to errors in kernel-side packagingMediumSaul Wold1.4 M4RESOLVEDFIXED
3806 [Autobuilder] qemux86-64 "general protection fault" after system haltMedium+Darren Hart1.4 M4RESOLVEDFIXED
3810 FRI2 BSP hits kernel BUG while bootingMediumNitin Kamble1.4 M4RESOLVEDFIXED
3811 [autobuilder] qemuppc - do_patch fails for linux-yocto_3.4Medium+Bruce Ashfield1.4 M4RESOLVEDWORKSFORME
3832 SDK is broken now after enabling multilib for gcc on targetMediumConstantin Musca1.4 M4RESOLVEDFIXED898a8094b1dcffc5ee54dbb612477c9bb3b8fd4b
3839 [Test Case 378] Relocatable SDK - C - build Hello World GTK C Autotols ProjectMedium+Laurentiu Palcu1.4 M4RESOLVEDFIXED
3840 have pulseaudio-server postinstall run on hostMediumLaurentiu Palcu1.4 M4RESOLVEDFIXED
3846 1X fails to start for fri2-noemgd BSPMediumNitin Kamble1.4 M4RESOLVEDFIXED
3855 Autobuilder: build-appliance-image-1.0-r19: task do_rootfs: FailedHighLaurentiu Palcu1.4 M4RESOLVEDFIXEDautobuilder
3858 mips: Segmentation fault qemuwrapperHighLaurentiu Palcu1.4 M4RESOLVEDDUPLICATEautobuilder
3863 rootfs generation failing at this point: Running intercept scripts: Executing update_font_cacheHighLaurentiu Palcu1.4 M4RESOLVEDDUPLICATEautobuilder
3872 Multiple scripts directories causes infinite oe-core/scripts/bitbake loopMediumSaul Wold1.4 M4RESOLVEDFIXED
3874 Overrides are evaluated for primary and multilib configuration, causing potential conflictsMedium+Richard Purdie1.4 M4RESOLVEDFIXED
3893 gconftool fails due to invalid character '+' during populate-sdkMedium+Laurentiu Palcu1.4 M4RESOLVEDFIXED
4432 mc: cannot open /usr/lib/mc/mc/extfs.d directoryMediumPaul Eggleton1.4.2RESOLVEDFIXED
4522 danny: After building an image, Hob reports the estimated image size in the "Edit Packages" screenLowCristiana Voicu1.4.2RESOLVEDWONTFIX
4565 Could NOT find Qt4 (missing: QT_RCC_EXECUTABLE QT_INCLUDE_DIR QT_LIBRARY_DIR QT_QTCORE_LIBRARY) (found version "4.8.1")LowPaul Eggleton1.4.2RESOLVEDFIXED
4588 Missing symlink to /etc/init.d/functions.initscripts on first bootMediumSaul Wold1.4.2RESOLVEDNOTABUG
4629 Change of DISTRO_VERSION breaks nativesdk recipesMediumLaurentiu Palcu1.4.2RESOLVEDWONTFIX
4897 gstreamer QA relocation warnings on dylanMediumCristian Iorga1.4.2RESOLVEDWORKSFORME
4899 External toolchain does not work with poky dylanHighChristopher Larson1.4.2RESOLVEDDUPLICATE
4908 External toolchain does not work with poky dylanMedium+Paul Eggleton1.4.2RESOLVEDFIXED
5039 [Yocot 1.4.2] [ADT] ARM: target arch change from armv5te to armv7a-vfp-neonMediumPaul Eggleton1.4.2RESOLVEDWONTFIX
5040 [Yocto 1.4.2] runqemu: Could not initialize SDL(No available video device) for core-image-sato on Fedora 19MediumPaul Eggleton1.4.2RESOLVEDFIXEDRelease Note 1.4.2
5053 Error when building packages.Medium+Cristiana Voicu1.4.2RESOLVEDFIXED
5339 Generated toolchain not working outside default installation pathMedium+Laurentiu Palcu1.4.2RESOLVEDFIXED
5355 systemd[1]: Failed to mount /run: No such file or directoryHighRoss Burton (Arm)1.4.2RESOLVEDOBSOLETE
5934 ADT installer package error with build 20140306-3(1.4.3 dylan branch)Medium+Beth Flanagan1.4.3RESOLVEDFIXED
5937 [QEMUX86]g++ project compilation failsMediumLaurentiu Palcu1.4.3RESOLVEDINVALID
5938 [QEMUX86]gcc project compilation failMediumLaurentiu Palcu1.4.3RESOLVEDINVALID
5952 ADT-installer: using gcc to build c projects failed under ppc architecture with build 1.4.3(2014-03-06)MediumLaurentiu Palcu1.4.3RESOLVEDWONTFIX
6008 All layers can be removedMediumCristiana Voicu1.4.3RESOLVEDFIXED
6038 [dylan] qemux86-64 v86d segfault at initMediumScott Rifenbark1.4.3RESOLVEDWORKSFORME
6058 [1.4.3] make version 3.82 may be wrong in BAMedium+Beth Flanagan1.4.3RESOLVEDFIXED
917 1mediatomb fails to start, can't find libjs.soLowRoss Burton (Arm)1.5RESOLVEDFIXEDDemo layer, needs owner (30-Jun-2011)
1706 disabling package management is not describedMediumScott Rifenbark1.5RESOLVEDFIXED8 May 2013
1881 3[DEB] Fix Debian package feedsMediumSaul Wold1.5RESOLVEDFIXED
1913 1need to abstract building msdos images into an msdosfs.bbclass to share the codeLowDarren Hart1.5RESOLVEDFIXED
1914 modify the tune files of ppc targetsLowKhem Raj1.5RESOLVEDFIXED
2318 4Web is really quite badMediumRoss Burton (Arm)1.5RESOLVEDFIXED21 March 2014: Reset documentation flag to "No"
2524 building meta-toolchain for armv7ahf failedMediumKhem Raj1.5RESOLVEDOBSOLETE
2855 [mpc8315e-rdb] udevadm settle - timeout of 180 seconds reachedMediumBruce Ashfield1.5RESOLVEDFIXED
2894 rpm mishandling pkg_postinstMediumMark Hatle1.5RESOLVEDFIXED
3197 Changes to the 'Image types' tab in the 'Advanced configuration' dialogMedium+valentin1.5RESOLVEDFIXED
3393 Build fails when using Sourcery CodeBench Lite for ARM toolchain with multiple providers errorsMediumChristopher Larson1.5RESOLVEDWONTFIX
3449 archiver doesn't interact well with sstateMediumChristopher Larson1.5RESOLVEDFIXED
3781 i.MX6Q: mfw_isink ProblemMediumOtavio Salvador1.5RESOLVEDFIXED
3823 git-native depends on gettextMediumSaul Wold1.5RESOLVEDFIXED
3947 GCC + eglibc + Texinfo5.0+Medium+Khem Raj1.5RESOLVEDFIXED
3969 Add QA warning for shipping /usr/share/info/dirMediumMihai Prica1.5RESOLVEDFIXED
4061 matchbox-panel assertion failureMediumRoss Burton (Arm)1.5RESOLVEDFIXED
4062 matchbox-desktop - Icon warnings during startupMediumRoss Burton (Arm)1.5RESOLVEDFIXED
4108 beagleboard-sato-sdk, video player could not show menu button clearlyMediumRoss Burton (Arm)1.5RESOLVEDFIXED
4149 start x11vnc on beagleboard, use a host access vncviewer, the keyboard "Caps Lock" could not workLowLaurentiu Palcu1.5RESOLVEDFIXED
4185 /unit_tests/akiyo.mp4 is missingLowDaiane1.5RESOLVEDFIXED
4232 opkg doesn't invoke prerm when upgradingMediumRoss Burton (Arm)1.5RESOLVEDWONTFIX
4239 pulseaudio changes directory in do_compileMediumRoss Burton (Arm)1.5RESOLVEDFIXED
4248 Host gcc 4.8 issues (gcc-cross-initial do_compile failure)Medium+Bogdan Marinescu1.5RESOLVEDFIXEDRelease note for 1.4
4252 Wiki editing help page seems brokenMediumMichael Halstead1.5RESOLVEDFIXED
4286 recipes that provide kernel modules need to provide packages that begin with 'kernel-module-'MediumYang Shi1.5RESOLVEDFIXED
4309 Unpackaged file warnings for systemd units when systemd disabledMediumRadu Moisan1.5RESOLVEDFIXED
4312 systemd system freezes on shutdownMediumRadu Moisan1.5RESOLVEDWORKSFORME
4338 bitbake hangs forever before showing any outputMediumRichard Purdie1.5RESOLVEDFIXED
4340 qemumips: colors in sato image do not look rightMediumLaurentiu Palcu1.5RESOLVEDFIXED
4345 Shutdown icon doesn't work with rootless XMediumLaurentiu Palcu1.5RESOLVEDFIXED
4359 Intermittent timeout during sanity testsMediumBeth Flanagan1.5RESOLVEDFIXED
4374 SERIAL_CONSOLES creates entries in inittab which do not have a unique IDMediumPaul Eggleton1.5RESOLVEDFIXED
4409 4qemu password is asked in the console when using systemtap pluginLowScott Rifenbark1.5RESOLVEDFIXED14 October 2013: Changed doc requirement to "done"
4410 systemd: do_compile failed in parallel builds with system's make 3.28MediumHongxu Jia1.5RESOLVEDWONTFIX
4412 core-image-lsb-sdk build for powerpc 64bit boards is failingMediumChunrong Guo1.5RESOLVEDFIXED
4422 Poky build thyselfMediumCristian Iorga1.5RESOLVEDINVALID
4439 devshell fails to open a new tmux sessionMediumChristopher Larson1.5RESOLVEDFIXED
4447 The cache checksum for the base configuration does not change when the task data variable changesMediumLaurentiu Palcu1.5RESOLVEDFIXED
4449 GStreamer mp3 playback on Nitrogen6X - seg faultsMediumDaiane1.5RESOLVEDFIXED
4456 ConnMan recipe has not activated VPN supportMediumJukka Rissanen1.5RESOLVEDFIXED
4474 bitbake fails to find patch files moved to a second valid locationMediumPaul Eggleton1.5RESOLVEDFIXED
4478 Darren can't find anything on the ABsMediumBeth Flanagan1.5RESOLVEDFIXED
4486 Traceback when inheriting useradd but not setting USERADD_PARAM or GROUPADD_PARAMMediumIonut Radu1.5RESOLVEDFIXED
4490 run-postinsts fails on directdisk imageMediumJonathan Liu1.5RESOLVEDFIXED
4495 eglibc causes internal compiler error with GCC4.8MediumKhem Raj1.5RESOLVEDFIXED
4500 util-linux symbol link libuuid.so should in libuuid's dev rpmMediumxiao1.5RESOLVEDOBSOLETE
4505 bitbake parses wrong PATH environment variableMediumRichard Purdie1.5RESOLVEDNOTABUG
4509 Creating debug session fails when SDK is not installed in the default locationMediumJessica1.5RESOLVEDNOTABUG
4512 runqemu messes up terminal settingsMediumAndrei Dinu1.5RESOLVEDFIXED
4524 u-boot fails to compileMedium+Zhenhua Luo1.5RESOLVEDFIXED(autobuilder)
4555 Test case for smart recommends support is not effectiveMedium+Stoicescu Cornel1.5RESOLVEDFIXED
4561 System tap script cannot be canceledMediumJessica1.5RESOLVEDFIXED
4562 5python-scons-native: invoke scons failed on Fedora-17 while the destro didn't install sconsMediumHongxu Jia1.5RESOLVEDFIXED
4567 ntp display some abnormal behaviorsMediumXufeng Zhang1.5RESOLVEDINVALID
4569 Kernel crashes when started with kvm enabledMediumDarren Hart1.5RESOLVEDDUPLICATE
4576 libx11: Xcms should be enabled by defaultMediumJonathan Liu1.5RESOLVEDFIXED
4580 SCTP association can get stuck in SCTP_STATE_SHUTDOWN_PENDING state foreverMediumXufeng Zhang1.5RESOLVEDFIXED
4582 [Autobuilder] ICE while compiling perf on ARMMediumKhem Raj1.5RESOLVEDFIXED
4583 [autobuilder] matchbox-keyboard build failureMediumIonut Radu1.5RESOLVEDWORKSFORME
4587 DNS not working with connman in qemu imageMediumCristian Iorga1.5RESOLVEDFIXED
4594 [AUtobuilder] dmesg sanity test failed because of network issueMediumStefan Stanacar1.5RESOLVEDWONTFIX
4600 openssl: potential NULL pointer dereference in several placeMediumXufeng Zhang1.5RESOLVEDFIXED
4602 [Autobuilder] smart can't install gdb because of liblzmaMediumSaul Wold1.5RESOLVEDFIXED
4616 bitbake doesn't find "imx6sabresd" as a valid machine name.MediumBeth Flanagan1.5RESOLVEDFIXED
4622 buildhistory fails or reports wrong info when building 2 SDK images in one bitbake callMediumPaul Eggleton1.5RESOLVEDFIXED
4633 incorrect package conflict between two different images on same machine?MediumSaul Wold1.5RESOLVEDNOTABUG
4734 [Autobuilder] sanity network test failedMediumStefan Stanacar1.5RESOLVEDOBSOLETE
4739 useradd.bbclass: useradd_sysroot not run per-MACHINEMediumRichard Purdie1.5RESOLVEDFIXED
4743 yocto-kernel tool fails when config BBLAYERS behind BBLAYERS_NON_REMOVABLE in bblayers.confMediumTom Zanussi1.5RESOLVEDFIXED
4795 PSEUDO_LOCALSTATEDIR _sometimes_ points to WORKDIR with wrong TARGET_OSMediumRichard Purdie1.5RESOLVEDFIXED
4797 Qt SDK broken with angstrom-staging-yocto1.3 branchMediumLaurentiu Palcu1.5RESOLVEDWORKSFORME
4803 systemd.class does not handle multilib well when package has multiple servicesMediumRoss Burton (Arm)1.5RESOLVEDFIXED
4817 [p1022ds] ltp fail to build with 1.5 M2.rc1MediumZhenhua Luo1.5RESOLVEDFIXED
4821 pciutils has a dependency on kmodMediumSaul Wold1.5RESOLVEDFIXED
4822 Adding libdir to INSANE_SKIP_${PN} doesn't workMediumPaul Eggleton1.5RESOLVEDFIXED
4825 [Autobuilder][multilib] Qemu or its network is not up in 50 secondsMediumStefan Stanacar1.5RESOLVEDWORKSFORME
4826 [Autobuilder] lib32-gcc requires autoconf 2.64 instead of 2.69MediumSaul Wold1.5RESOLVEDWORKSFORME
4828 Support 2013Q2 Intel Graphics Stack Release in Yocto ProjectMediumLaurentiu Palcu1.5RESOLVEDFIXED
4842 [Autobuilder] Failed to create SSTATE_DIRMediumBeth Flanagan1.5RESOLVEDFIXED
4843 Issue with pseudo on 64-bit build hostMedium+Seebs1.5RESOLVEDFIXED
4845 m4-native:do_configure failed with gcc version 4.1.2 on x86MediumRandy MacLeod1.5RESOLVEDWONTFIX
4855 update-alternatives error for iproute2MediumYi Zhao1.5RESOLVEDFIXED
4862 /etc/init.d/alignment.sh not called for systemdMediumRoss Burton (Arm)1.5RESOLVEDDUPLICATE
4890 Smart failures occur during core-image-sato-sdk on nightly-mips sanity testingMediumStefan Stanacar1.5RESOLVEDWORKSFORME
4893 meta-intel missing mesa bbappendMediumNitin Kamble1.5RESOLVEDFIXED
4895 Enhance LSB_Test.sh to detect the download errorMediumYi Zhao1.5RESOLVEDFIXED
4898 mesa git: libXvMCsoftpipe.so/libXvMCsoftpipe.la installed but not shippedMediumJonathan Liu1.5RESOLVEDFIXED
4901 No warning that the toolchain and machine do not matchMediumLaurentiu Palcu1.5RESOLVEDFIXED
4912 No "Required Packages" mentioned for DebianMediumScott Rifenbark1.5RESOLVEDFIXED10 Sept 2013: RESOLVED
4916 lib-perl, liburi-perl, and curses-perl all have the same description stringLowmulhern1.5RESOLVEDFIXED
4919 Non-obvious failure when NO32LIBS=0 but 32-bit toolchain is brokenMediumSeebs1.5RESOLVEDFIXED
4920 buiding pseudo with NO32LIBS=0 will fail silently if gnu/stubs-32.h is missingMediumSeebs1.5RESOLVEDFIXED
4921 Building libtool_cross fails when using external cross-toolchain for 32 bit on 64 bit hostMediumChristopher Larson1.5RESOLVEDMOVED
4923 Cross-compilation issue with libexec when building for 32 bit host on arch 64.MediumChristopher Larson1.5RESOLVEDFIXED
4924 Redundant directories and files in toolchain tarballMedium+Jessica1.5RESOLVEDNOTABUG
4928 No documentation for UBOOT_MACHINEMediumScott Rifenbark1.5RESOLVEDFIXED07 October 2013 - RESOLVED
4932 Busybox doe not compile with arm-2009q1LowLaszlo Papp1.5RESOLVEDFIXED
4935 Typo in the reference book's FAQMediumScott Rifenbark1.5RESOLVEDFIXED29 July 2013: RESOLVED
4941 udev doesn't compile with older toolchainsLowLaszlo Papp1.5RESOLVEDINVALID
4945 No proper message in case of errors when building u-boot through bitbakeMediumRoss Burton (Arm)1.5RESOLVEDFIXED
4947 Crash using 24bpp X11 color depth on i.MX6Q with VivanteMediumOtavio Salvador1.5RESOLVEDNOTABUG
4950 Black rendering of windowed Open GLES applications on iMX6 Vivante under X11MediumOtavio Salvador1.5RESOLVEDFIXED
4954 Crash running glmark2-es2 on i.MX6MediumDaiane1.5RESOLVEDFIXED
4969 packagegroup-core-boot: Cannot satisfy the following dependencies for packagegroup-core-boot: busybox-hwclockMediumSaul Wold1.5RESOLVEDFIXED02 April 2014: Need some doc guidance.
4971 sed-native needed for meta-toolchain-sdk buildMediumLaurentiu Palcu1.5RESOLVEDFIXED
4975 LIC_FILES_CHKSUM shouldn't encourage use of ..MediumScott Rifenbark1.5RESOLVEDFIXED13 August 2013: RESOLVED/FIXED
4978 [Build Appliance] binutils-cross fail to compileMediumSaul Wold1.5RESOLVEDFIXED
4979 [beagleobard xM] Some internal error message in dmesg when boot upMediumSimarpreet Singh1.5RESOLVEDDUPLICATE
4980 Document layer templatesLowScott Rifenbark1.5RESOLVEDFIXED20 September 2013: RESOLVED
4982 [beagleboard xm] ltp test failed because cmd mkfs.ext4 does not existMediumSaul Wold1.5RESOLVEDINVALID
4987 Document version requirements in RDEPENDS etcMediumScott Rifenbark1.5RESOLVEDFIXED18 September 2013: RESOLVED
4989 Problems with booting Yocto Linux for Arrow SoC kitMediumSaul Wold1.5RESOLVEDFIXED
4994 [beagleboard] posix test failedMedium+Bruce Ashfield1.5RESOLVEDWONTFIX
4998 Package : xserver-xorg-2.1.11.2-r11MediumOtavio Salvador1.5RESOLVEDWORKSFORME
5007 mesa-demos fails to build with a undefined reference errorMediumOtavio Salvador1.5RESOLVEDFIXED
5013 dependency on virtual providers doesn't work when added through PACKAGECONFIGMediumRichard Purdie1.5RESOLVEDWORKSFORME
5035 Make the official releases work with prefetched or created tarballsLowScott Rifenbark1.5RESOLVEDFIXED27 September 2013: RESOLVED
5037 BSP layer included in bblayers.conf when building other MACHINEsMediumScott Rifenbark1.5RESOLVEDFIXED18 September 2013: RESOLVED
5055 Smart and RPM tests are not skipped correctly when no package manager exists.LowStefan Stanacar1.5RESOLVEDINVALID
5066 LSB systemd inconsistency between busybox-syslogd and sysklogdMediumChen Qi1.5RESOLVEDFIXED
5208 Failed to remove packages via PACKAGE_EXCLUDEMediumMark Hatle1.5RESOLVEDINVALID
5213 Fullscreen mode doesn't hide embedded panelMediumIrina Patru1.5RESOLVEDINVALID
5215 qemumips doesn't have CONFIG_TRACEPOINTSMediumTom Zanussi1.5RESOLVEDFIXED
5272 slang test case strops.sl failed in x86-64MediumIrina Patru1.5RESOLVEDFIXED
5343 keystone-evm build fails because of missing licenses in several cloud*.bb filesMediumDenys Dmytriyenko1.5RESOLVEDINVALID
2786 [LTP]/opt/ltp/Version file doesn't show the correct version of ltpMediumCristian Iorga1.5 M1RESOLVEDWORKSFORME
3404 5udev mount.sh writes to /tmp before it is symlinked to /var/tmpMediumChen Qi1.5 M1RESOLVEDFIXEDBlocked, need some further discussion
3423 2Define KFEATURE_COMPATIBILITYMediumBruce Ashfield1.5 M1RESOLVEDFIXED
4016 5LSB 4.1 Library Check: symbols are not found in libqt-mt.so.3MediumHongxu Jia1.5 M1RESOLVEDFIXED
4398 "all succeeded" does not look like a reason to fail a buildUndecidedRobert Yang1.5 M1RESOLVEDDUPLICATE
4424 glib-2.0-native: do_compile failed on opensuse 12.2 64bitMediumJesse Zhang1.5 M1RESOLVEDFIXED
4426 1ghostscript: do_fetch failed due to checksums mismatchMediumRobert Yang1.5 M1RESOLVEDNOTABUG
4440 3update kernel labsMediumTom Zanussi1.5 M1RESOLVEDFIXED
4454 2Refactor remote tools plug-in to prepare using common remote communication plug-inMediumIoana Grigoropol1.5 M1RESOLVEDFIXED
4458 global methodpool checks don't work with multithreaded parsingMediumRichard Purdie1.5 M1RESOLVEDFIXED
4459 methodpool does not account for two identically named files (different paths) that provide the different methodsMediumRichard Purdie1.5 M1RESOLVEDFIXED
4460 When an error about already declared functions occurs, the build does not stopMediumRichard Purdie1.5 M1RESOLVEDFIXED
349 [QT] fotowall warns iconv failure in QIconvCodecLowJonathan Liu1.5 M2RESOLVEDFIXED
2064 4[BSP] mount shows "/dev/sda4 on /media/sda4" but /media/sda4 doesn't existLowHongxu Jia1.5 M2RESOLVEDFIXED
3705 Existing filesystems aren't cleanly unmounted after booting from USB-driveLowHongxu Jia1.5 M2RESOLVEDFIXED
4406 Yocto-linux-rt: BUG() warning is triggered in rt kernel when run 'perf top' command on ARM/PowerPCMediumXufeng Zhang1.5 M2RESOLVEDFIXED
4438 Update syslinux to 4.06 (or 5.01)MediumJonathan Liu1.5 M2RESOLVEDFIXED
4480 Autobuilder emails are unreadable and pretty uselessMedium+Beth Flanagan1.5 M2RESOLVEDFIXED
4488 SDK installer doesn't handle spaces in pathMediumLaurentiu Palcu1.5 M2RESOLVEDFIXED
4550 3ADT: iptables autoreconf run fails on CentOSMediumHongxu Jia1.5 M2RESOLVEDFIXED
4556 Fix issue for changed RSA keyMedium+Ioana Grigoropol1.5 M2RESOLVEDWORKSFORME
4558 script "yocto-kernel config add" could add one component more than one timesLowNing Zhang1.5 M2RESOLVEDFIXED
4566 routerstation pro cannot bootup with NFS in yocto 1.5 20130521-1 buildMedium+Simarpreet Singh1.5 M2RESOLVEDFIXED
4592 Please update ltsi branchMediumBruce Ashfield1.5 M2RESOLVEDFIXED
4595 Invalid symbolic link file modules-arch.tgz in tmp/deploy/images directoryMediumYi Zhao1.5 M2RESOLVEDFIXED
4615 meta-intel BSPs all fail with lsb: emgd-driver no package provider build crash (including meta-minnow)Medium+Nitin Kamble1.5 M2RESOLVEDFIXED
4617 2ddimage: incompatibility with dashMediumHongxu Jia1.5 M2RESOLVEDFIXED
4626 Createrepo is not workingMediumSaul Wold1.5 M2RESOLVEDFIXED
4632 udev 182 init script should mount devtmpfs instead tmpfsMediumSaul Wold1.5 M2RESOLVEDFIXED
4736 populate_sdk compile failures; when run after target buildMedium+Laurentiu Palcu1.5 M2RESOLVEDWORKSFORME
4738 2udev-cache doesn't work well on OE/Yocto based systemsMediumChen Qi1.5 M2RESOLVEDFIXED
4745 5automount failed occasionally at system coldplug timeMediumHongxu Jia1.5 M2RESOLVEDFIXED
4746 2invoke "/etc/init.d/systemd-udevd restart" failedUndecidedHongxu Jia1.5 M2RESOLVEDFIXED
4749 2wget:do_configure failedUndecidedHongxu Jia1.5 M2RESOLVEDFIXED
4758 2adt_installer: perl lib version doesn't match perl script on Ubuntu-13.04MediumHongxu Jia1.5 M2RESOLVEDFIXED
4760 2adt-installer: installation failed when permission deny on the installation directoryMediumHongxu Jia1.5 M2RESOLVEDFIXED
4773 patch for ghostscript does not applyMediumPaul Eggleton1.5 M2RESOLVEDFIXED
4774 /media diretory cleanupLowChen Qi1.5 M2RESOLVEDFIXED
4784 Allow user to choose boot action in live imagesLowChen Qi1.5 M2RESOLVEDWONTFIX
4787 bitbake -e: Failure expanding variable SRCPVUndecidedRobert Yang1.5 M2RESOLVEDWONTFIX
4802 2Busybox on target upgrade fails if upgrading from 'one-binary' version to 'two-binary' versionUndecidedChen Qi1.5 M2RESOLVEDFIXED
4850 Error building libgluMedium+Otavio Salvador1.5 M2RESOLVEDFIXED
1115 3LSB 4.1 error from wide characterMediumHongxu Jia1.5 M3RESOLVEDFIXED
4379 [Performance] The switch to turn off the generation of temp/run.* fileUndecidedRobert Yang1.5 M3RESOLVEDINVALID
4455 7Create new remote communication utilities plug-in supporting remote tools & bitbake commander plugins functionalitiesMediumIoana Grigoropol1.5 M3RESOLVEDFIXED
4511 error for using oprofile.ko to profilingLowDaiane1.5 M3RESOLVEDWONTFIX
4732 Wrong path to terminfo files in buildtools-tarball causes python version check to failMedium+Hongxu Jia1.5 M3RESOLVEDFIXED
4741 2Netfilter NAT not configured properly/different for Kernel 3.8.4MediumNitin Kamble1.5 M3RESOLVEDFIXED
4756 Kernel upgrade on x86 is difficult/impossibleMediumDarren Hart1.5 M3RESOLVEDDUPLICATE
4835 xterm-256color causes python version check to failMedium+Hongxu Jia1.5 M3RESOLVEDFIXED
4853 Can't install prebuilt SDKMedium+Stefan Stanacar1.5 M3RESOLVEDFIXED
4886 /etc/rc5.d/S20irattach: /etc/sysconfig/irda: Read-only file systemMediumChen Qi1.5 M3RESOLVEDFIXED
4903 No proper error message for layer version mismatchMediumRoss Burton (Arm)1.5 M3RESOLVEDFIXED
4904 Autobuilder built beagleboard 20130724-2 image failedMediumStefan Stanacar1.5 M3RESOLVEDFIXED
4917 X server crashes under Build Appliance while switching between pcmanfm and terminals applicationsMedium+Ross Burton (Arm)1.5 M3RESOLVEDFIXED
4918 d-bus daemon fails to startHighRoss Burton (Arm)1.5 M3RESOLVEDFIXED
4946 [Regression] X crash on Yocto with i.MX6Q BSP 3.5.7-1.0.0 softfloatMediumOtavio Salvador1.5 M3RESOLVEDFIXED
4955 [adt_installer] Allow relative paths for specifying sysroot locationMediumLaurentiu Palcu1.5 M3RESOLVEDFIXED
4983 [Autobuilder] eclipse plug-in build failures for both Kepler and Juno due to can't find build scriptsMedium+Beth Flanagan1.5 M3RESOLVEDFIXED(autobuilder)
1950 2EFI only live images are not bootableMediumDarren Hart1.5 M4RESOLVEDINVALID
4494 Setting static IP addresses via connman ethernet provisioning mechanism does not allow manual IP adress changeMediumCristian Iorga1.5 M4RESOLVEDDUPLICATE
4599 Connection Properties shows the network disabled, for UNFS qemuarm targetMediumvenkata ramana g1.5 M4RESOLVEDNOTABUG
4879 nss postinst cannot be configured offlineMediumHongxu Jia1.5 M4RESOLVEDFIXED
4881 Cannot move the mount of /media/xxx over to $ROOT_DIR/media/xxx in live imageMediumChen Qi1.5 M4RESOLVEDFIXED
4882 udev has an implicit dependency on initscripts, which is not appropriateMediumChen Qi1.5 M4RESOLVEDFIXED
4883 No directory error for populate-volatile.sh at rootfs timeMediumChen Qi1.5 M4RESOLVEDFIXED
4885 lighttpd: /www directory should be writable in read-only rootfsMediumChen Qi1.5 M4RESOLVEDWONTFIX
4887 openssh not working well with read-only rootfsMediumChen Qi1.5 M4RESOLVEDFIXED
4889 python-native: remove unused and duplicated sitecustomize.pyMediumHongxu Jia1.5 M4RESOLVEDNOTABUG
4896 [lsb image] pidof: invalid options on command lineMediumHongxu Jia1.5 M4RESOLVEDFIXED
4911 Wiki: Distribution Support outdatedMediumScott Rifenbark1.5 M4RESOLVEDFIXED18 September 2013: RESOLVED
4927 Make Archlinux a supported or document the unwillingness of rolling-releaseLowScott Rifenbark1.5 M4RESOLVEDFIXED31 October 2013: RESOLVED
4937 1Error at rootfs time: "tar: .: file changed as we read it"MediumChen Qi1.5 M4RESOLVEDFIXED
4939 2Cannot start qemu image in environment created by buildtools-tarball.MediumChen Qi1.5 M4RESOLVEDFIXED
4984 sftp conection close core-image-baseMediumSaul Wold1.5 M4RESOLVEDNOTABUG
4990 grub-efi-native_2.00.bb, do_compile is failingMediumSaul Wold1.5 M4RESOLVEDFIXED
4991 Invalid symbolic link kernel image in qemu rootfsMediumDarren Hart1.5 M4RESOLVEDFIXED
4993 Kernel module package namingMediumMark Hatle1.5 M4RESOLVEDFIXED
4997 grub 0.97 doesn't work wellMediumChen Qi1.5 M4RESOLVEDFIXED
5018 5Improve the minimal installer in OE and fix bugs in itUndecidedChen Qi1.5 M4RESOLVEDFIXED
5029 libasound-module-bluez should have a version for BlueZ 5MediumCristian Iorga1.5 M4RESOLVEDDUPLICATE
5030 Multiple providers are available for runtime libasound-module-bluez (bluez4, bluez5) warningMediumCristian Iorga1.5 M4RESOLVEDFIXED
5064 CONFIG_CC_OPTIMIZE_FOR_SIZE overridden for arm targetsMediumBruce Ashfield1.5 M4RESOLVEDFIXED
5096 xf86-video-intel fails when opengl isn't a DISTRO_FEATUREMedium+Ross Burton (Arm)1.5 M4RESOLVEDFIXED
1088 More fully document packaging systemsLowPaul Eggleton1.5 M5RESOLVEDFIXED
2766 3coreutils build error with long TMPDIR: Argument list too longMediumRobert Yang1.5 M5RESOLVEDFIXED
3938 routerstation/mpc8315e: connman startup unused ethernet port when using nfsMedium+Mihai Prica1.5 M5RESOLVEDFIXED
4360 bluez5 QA warnings in multilibMediumMihai Prica1.5 M5RESOLVEDWORKSFORME
4481 Human-readable build namesMedium+Beth Flanagan1.5 M5RESOLVEDFIXED
4485 Autobuilder should resolve commit IDs immediatelyMedium+Beth Flanagan1.5 M5RESOLVEDFIXED
4866 SDK installer fails on hosts with Python 3.xMedium+Laurentiu Palcu1.5 M5RESOLVEDFIXED24 March 2014: Set Documentation flag to "Done".
4867 pkg_postinst_kernel-image calls depmod but there is no RDEPENDS on module-init-tools-depmodMediumDarren Hart1.5 M5RESOLVEDFIXED
4880 Use a uniform way to determine whether rootfs is read-onlyMediumChen Qi1.5 M5RESOLVEDFIXED
4888 Take into consideration that possibility of /var/lib on a separate writable media in case of a read-only rootfsMediumChen Qi1.5 M5RESOLVEDFIXED
5028 BlueZ 5 packs tests in a -tests packageMediumMihai Prica1.5 M5RESOLVEDFIXED
5047 [ruqemu] iptables rule does not get cleanedMediumChen Qi1.5 M5RESOLVEDFIXED
5048 [runqemu] failure when already in use tap interfaceMediumChen Qi1.5 M5RESOLVEDFIXED
5056 possible parallel make issue with telepathy-mission-controlMediumCristian Iorga1.5 M5RESOLVEDDUPLICATE
5060 list-packageconfig-flags.py: search bitbake lib dir failedMediumHongxu Jia1.5 M5RESOLVEDFIXED
5065 Document the fact that the SRCREV_meta needs to be updated after modifying the linux-yocto metadata meta branchMediumScott Rifenbark1.5 M5RESOLVEDFIXED13 September 2013: IN PROGRESS REVIEW
5067 1bitbake make-3.81 prints stack trace of python callsMediumRobert Yang1.5 M5RESOLVEDFIXED24 March 2014: Set Documentation flag to "No".
   500      
Warnings were generated during the execution of function
  1. Report truncated - count greater than max allowed 501 > 500

Old Milestone - Enhancements Need Verification - BY OWNER (2.5+)

IDQAESummary (173 tasks) PAssigneeMilestoneStatusResolutionWhiteboard
   0      
 
2273 4Evaluate current image space settingsLowEd Bartosh2.5RESOLVEDFIXED
3343 2perf script: install audit-libs-python to get syscall name for syscall-displaying scriptsLowAnuj Mittal2.5RESOLVEDFIXED
4349 5An easy way to find out why a recipe is built and installed (RDEPENDS)MediumRoss Burton (Arm)2.5RESOLVEDFIXED
6926 5Create yocto-bsp testsuite/testplanMediumyeoh ee peng2.5RESOLVEDOBSOLETE
7698 5Update to latest version of buildbotMediumJoshua Lock2.5RESOLVEDFIXED
9602 2AUH: Run automated tests on alternative C librariesMediumAlexander Kanavin2.5RESOLVEDFIXED
9945 4patchtest-oe: check pull request series against git repositoryMediumLeonardo Sandoval Gonzalez2.5RESOLVEDOBSOLETE
9946 5patchtest: must be able to test the series on every branch specified on mbox summaryMediumLeonardo Sandoval Gonzalez2.5RESOLVEDFIXED
10415 1devtool: add: override preferred kernel when a new one is addedMedium+Juan Manuel Cruz Alcaraz2.5RESOLVEDFIXED
10437 5Improve PublishArtifacts (remove hard-coded paths & assumptions)MediumJoshua Lock2.5RESOLVEDFIXED
10477 2yocto-bsp: tool should output a conf file to be consume by the qemu runnerMediumLeonardo Sandoval Gonzalez2.5RESOLVEDOBSOLETE
10503 1Enable the capability to check the details of an image when is already bootedMediumJoshua Lock2.5RESOLVEDFIXED
10537 2Use "new project template" framework to create sample Make projectMediumChin Huat Ang2.5RESOLVEDWONTFIX
10538 4Use "new project template" framework to create sample Automake projectMediumChin Huat Ang2.5RESOLVEDWONTFIX
10539 4Use "new project template" framework to create sample GTK projectMediumbrian avery2.5RESOLVEDINVALID
10540 2Use "new project template" framework to create sample CMake projectMediumbrian avery2.5RESOLVEDINVALID
10541 5Use "new project template" framework to create sample Devtool projectMedium+brian avery2.5RESOLVEDWONTFIX
10542 use CDT "new build system" to enable building for the various supported Project typesMediumbrian avery2.5RESOLVEDINVALID
10546 5use CDT "new build system" to enable building for Devtool projectMedium+brian avery2.5RESOLVEDWONTFIX
10557 Replace Eclipse Poky plugin with Eclipse CROPS pluginMedium+brian avery2.5RESOLVEDINVALID
10603 Integrate the automated device testing to the AutobuilderMediumStephen K Jolley2.5RESOLVEDOBSOLETE
10752 2Add test to verify help option in oe scripts and ensure it's displayed when no required arguments are specifiedMediumJair Gonzalez2.5RESOLVEDINVALID
10779 3Ensure auto.conf is restored at the end of build steps which modify itMediumJoshua Lock2.5RESOLVEDFIXED
11207 1Add bbclass searchMediumAmanda Brindle2.5RESOLVEDFIXED
11208 1Email notification on publicationMediumAmanda Brindle2.5RESOLVEDFIXED
11216 4Convert DAFT in a service available for any Yocto auto builder workerMediumJair Gonzalez2.5RESOLVEDOBSOLETE
11217 2Remove DAFT's DHCP server dependencyMediumJair Gonzalez2.5RESOLVEDOBSOLETE
11235 2Improve configuration parser - better error reporting and more lenientMediumJoshua Lock2.5RESOLVEDOBSOLETE
11381 4oe-build-perf-report: show task summaryMedium+Unassigned2.5RESOLVEDFIXED
11382 4oe-build-perf-report: display changes in build contentMedium+Unassigned2.5RESOLVEDFIXED
11415 1layerindex: gather available PACKAGECONFIG optionsMediumAmanda Brindle2.5RESOLVEDFIXED
11445 wic: allow wic to support additional partition (e.g. 4th partition)MediumChin Kooi KHOR2.5RESOLVEDOBSOLETE
11601 0.5check new patches are indicated in the SRC_URIMediumLeonardo Sandoval Gonzalez2.5RESOLVEDDUPLICATE
11615 1auh: Send summary to maintainers when upgrade failsMediumAlexander Kanavin2.5RESOLVEDFIXED
11723 2automatically run yocto-compat-layer on meta-intel meta-intel buildsMediumStephano Cetola2.5RESOLVEDDUPLICATE
11740 2DAFT: Enable BeagleBone OTG Ethernet interface on genericx86 images.MediumAlejandro Hernandez2.5RESOLVEDFIXED
11789 2Image build and sanity test in one bitbake invocationMediumJoshua Lock2.5RESOLVEDOBSOLETE
11825 4A "Let's try that again" buttonMediumJoshua Lock2.5RESOLVEDFIXED
11891 4Port bmaptools to Python 3MediumEd Bartosh2.5RESOLVEDFIXED
11936 1sato display should show ip address if availableMediumRoss Burton (Arm)2.5RESOLVEDNOTABUG
11948 1devtool upgrade walks the file tree and execs a git add for each fileMediumPaul Eggleton2.5RESOLVEDFIXED
12121 muslx32: qat16 compilation errorMediumAnuj Mittal2.5RESOLVEDFIXED
12129 5Show recipe dependencies in layer indexMediumAmanda Brindle2.5RESOLVEDFIXED
12258 LICENSE in packagegroup?MediumRoss Burton (Arm)2.5RESOLVEDFIXED
12369 improve error message when file conflict on modeMediumJosé Bollo2.5RESOLVEDWONTFIX
12463 Split buildhistory repo creation into separate build stepMediumJoshua Lock2.5RESOLVEDFIXED
12488 Improve logging of event handlerMediumBhargava Sreekantappa Gayathri2.5RESOLVEDNOTABUG
10805 3Tinfoil usage in the test-suiteMedium+Daniela Plascencia2.5 M1RESOLVEDFIXED
10874 3oe-selftest: 35% of the testing time is concentrated in 5 tests (out of ~200)Medium+Leonardo Sandoval Gonzalez2.5 M1RESOLVEDFIXED
11518 1Upstream-Status Submitted and Inappropriate check for where/reason infoMedium+Daniela Plascencia2.5 M1RESOLVEDFIXED
11596 5bzip2-ptest: improve reproducible buildMediumCinly Ooi2.5 M1RESOLVEDFIXED
11753 3patchwork should track the HEAD commit id in stored patchesMediumDaniela Plascencia2.5 M1RESOLVEDOBSOLETE
11780 1Commit message failures should link to commit patch guidelinesMediumLeonardo Sandoval Gonzalez2.5 M1RESOLVEDFIXED
11805 5Create yocto-bsp/yocto-kernel tools testsMediumJose Perez C2.5 M1RESOLVEDINVALID
11806 5Create test for yocto-kernel toolMediumJose Perez C2.5 M1RESOLVEDINVALID
12126 upgrade meta-intel-clear-containers to 3.0MediumTodor Minchev2.5 M1RESOLVEDFIXED
12167 1Remove yocto-layer now that bitbake-layers has been mergedMedium+Stephano Cetola2.5 M1RESOLVEDFIXED
12196 1Update GStreamer to 1.12.3MediumRoss Burton (Arm)2.5 M1RESOLVEDFIXED
12269 5copy_bitbake_and_layers(): make it support subgitsUndecidedRobert Yang2.5 M1RESOLVEDINVALID
8730 8separate code generating python manifest file from manifest information and improve the manifest generationMediumRoss Burton (Arm)2.5 M2RESOLVEDFIXED
10556 5Docker tooling support to manipulate CROPS containers from the Eclipse CROPS pluginMedium+brian avery2.5 M2RESOLVEDOBSOLETE
10773 3QA Bitbake: extend coverage for event unit testMedium+yeoh ee peng2.5 M2RESOLVEDFIXED
10956 1selftest: sstatetessts should use world instead of image targets, making it distro agnosticMediumLeonardo Sandoval Gonzalez2.5 M2RESOLVEDFIXED
11363 15Support building and deploying multiple kernels for a single imageMedium+Haris Okanovic2.5 M2RESOLVEDFIXEDLET
11510 6Improve the way we handle python's packaging (autopackaging)MediumRoss Burton (Arm)2.5 M2RESOLVEDFIXEDLET
11519 1check for four-space indented in python metadataMediumDaniela Plascencia2.5 M2RESOLVEDOBSOLETE
11694 7Python JSON manifest should be parsed directly by bitbakeMediumRoss Burton (Arm)2.5 M2RESOLVEDFIXEDLET
11695 7Add task to create python manifest(s) automaticallyMediumRoss Burton (Arm)2.5 M2RESOLVEDFIXEDLET
11814 3Add a warning if buildhistory remote push failsMediumStephano Cetola2.5 M2RESOLVEDWONTFIX
11943 1oe-pkgdata-util should support RPROVIDESMedium+Amanda Brindle2.5 M2RESOLVEDFIXED
12327 5Split embedded shell commands out into callable scriptsMedium+Joshua Lock2.5 M2RESOLVEDFIXED
12348 5Integration Meson build systemMedium+Alexander Kanavin2.5 M2RESOLVEDFIXED
12370 1Create new YP Overview ManualMedium+Scott Rifenbark2.5 M2RESOLVEDNOTABUG09 February 2018: RESOLVED/NOT A BUG
12425 1Upgrade rpm to 4.14.0+ to support binary reproducibilityMedium+Alexander Kanavin2.5 M2RESOLVEDFIXED
10987 5Use initramfs-framework for initialization by default in OE-CoreMedium+California Sullivan2.5 M3RESOLVEDFIXED
11018 3Auto deploy and boot meta-intel images built with the ABMediumStephano Cetola2.5 M3RESOLVEDWONTFIX
11178 2Use SOURCE_DATE_EPOCHMedium+Juro Bystricky2.5 M3RESOLVEDFIXED
11179 1Ensure TZ is also set to a consistent valueMedium+Juro Bystricky2.5 M3RESOLVEDFIXED
11483 5Automate testcases for package managementMedium+yeoh ee peng2.5 M3RESOLVEDDUPLICATE
11488 5Testimage: Add tests for ipk/opkg like dnf/rpm onesMedium+yeoh ee peng2.5 M3RESOLVEDDUPLICATE
11548 5Reduce local Pending patchesMedium+dengke2.5 M3RESOLVEDNOTABUG
12027 4Merge linux-yocto git trees to a single one to reduce download times and mirror sizesMedium+Bruce Ashfield2.5 M3RESOLVEDFIXED
12104 2Reduce the number of exported environment variablesMedium+Joshua Lock2.5 M3RESOLVEDFIXED
12128 20Rework the Quickstart and intro to the manualsMediumStephano Cetola2.5 M3RESOLVEDFIXED
12188 4Make wic the default image type for genericx86 and genericx86-64MediumCalifornia Sullivan2.5 M3RESOLVEDFIXED
12193 1Add env for shell calls in localhostbecontrollerMediumDavid Reyna2.5 M3RESOLVEDFIXED
10147 4Create a tool to compare the automated test list against the Testopia Test list DBMediumyeoh ee peng2.5 M4RESOLVEDFIXED
11176 3Add optional command to rootfs-postprocess to remove non-determinism from rootfsMedium+Juro Bystricky2.5 M4RESOLVEDFIXED
11177 2Generate archives with deterministic metadataMedium+Juro Bystricky2.5 M4RESOLVEDMOVED
11525 3wic: /etc/fstab to mount partitions with UUID instead of kernel name descriptorsMediumKristi2.5 M4RESOLVEDFIXED23 February 2018: RESOLVED
12371 5Purge concepts from YP Reference ManualMediumScott Rifenbark2.5 M4RESOLVEDFIXED09 February 2018: RESOLVED
12422 2Support reproducible build for core-image-minimal imagesMedium+Juro Bystricky2.5 M4RESOLVEDFIXED
6307 7Package grub-efi modules and scripts similar to grub-biosMediumHongxu Jia2.6RESOLVEDFIXED
7336 1buildhistory-diff reports recipe-wide changes per-subpackageMediumPaul Eggleton2.6RESOLVEDFIXED
12793 Allow 'branding'MediumRoss Burton (Arm)2.6RESOLVEDOBSOLETE
12689 1wic should be able to use initrd value for grubHighAnuj Mittal2.6 M1RESOLVEDFIXED
10681 10Support inter-multi-configuration dependenciesMedium+Alejandro Hernandez2.6 M2RESOLVEDFIXED
12727 Drop wireless-tools and use iwMedium+Alexander Kanavin2.6 M2RESOLVEDFIXED
8446 5fix .pyc/.pyo buildpaths issueMediumHongxu Jia2.6 M3RESOLVEDFIXED
12749 Add ability to do "preflight" by using sstateMedium+Richard Purdie2.6 M3RESOLVEDFIXED
12789 qa-tools: enhance script to analyze ptest log to identify test case that passing in precious cycle but failing in current cycleHighpankaj yadav2.6 M3RESOLVEDFIXED
5874 2DNS and proxy configurations should be available in sato images in connman GUI applicationMediumRoss Burton (Arm)2.7RESOLVEDDUPLICATE
11583 4oeqa: core add support to publish resultsMedium+yeoh ee peng2.7 M1RESOLVEDFIXED
12332 2Regularly purge the error report databaseMedium+Michael Halstead2.7 M1RESOLVEDFIXED
12774 oeqa: kernel config depenency for some kernel test casesMedium+Hongzhi2.7 M1RESOLVEDFIXED
12421 Host-compiled Python bytecode not reproducibleMedium+Mingli Yu2.7 M2RESOLVEDFIXED
12931 5Change default PACKAGE_DEBUG_SPLIT_STYLE to "debug-with-srcpkg"Medium+Joshua Watt2.7 M2RESOLVEDFIXED
13011 Start collecting ptest for arm and x86 on Vtargets.Medium+Richard Purdie2.7 M2RESOLVEDFIXED
13030 Add sstate hash equivalence supportMedium+Joshua Watt2.7 M2RESOLVEDFIXED
13058 2split util-linux automatically instead of hard codingMedium+André Draszik2.7 M2RESOLVEDFIXED
13088 0.3Add support for extracting individual ptest timingMedium+Aníbal Limón2.7 M2RESOLVEDFIXED
13094 3support custom extensions to reportsMediumDavid Reyna2.7 M2RESOLVEDFIXED
13110 3Add "release" records to product recordsMediumDavid Reyna2.7 M2RESOLVEDFIXED
13114 Split python3-ctypes tests packageMedium+Ross Burton (Arm)2.7 M2RESOLVEDFIXED
11522 2runqemu env var QB_MEM expects to be set to "-m 256" not "256" or "256M"Medium+Robert Yang2.7 M3RESOLVEDFIXED
12650 2Export manual test cases from Testopia to oeqaMedium+Mazliana2.7 M3RESOLVEDFIXED
12651 14Simple script to help manual test execution in populating test results into desired formatMedium+Mazliana2.7 M3RESOLVEDFIXED
12654 10QA test results management to replace TestopiaHighyeoh ee peng2.7 M3RESOLVEDFIXED
12980 5qemuarm rename to qemuarmv5 and change to v7 as defaultMedium+Jon Mason2.7 M3RESOLVEDFIXED
12981 5Switch qemuarm to qemu -m virt rather than versatilepbMedium+Jon Mason2.7 M3RESOLVEDFIXED
13012 10Create/merge results aggregation and analysis toolMedium+Apoorv2.7 M3RESOLVEDFIXED
13013 Run results aggregation and analysis on the autobuilderMedium+Richard Purdie2.7 M3RESOLVEDFIXED
13014 Handle triggering and collection of build performance data for release buildsMedium+Richard Purdie2.7 M3RESOLVEDFIXED
6077 2piglit depends on libx11LowChangqing Li2.7 M4RESOLVEDFIXED
8591 10bitbake world needs a lot of time for "Preparing RunQueue"MediumRobert Yang2.7 M4RESOLVEDFIXED
12548 5Document variable assignment for DISTRO_FEATURES, IMAGE_FEATURES, SDKIMAGE_FEATURES, etcMediumScott Rifenbark2.7 M4RESOLVEDFIXED23 April 2019: RESOLVED
13063 Add build-time testing support via qemu-user?Medium+Ross Burton (Arm)2.8RESOLVEDWONTFIX
13198 unpack fails when git repo has lfs linksMediumNaveen Saini2.8RESOLVEDFIXED
11168 multiconfig: use 'mc:' qualifier instead of 'multiconfig:'Medium+Richard Purdie2.8 M1RESOLVEDFIXED
13059 5Aarch64 builder supportHighJon Mason2.8 M1RESOLVEDFIXED
13060 5Arm ptestsMedium+Jon Mason2.8 M1RESOLVEDFIXED
13264 Refactor recipetool/devtool to support python3 (only)Medium+Maciej Pijanowski2.8 M1RESOLVEDFIXED
13318 Add SPDX license headers to all source files for pseudoMedium+New Comer Bugs2.8 M1RESOLVEDFIXEDNEWCOMER
13326 Index the build artefacts directoryMedium+Unassigned2.8 M1RESOLVEDFIXED
13327 Extract ptest logs from ptest result files automatically on the autobuilderHighRichard Purdie2.8 M1RESOLVEDFIXED
13328 Update pybootchart to work with python3Medium+Richard Purdie2.8 M1RESOLVEDFIXED
13336 runqemu: support non bootable wic imagesMedium+Adrian Freihofer2.8 M1RESOLVEDFIXED
10416 5Extensible SDK: provide easy means of reconfiguring the kernelMedium+chandana kalluri2.8 M2RESOLVEDFIXED
12955 2update-rc.d: Provide option to permanently disable service, also after upgrade.MediumChangqing Li2.8 M2RESOLVEDFIXED
13316 Add SPDX license headers to all python/script files within OE-CoreMedium+Richard Purdie2.8 M2RESOLVEDFIXED
12274 Automate Kernel Development test casesMedium+Mazliana2.8 M3RESOLVEDFIXED
13031 2Make systemd as default system and service manager for pokyMedium+Kai Kang2.8 M3RESOLVEDFIXED
13261 nativesdk packages not packaged into esdkMedium+Jaewon Lee2.8 M3RESOLVEDFIXED
13323 Add reproducibility automated testingHighJoshua Watt2.8 M3RESOLVEDFIXED
13358 3perf depends on python2, this blocks creating python3 imagesMediumBruce Ashfield2.8 M3RESOLVEDFIXED
13412 pkgdata should be handled in a similar way to RSSMedium+Richard Purdie2.8 M3RESOLVEDFIXED
   146      
Apoorv
5866Apoorv5Reproducible builds: identical binariesMedium+Juro Bystricky2.5 M1RESOLVEDOBSOLETE
10063Apoorv5testimage: Add tests for apt/dpkg like smart/rpm onesMediumyeoh ee peng2.5 M3RESOLVEDFIXED
7494Apoorv5AUH: Parallelize running bitbake inside AUH scriptMediumAlexander Kanavin2.6RESOLVEDOBSOLETE
10744Apoorv5Update test case of smartpm/createrepo under meta/lib/oeqa/runtimeMedium+Richard Purdie2.6 M1RESOLVEDFIXED
   4      
David Lopez Barriba
8735David Lopez Barriba5AUH: Use tinfoil instead of parse the recipe itselfMediumAlexander Kanavin2.5RESOLVEDOBSOLETE
   1      
yeoh ee peng
10672yeoh ee peng1AUH log's tarball should have relative path starting at the timestampMediumAlexander Kanavin2.5RESOLVEDFIXED
12118yeoh ee pengmuslx32: webkitgtk compilation errorMediumAnuj Mittal2.5RESOLVEDFIXED
12119yeoh ee pengmuslx32: boost compilation errorMediumAnuj Mittal2.5RESOLVEDFIXED
12120yeoh ee pengmuslx32: gdb compilation errorMediumAnuj Mittal2.5RESOLVEDFIXED
12122yeoh ee pengmuslx32: systemd-boot compilation errorMediumAnuj Mittal2.5RESOLVEDFIXED
12123yeoh ee pengmuslx32: acpica compilation errorMediumAnuj Mittal2.5RESOLVEDFIXED
10801yeoh ee peng3devtool: upgrade: report diff for changed files referred to by LIC_FILES_CHKSUMMediumAlexander Kanavin2.5 M1RESOLVEDFIXED
10598yeoh ee peng5AUH: make use of devtool upgrade (or at least share code)MediumAlexander Kanavin2.5 M3RESOLVEDFIXED
   8      
Francisco Pedraza
12177Francisco Pedraza2Support wic in the esdkMedium+Rebecca Chang2.5 M2RESOLVEDFIXED
   1      
Juan Ramos
9563Juan Ramos5yocto-kernel script should use argparse instead of optparse libraryMediumDaniela Plascencia2.5RESOLVEDOBSOLETE
11765Juan Ramos5Create DAFT test fixture for BSP QA cyclesMediumJair Gonzalez2.5RESOLVEDFIXED
9787Juan Ramos4create selftest for useradd-staticidsMediumJose Perez C2.5 M2RESOLVEDFIXED
   3      
Libertad
11642Libertad5Use DAFT to execute BSP's automated test on QA cycles.MediumJair Gonzalez2.5RESOLVEDOBSOLETE
   1      
oscar lopez arandas
9564oscar lopez arandas5yocto-layer script should use argparse instead of optparse libraryMediumDaniela Plascencia2.5RESOLVEDOBSOLETE
   1      
Stephen K Jolley
10536Stephen K JolleyUse "new project template" framework to create sample projectsMediumbrian avery2.5RESOLVEDINVALID
10230+Stephen K Jolleyoeqa refactor and improvements (master bug)Medium+Stephen K Jolley2.5 M3RESOLVEDFIXED
   2      
Toaster default assignee
12785Toaster default assignee4Support Project Specific configuration for external tools (e.g. ISS, Eclipse)Medium+David Reyna2.6 M3RESOLVEDFIXED
12821Toaster default assignee5Make Toaster conf changes compatible with command line usageMedium+David Reyna2.6 M3RESOLVEDFIXED
12822Toaster default assignee5Support importing user changes to conf files into ToasterMedium+David Reyna2.6 M3RESOLVEDFIXED
12824Toaster default assignee2Scan imported layers for content so that they are immediately availableMediumDavid Reyna2.6 M3RESOLVEDFIXED
12825Toaster default assignee1show layer clone item in progress barMediumDavid Reyna2.6 M3RESOLVEDFIXED
12891Toaster default assignee5Allow flexible value for TOASTERDIR plus custom fixture supportMedium+Awais2.6 M3RESOLVEDFIXED
   6      

Old Milestone - Enhancements Need Verification - BY OWNER (2.1) - (2.4)

IDQAESummary (587 tasks) PAssigneeMilestoneStatusResolutionWhiteboard
   0      
 
3505 5world-image as bitbake build targetMediumRichard Purdie2.1RESOLVEDFIXED
5044 3bitbake does not take into consideration some forms of PREFERRED_PROVIDERSMediumRichard Purdie2.1RESOLVEDFIXED
5046 Document that CPPFLAGS override behavior and possible workaroundLowPaul Eggleton2.1RESOLVEDFIXED
5321 10When DISTRO_FEATURES are removed, bitbake world should still workMediumRandy MacLeod2.1RESOLVEDWORKSFORME
5582 5Start Weston with systemdMediumAlexander Kanavin2.1RESOLVEDFIXED
7278 1Default core-image-x11 has X server with screen blanking activeMediumJussi Kukkonen2.1RESOLVEDFIXED
7339 2Performance issue in do_rootfs (buildhistory_list_installed_image)MediumPaul Eggleton2.1RESOLVEDFIXED
7443 1runqemu should allow using kvm in absence of vhost-netMediumRandy Witt2.1RESOLVEDFIXED
7580 Add musl as a system C library optionMediumKhem Raj2.1RESOLVEDFIXED
7624 devtool: extract: fall back to metadata git history to get patch author/dateLowPaul Eggleton2.1RESOLVEDFIXED
7634 5recipetool: extend autotools recipe creationMediumPaul Eggleton2.1RESOLVEDFIXED
7635 3recipetool: extend cmake recipe creationMediumPaul Eggleton2.1RESOLVEDFIXED
7676 recipetool: add ability to update variable value in recipeLowPaul Eggleton2.1RESOLVEDFIXED
7797 4Clarify what will happen to errors submitted to errors.yoctoproject.orgMediumMichael Wood2.1RESOLVEDFIXED
7908 devtool: deploy-target: write deployed file list to target instead of hostLowPaul Eggleton2.1RESOLVEDFIXED
8032 5bitbake: improve messages when multiple providers are being builtMediumRichard Purdie2.1RESOLVEDFIXED
8099 Suggestion: prefix task log messages with recipe+taskMediumChristopher Larson2.1RESOLVEDFIXED
8432 1align release versioning scheme with OE-CoreMediumRichard Purdie2.1RESOLVEDWONTFIX
8762 testimage: make it can run by non root user (without sudo)MediumRoss Burton (Arm)2.1RESOLVEDDUPLICATE
8815 Add possibility to choose audio outputMediumJussi Kukkonen2.1RESOLVEDFIXED
8852 0.5Test that layer git revisions are displayed and do not fail without git repositoryMediumDaniel Istrate2.1RESOLVEDFIXED
8855 3devtool: build-image: allow specifying packages to includeMediumPaul Eggleton2.1RESOLVEDFIXED
8920 2oe-selftest: users should be able to specify those folders that 'coverage' should look intoMediumHumberto Ibarra2.1RESOLVEDFIXED
8978 2devtool: deploy-target: preserve old files so we can restore them laterMediumPaul Eggleton2.1RESOLVEDFIXED
8982 5devtool: add: support out-of-tree kernel modulesMediumPaul Eggleton2.1RESOLVEDFIXED
8990 0.5makeinfo should be included in build-toolsMediumRichard Purdie2.1RESOLVEDFIXED
9022 5Replace retry logic in useradd with flocksMediumKai Kang2.1RESOLVEDFIXED
5407 2Create standard method for adding package feedsMediumLeonardo Sandoval Gonzalez2.1 M1RESOLVEDFIXED
8728 3wic: Allow to use custom bootloader configurationMediumMariano Lopez2.1 M1RESOLVEDFIXED
7427 5Image manifest file lacking newline char in last lineMediumMariano Lopez2.1 M2RESOLVEDFIXED
8468 3bitbake: remove stamp-base supportMediumChen Qi2.1 M2RESOLVEDFIXED
8622 5e2fsprogs: support xattrMediumRobert Yang2.1 M2RESOLVEDFIXED
8764 5Add an easy to use script like AUH (auto upgrade help)UndecidedRobert Yang2.1 M2RESOLVEDWONTFIX
8820 0.5Would like to be able to specify partitions be created but not mounted in a wksMediumJoshua Lock2.1 M2RESOLVEDFIXED
3444 5Use sparse files for imagesMediumRoss Burton (Arm)2.1 M3RESOLVEDNOTABUG
6027 2add Build configuration info to BSPMediumAlexandru Georgescu2.1 M3RESOLVEDDUPLICATE
7499 5Automate -dbg package constructionMediumRichard Purdie2.1 M3RESOLVEDFIXED
8847 3QA warnings can be improvedMediumRobert Yang2.1 M3RESOLVEDFIXED
8881 5print recipe name as a error promotion when bitbake PACKAGEMediumRobert Yang2.1 M3RESOLVEDFIXED
8979 devtool: provide an easy way to get to the workdir/logsMedium+Paul Eggleton2.1 M3RESOLVEDFIXED
8981 3devtool: add: support kernel source treesMedium+Paul Eggleton2.1 M3RESOLVEDFIXED
9014 5Can run "bitbake recipe" directly withtout initialUndecidedRobert Yang2.1 M3RESOLVEDINVALID
9039 3Integrate swupd tools from Clear Linux into OE CoreHighJoshua Lock2.1 M3RESOLVEDFIXED
9040 1Implement a mechanism to support generating swupd bundlesHighJoshua Lock2.1 M3RESOLVEDFIXED
9089 5Extensible SDK add tests for sdk-updateMedium+Aníbal Limón2.1 M3RESOLVEDFIXED
9161 5make vm and live image can build togetherMediumRobert Yang2.1 M3RESOLVEDFIXED
3169 15Implement Shuku proposalMedium+Jussi Kukkonen2.2 M1RESOLVEDFIXED
4223 2System tap plugin works only with a fixed poky/build folderMediumJose Lamego2.2 M1RESOLVEDFIXED
7058 20ERROR: QA Issue: File xxx in package contained reference to tmpdir [buildpaths]MediumHongxu Jia2.2 M1RESOLVEDFIXED
7615 5Autobuilder should automatically create BSPs for major releasesMediumTracy Graydon2.2 M1RESOLVEDFIXED
7658 4patchwork: provide means of recording additional patch statusesHighLeonardo Sandoval Gonzalez2.2 M1RESOLVEDFIXED
8640 2Remove vala from oe-core?Medium+Alexander Kanavin2.2 M1RESOLVEDNOTABUG
8653 Validate OLDEST_KERNELLowPaul Eggleton2.2 M1RESOLVEDFIXED
8704 3patchwork: support history tracking of patch statusMedium+Jose Lamego2.2 M1RESOLVEDFIXED
9017 4Sync and Upgrade AB configurationMediumPlauchu Edwin2.2 M1RESOLVEDFIXED
9082 0.5Display network information on log-in screensMediumJussi Kukkonen2.2 M1RESOLVEDWONTFIX
9235 1oe-init-build-env: to receive an argument/variable for appending to local.confMediumMariano Lopez2.2 M1RESOLVEDFIXED
9321 4[meta-swupd] Enhancements for use within a continuous integration systemMediumJoshua Lock2.2 M1RESOLVEDFIXED
9325 2[meta-swupd] Copy only required bundle contents, rather than copying the entire mega image and then pruning unwanted filesMediumJoshua Lock2.2 M1RESOLVEDFIXED
9340 5Improve tooling around BuildLog and SWAT processHighJoshua Lock2.2 M1RESOLVEDFIXED
9388 5A way to no build kernelMediumRobert Yang2.2 M1RESOLVEDINVALID
9401 1patchtest: show assertion messages on summaryMedium+Leonardo Sandoval Gonzalez2.2 M1RESOLVEDFIXED
9403 1patchtest-oe: show the solution on the assertion messageMedium+Leonardo Sandoval Gonzalez2.2 M1RESOLVEDFIXED
9419 0.1Enabling systemd-boot to replace gummibootMediumJianxun Zhang2.2 M1RESOLVEDFIXED
9599 4Reduce bundle overheads by not depending on os-core when generating bundle sysrootsMedium+Joshua Lock2.2 M1RESOLVEDFIXED
4078 5A method to validate the contents of changes to recipes, configuration files and classesHighLeonardo Sandoval Gonzalez2.2 M2RESOLVEDFIXED
8648 10Automatic testing of incoming patchesHighLeonardo Sandoval Gonzalez2.2 M2RESOLVEDFIXEDTesting in Progress
9251 1Need flowchart style documentation showing progress of tasks and what they touch in a setscene vs non setscene setting.MediumScott Rifenbark2.2 M2RESOLVEDFIXED21 July 2016: RESOLVED
9515 1update-rcd class should add build dependencies if requiredMedium+Mariano Lopez2.2 M2RESOLVEDFIXED
9529 sysvinit: inittab labels for consoles need to be restricted to 4 charactersMediumStephano Cetola2.2 M2RESOLVEDFIXED
9671 1UPSTREAM_CHECK_* variables needs documentationMediumScott Rifenbark2.2 M2RESOLVEDFIXED8 June 2016: RESOLVED
9823 1Suggested additions to the shared state cache documentationMediumScott Rifenbark2.2 M2RESOLVEDFIXED21 July 2016: RESOLVED
9843 1Suggested additions to the documentation on PRMediumScott Rifenbark2.2 M2RESOLVEDFIXED30 June 2016: RESOLVED
9871 patchtest-oe: make sure description is present on patchesMedium+Francisco Pedraza2.2 M2RESOLVEDFIXED
9872 1patchtest-oe: check LIC_FILES_CHECKSUM is present on new recipesMedium+Jose Lamego2.2 M2RESOLVEDFIXED
9873 1patchtest-oe: in case LIC_FILES_CHKSUM changed, make sure commit message indicates the reasonMedium+Jose Lamego2.2 M2RESOLVEDFIXED
9876 patchtest-oe: check that attached SW patches does not contain trailing spacesMedium+Jose Perez C2.2 M2RESOLVEDFIXED
9881 1patchtest-oe: check patch's subject lengthMedium+Leonardo Sandoval Gonzalez2.2 M2RESOLVEDFIXED
9886 systemd-boot: Support construct direct-boot image with sd-boot in wic and wksMediumJianxun Zhang2.2 M2RESOLVEDFIXED
4827 15runqemu shouldn't hard-code machine knowledgeMediumRobert Yang2.2 M3RESOLVEDFIXED
7568 3Create an image to run regular build tests for no-X11 caseMediumBill Randle2.2 M3RESOLVEDFIXED
8318 20Avoid unnecessary package feed churn due to packages rebuildingMedium+Robert Yang2.2 M3RESOLVEDFIXED
8532 3runexported.py parameter support for: -a <tag>Medium+Mariano Lopez2.2 M3RESOLVEDFIXED
9169 add fix_buildpaths.bbclass to fix build pathMediumHongxu Jia2.2 M3RESOLVEDWONTFIX
9257 1extensible SDK: need an easy way of installing toolchainsMediumPaul Eggleton2.2 M3RESOLVEDFIXED
9346 1Rename COMPRESS_CMD_* to IMAGE_POSTPROCESS_*?MediumEd Bartosh2.2 M3RESOLVEDFIXED
9389 2oeqa: split configuration from the codeMediumJose Lamego2.2 M3RESOLVEDWONTFIX
9399 10qemu-native: make it can boot efi imagesUndecidedRobert Yang2.2 M3RESOLVEDDUPLICATE
9408 3create-pull-request: auto push the branch if not presentMediumRobert Yang2.2 M3RESOLVEDFIXED
9409 2create-pull-request: add the ability to read env varMediumRobert Yang2.2 M3RESOLVEDFIXED
9410 2create-pull-request: automatically add the subject when there is only one patchMediumRobert Yang2.2 M3RESOLVEDFIXED
9411 5runqemu: make it support arch as the parameter rather than machineUndecidedRobert Yang2.2 M3RESOLVEDDUPLICATE
9421 10kernel: add an ability to build from an existing .configMediumRobert Yang2.2 M3RESOLVEDNOTABUG
9436 3lib/bb/fetch2/git.py: print more friendly errors messages when failedlib/bb/fetch2/git.pyMediumChen Qi2.2 M3RESOLVEDWORKSFORME
9466 7enhance kernel configuration audit to include reasons for missing configs, and required config checkingMedium+Bruce Ashfield2.2 M3RESOLVEDFIXED
9538 10Review common security hardening flags and expand security_flags.incMedium+Joshua Lock2.2 M3RESOLVEDFIXED
9624 1build-perf-test: store test results in GitMedium+Markus Lehtonen2.2 M3RESOLVEDFIXED
9625 1build-perf-test: re-organize test output dataMedium+Markus Lehtonen2.2 M3RESOLVEDFIXED
9756 2Plan clean up and improvements for oeqaMedium+Aníbal Limón2.2 M3RESOLVEDFIXED
9835 Split container/vm related systemd services into a separate packageMediumChen Qi2.2 M3RESOLVEDFIXED
9861 1Suggested additions to the dependencies sectionMediumScott Rifenbark2.2 M3RESOLVEDFIXED16 July 2016: RESOLVED
9869 5Provide a per-target manifest of files which were, or would have been, producedMedium+Ed Bartosh2.2 M3RESOLVEDFIXED
9874 2patchtest-oe: check that patches are removed if these are removed from the SRC_URIMedium+Daniela Plascencia2.2 M3RESOLVEDFIXED
9875 2patchtest-oe: in case upstream link change (SRC_URI), check that checksums flags also indicated this changeMedium+Daniela Plascencia2.2 M3RESOLVEDFIXED
9899 1Add REMOVE_PKG_SUPPORT to variable referenceMediumScott Rifenbark2.2 M3RESOLVEDFIXED01 Sept 2016: RESOLVED
9904 1patchwork: show cover letter message in series created with pull requestHighJose Lamego2.2 M3RESOLVEDFIXED
9909 1Suggested clarification re. implementation and limitations of BBCLASSEXTENDMediumScott Rifenbark2.2 M3RESOLVEDFIXED16 July 2016: RESOLVED
9933 1Suggested additions to the DEPENDS documentationMediumScott Rifenbark2.2 M3RESOLVEDFIXED18 July 2016: RESOLVED
9940 autobuilder will need an eclipse-poky recipe for the Neon branchMedium+Bill Randle2.2 M3RESOLVEDFIXED
9963 1Warning against ${PN}-dev-related gotcha in the RDEPENDS glossary entryUndecidedScott Rifenbark2.2 M3RESOLVEDFIXED18 July 2016: RESOLVED
9967 1Suggested fleshing out of the do_package documentationUndecidedScott Rifenbark2.2 M3RESOLVEDFIXED18 July 2016: IN PROGRESS REVIEW
9968 1Suggested fleshing out of the do_populate_sysroot documentationUndecidedScott Rifenbark2.2 M3RESOLVEDFIXED18 July 2016: IN PROGRESS REVIEW
9970 1Suggested fleshing out of the do_deploy documentationUndecidedScott Rifenbark2.2 M3RESOLVEDFIXED19 July 2016: RESOLVED
9976 1Suggested addition to 2.3. Debugging Build Failures re. missing build-time dependenciesUndecidedScott Rifenbark2.2 M3RESOLVEDFIXED19 July 2016: RESOLVED
9983 1host-user-contaminated, invalid-chars, and invalid-packageconfig are missing from '7.62. insane.bbclass'UndecidedScott Rifenbark2.2 M3RESOLVEDFIXED19 July 2016: RESOLVED
9984 1Suggested clarification of the '3.1.2. Variable Expansion' sectionMediumScott Rifenbark2.2 M3RESOLVEDFIXED01 August 2016: RESOLVED
9988 1Suggested clarification of the STAGING_DIR_* glossary entriesMediumScott Rifenbark2.2 M3RESOLVEDFIXED22 Sept 2016: RESOLVED
9989 1Two tiny documentation nits re. D and do_checkpkgMediumScott Rifenbark2.2 M3RESOLVEDFIXED21 July 2016: IN PROGRESS REVIEW
10057 1patchtest: create a cron job to monitor oe-core mailing listMedium+Leonardo Sandoval Gonzalez2.2 M3RESOLVEDFIXED
10088 RMC:RMC Project - add dynamic linking option for C libMediumJianxun Zhang2.2 M3RESOLVEDFIXED
10118 3Make a bitbake container similar to the extsdk container, but for multiple releases like the toaster containerMedium+brian avery2.2 M3RESOLVEDFIXED
7744 3Improve messaging in empty states when Toaster does not have any layer informationMediumBelen Barros Pena2.2 M4RESOLVEDWONTFIXGUI design pending
8851 5Add bashism checks for shell script functionsMedium+Ross Burton (Arm)2.2 M4RESOLVEDFIXED
9457 10patchtest: document deployment with isolation featuresHighLeonardo Sandoval Gonzalez2.2 M4RESOLVEDFIXED
9672 2Add documentation for package installation during runtime testingMediumScott Rifenbark2.2 M4RESOLVEDFIXED7 June 2016: ACCEPTED
9679 1Add a small section on dependencies in the Writing a New Recipe sectionMedium+Scott Rifenbark2.2 M4RESOLVEDFIXED04 Oct 2016: RESOLVED
9737 1[PATCH] ui/knotty: give out start time of taskMedium+Richard Purdie2.2 M4RESOLVEDFIXED
10066 1Suggested new section on listing package contentsMediumScott Rifenbark2.2 M4RESOLVEDMOVED07 Sept 2016: RESOLVED/MOVED
10119 1eSDK container solution should be extended to run on windows (and mac)Medium+Randy Witt2.2 M4RESOLVEDFIXED
10120 5Bitbake container solution should be extended to run on windows (and mac)Medium+Randy Witt2.2 M4RESOLVEDFIXED
10375 2patchtest: result summary must be created inside guestMedium+Leonardo Sandoval Gonzalez2.2 M4RESOLVEDFIXED
10410 3Solve conflict on python-unidiff v1 recipeMedium+Daniela Plascencia2.2 M4RESOLVEDFIXED
3043 3runqemu: Investigate and implement (if possible) a local firewall sanity checkMediumTodor Minchev2.3RESOLVEDOBSOLETE
3420 6Audit *-standard.scc and move non-hardware items up into standard.sccMediumBruce Ashfield2.3RESOLVEDFIXED
3990 qemuarm and qemuppc poky-tiny images can not boot up via "runqemu qemuarch ramfs" commandMediumJackie Huang2.3RESOLVEDOBSOLETE
5654 5Add EFI to qemux86 and qemux86-64MediumPatrick Ohly2.3RESOLVEDFIXED
6287 5Release scripts for BSPs/images.MediumBeth 'pidge' Flanagan2.3RESOLVEDWONTFIX
7691 1Locking of branch/repoMediumUnassigned2.3RESOLVEDWONTFIXWas Bill Randle
9078 When changing SDKIMAGE_FEATURES to "dev-pkgs", some -dbg packages are still installedLowRoss Burton (Arm)2.3RESOLVEDFIXED
9129 4Enhance Test Suite scanning and executionMediumLeonardo Sandoval Gonzalez2.3RESOLVEDDUPLICATE
9224 3[meta-swupd] Try to speed up update generation by parallelising calls to swupd_* programs where possibleMediumJoshua Lock2.3RESOLVEDINVALID
9591 0.5Zephyr project configuration should allow kernel and app to be in different folder hierachiesMediumTodor Minchev2.3RESOLVEDFIXED
9726 10Add support for autobuilder to create CROPS containersMediumJoshua Lock2.3RESOLVEDWONTFIX
9931 oe-selftest: Increase organization of codeMediumMariano Lopez2.3RESOLVEDDUPLICATE
10125 RMC: RMC Project - Provide test suites to run on host and targetsMediumJianxun Zhang2.3RESOLVEDFIXED
10241 1Missing files in rootfs when adding links /bin ->/usr/bin and /lib -> /usr/lib in recipe base-filesMediumJoshua Lock2.3RESOLVEDNOTABUG
10242 Improve the detection of misplaced parametersMediumRoss Burton (Arm)2.3RESOLVEDWONTFIX
10404 1MIPS: Use MACHINEOVERRIDES and reduce duplication in various recipes due to mips variantsMediumZubair Lutfullah Kakakhel2.3RESOLVEDFIXED
10470 I would like to be able to set kernel CONFIGS from my local.conf fileLowBruce Ashfield2.3RESOLVEDINVALID
10475 1Document correct usage of FuncFailedMediumJoshua Lock2.3RESOLVEDWORKSFORME
10584 3rm_work.bbclass: reduce maximum amount of disk space required for a buildMediumPatrick Ohly2.3RESOLVEDFIXED
10637 1WIC image dependencies are not included in the buildMediumEd Bartosh2.3RESOLVEDFIXED
10743 build-perf-test: Add test to verify if parsing time is improved with a hot codeparser cacheMediumMarkus Lehtonen2.3RESOLVEDFIXED
11056 yocto-autobuilder-setup fails on openSUSE clean installMediumJoshua Lock2.3RESOLVEDFIXED
5546 2Optimise away meta-oe X init mechanismHighJussi Kukkonen2.3 M1RESOLVEDFIXED
8880 5Need better allarch multilib sanity or automated QA testsMedium+Chen Qi2.3 M1RESOLVEDFIXED
9088 3Extensible SDK add tests for devtoolMedium+Francisco Pedraza2.3 M1RESOLVEDFIXED
9189 1[meta-swupd] Creates a lot of duplicate filesMediumPatrick Ohly2.3 M1RESOLVEDFIXED
9390 10oeqa: don't write anything to local.conf or bblayers.confMediumJose Lamego2.3 M1RESOLVEDFIXED
9570 2Zephyr Container for Windows/Mac/LinuxMediumTodor Minchev2.3 M1RESOLVEDFIXED
9954 4report tool: a communication mechanism for sending resultsHighMariano Lopez2.3 M1RESOLVEDFIXED
10058 1patchtest-oe: check SUMMARY presence on new recipesMediumDaniela Plascencia2.3 M1RESOLVEDDUPLICATE
10059 2patchtest-oe: check bitbake datastore variables on classes or includesMedium+Leonardo Sandoval Gonzalez2.3 M1RESOLVEDFIXED
10064 1patchtest: Series Details must contain the revisionMedium+Daniela Plascencia2.3 M1RESOLVEDFIXED
10078 1patchtest-oe: check patch authorMediumLeonardo Sandoval Gonzalez2.3 M1RESOLVEDFIXED
10112 5Patchtest-oe: tests summary must provide patch nameMedium+Leonardo Sandoval Gonzalez2.3 M1RESOLVEDFIXED
10327 sstate mirror does not serve up the (contents of ) the uninative tarballMediumbrian avery2.3 M1RESOLVEDFIXED
10413 0.25recipetool: use & to split licenses in LICENSE valueMediumPaul Eggleton2.3 M1RESOLVEDFIXED
10469 2Install package dependencies for patchtest image (poky) developmentMedium+Leonardo Sandoval Gonzalez2.3 M1RESOLVEDFIXED
10509 Include patchwork repository into git.yp.orgHighMichael Halstead2.3 M1RESOLVEDFIXED
10511 Patchwork production instance code base must point to git.yp.org repoHighMichael Halstead2.3 M1RESOLVEDFIXED
10527 2Travis test for the build of an out of kernel app for Zephyr containerMediumTodor Minchev2.3 M1RESOLVEDFIXED
10625 2Don't show "Series without cover letter" for series without cover letterMedium+Jose Lamego2.3 M1RESOLVEDFIXED
10702 1add meta-swupd to update mechanism overviewMediumPatrick Ohly2.3 M1RESOLVEDFIXED
1560 5Enable recipe specific sysrootsHighRichard Purdie2.3 M2RESOLVEDFIXED
3276 3PulseAudio isn't testedMediumJuan Ramos2.3 M2RESOLVEDFIXED
4144 2Runtime performance testingMedium+Humberto Ibarra2.3 M2RESOLVEDOBSOLETE
4527 3create a Runtime performance test layer to enable runtime performance testsMedium+Humberto Ibarra2.3 M2RESOLVEDFIXED
4528 2boot time should be tracked for systemd and SysVinitMedium+Humberto Ibarra2.3 M2RESOLVEDOBSOLETE
5369 3Create test plan to do performance analysis of x32 runtimeMedium+Humberto Ibarra2.3 M2RESOLVEDOBSOLETE
5477 2Check for any performance degradations with gcc security flags enabledMedium+Humberto Ibarra2.3 M2RESOLVEDOBSOLETE
5478 2test build time performance degradations with gcc security flags enabledMedium+Humberto Ibarra2.3 M2RESOLVEDOBSOLETE
6296 2Add support for runtime performance tests to image_testsMedium+Humberto Ibarra2.3 M2RESOLVEDOBSOLETE
6607 Auto-detect client locale and use for date formattingLowbrian avery2.3 M2RESOLVEDFIXED
7096 2Document how to use initramfs featuresMediumCalifornia Sullivan2.3 M2RESOLVEDFIXED25 Jan 2017: RESOLVED
7546 5Streamline application development manualMediumScott Rifenbark2.3 M2RESOLVEDFIXED08 Nov 2016: RESOLVED
7887 3Add support for user networking to runqemuHighRobert Yang2.3 M2RESOLVEDFIXED
8719 10Ensure bootable images can be supported by wic for all reference BSPsMediumEd Bartosh2.3 M2RESOLVEDFIXEDLET
8724 3Automate information collection for runtime errorsMedium+Todor Minchev2.3 M2RESOLVEDFIXED4
8727 0.1fetcher: should not log errors but pass them for handlingMediumJose Lamego2.3 M2RESOLVEDWONTFIX
9166 1Need to document the do_devpyshell task that is in the devshell.bbclassMediumScott Rifenbark2.3 M2RESOLVEDFIXED08 Nov 2016: RESOLVED
9468 3Export Tests execution (Runexport.py) execution log needs improvementsMediumMariano Lopez2.3 M2RESOLVEDFIXED
9689+ Create a python library for automatic device manipulationMedium+Benjamin Esquivel2.3 M2RESOLVEDFIXED
10233 2oeqa: Runner add the ability to output XML test resultsMedium+Mariano Lopez2.3 M2RESOLVEDFIXED
10235 2oeqa: Implement OETiemout decoratorMedium+Mariano Lopez2.3 M2RESOLVEDFIXED
10236 2oeqa: Implement OETag decorator.Medium+Mariano Lopez2.3 M2RESOLVEDFIXED
10352 15Performance of bitbake -S is horribleHighJianxun Zhang2.3 M2RESOLVEDFIXED
10353 3oeqa allow to filter tests based on different criteriaMedium+Mariano Lopez2.3 M2RESOLVEDFIXED
10467 2Link to BuildLog entries from autobuilder UIMedium+Joshua Lock2.3 M2RESOLVEDFIXED
10502 1Ensure BuildLogger doesn't try and update whilst the target wiki page is being editedMedium+Joshua Lock2.3 M2RESOLVEDINVALID
10530 add dumbinit as entry point for crops containersMediumRandy Witt2.3 M2RESOLVEDFIXED
10590 3build-perf-test: suitable test report formatMedium+Markus Lehtonen2.3 M2RESOLVEDFIXED
10627 3Way to navigate through patches in a seriesMedium+Jose Lamego2.3 M2RESOLVEDFIXED
10658 1Support for IAMCU baremetal toolchain for Zephyr imagesMedium+Juro Bystricky2.3 M2RESOLVEDFIXED
10659 1.5Support for ARC baremetal toolchain for Zephyr imagesMedium+Juro Bystricky2.3 M2RESOLVEDFIXED
10660 2Support for Nios2 baremetal toolchain for Zephyr imagesMedium+Juro Bystricky2.3 M2RESOLVEDFIXED
10662 3Provide "newlib" for Zephyr imagesMedium+Juro Bystricky2.3 M2RESOLVEDFIXED
10663 5Create BSP binary package classMedium+Stephano Cetola2.3 M2RESOLVEDDUPLICATE
10704 add OSTree to update mechanism overviewMediumIsmo Puustinen2.3 M2RESOLVEDFIXED
10710 1make it be able to login as root by default when debug-tweaks is not setMediumRobert Yang2.3 M2RESOLVEDWONTFIX
10747 Add support for testing wic images on non x86 platformsMedium+Yi Zhao2.3 M2RESOLVEDFIXED
10762 1patchwork: Enable automatic status update when patches are merged for all projectsMedium+Jose Lamego2.3 M2RESOLVEDFIXED
10778 2Adopt skipStep() throughout the codebaseMediumJoshua Lock2.3 M2RESOLVEDFIXED
5427 5Extend and tidy up layer sanity checkingMediumAníbal Limón2.3 M3RESOLVEDDUPLICATE
8200 1Add acl to default DISTRO_FEATURES?MediumRoss Burton (Arm)2.3 M3RESOLVEDFIXED
9460 1Provide a way to automate testing of meta-mingwMedium+Joshua Lock2.3 M3RESOLVEDFIXED
9894 1Investigate porting smartpm, createrepo to python3Medium+Chen Qi2.3 M3RESOLVEDWONTFIX
9944 1patchtest-oe: check that patch was sent to the correct mailing listMedium+Leonardo Sandoval Gonzalez2.3 M3RESOLVEDDUPLICATE
10092 5RMC: RMC Project - Provide dumpers for fingerprint and database fileMedium+Todor Minchev2.3 M3RESOLVEDFIXED
10215 4Add a class which allows buiding git upstream versions of code using BBCLASSEXTENDMedium+Ross Burton (Arm)2.3 M3RESOLVEDFIXED
10325 1.5license.bbclass should only copy licenses for packages actually installedMediumAníbal Limón2.3 M3RESOLVEDFIXED
10558 3.5Create Nexus instance (a java repository manager)HighMichael Halstead2.3 M3RESOLVEDWORKSFORME
10619 10Refactor wic codebaseMediumEd Bartosh2.3 M3RESOLVEDFIXEDLET
10624 1Ability to set patch metadata from a mailMedium+Jose Lamego2.3 M3RESOLVEDFIXED
10626 3git-pw needs bundle supportMedium+Leonardo Sandoval Gonzalez2.3 M3RESOLVEDFIXED
10661 2Provide support to run Zephyr images in QEMUMedium+Juro Bystricky2.3 M3RESOLVEDFIXED
10678 0.5Drop usage/support of bb.data.expand() and replace with d.expand()Medium+Joshua Lock2.3 M3RESOLVEDFIXED
10688 2Add a test looking for common paths that indicate patch is for the wrong layerMedium+Leonardo Sandoval Gonzalez2.3 M3RESOLVEDFIXED
10703 add mender.io to update mechanism overviewMediumMariano Lopez2.3 M3RESOLVEDFIXED
10707 Fix CVE defects in openssl by upgrading bugfix/letter releaseMedium+Randy MacLeod2.3 M3RESOLVEDWONTFIX
10789 5patchtest-oe: Include a test case that fails in case pylint issues are found on new patch changesMedium+Daniela Plascencia2.3 M3RESOLVEDFIXED
10819 0.5Support range select in patch listMedium+Jose Lamego2.3 M3RESOLVEDFIXED
10822 3Multiple select/change state controls in series viewMedium+Jose Lamego2.3 M3RESOLVEDFIXED
10823 0.5A V2 series wasn't detected as suchMedium+Jose Lamego2.3 M3RESOLVEDFIXED
10905 2Difficult to find status of patchMedium+Scott Rifenbark2.3 M3RESOLVEDFIXED18 Jan 2017: IN PROGRESS REVIEW
10924 5RMC: Bring supported RMC functions to systemd-boot efi stubMedium+Mikko Ylinen2.3 M3RESOLVEDFIXED
10951 12Runtime Performance testing frameworkMedium+Humberto Ibarra2.3 M3RESOLVEDINVALID
11037 5selftest: Optimize use of get_bb_varMedium+Mariano Lopez2.3 M3RESOLVEDFIXED
11088 1wikilog must handle non-Latin characters in wiki page contentMedium+Joshua Lock2.3 M3RESOLVEDFIXED
6700 2systemd's resolved conflicts with connmanMediumChen Qi2.3 M4RESOLVEDWORKSFORME
8314 5warn when ALTERNATIVE_PRIORITY are the sameMediumChen Qi2.3 M4RESOLVEDFIXED
9037 1Consider alternate methods for maintain Yocto releases after 1yrMedium+Richard Purdie2.3 M4RESOLVEDFIXED
9423 5devshell: export CONFIGUREOPTS to envMediumRobert Yang2.3 M4RESOLVEDFIXED
9675 30Replacing/updating smartpm/createrepoMedium+Scott Rifenbark2.3 M4RESOLVEDFIXED10 April 2017: RESOLVED
9962 1Suggested additions to the --help output re. -v and -DMediumDiana Thayer2.3 M4RESOLVEDFIXED
10596 5Enable tests of layers for compatibility (YP Compatible v2)HighRichard Purdie2.3 M4RESOLVEDFIXED27 March 2017: Setting to 2.3 M4
10618 3Increase oe-selftest coverage of wic codebaseMedium+Ed Bartosh2.3 M4RESOLVEDFIXED
10692 1Add references to SYSROOT_DIRSMediumScott Rifenbark2.3 M4RESOLVEDFIXED18 Nov 2016: IN PROGRESS REVIEW
10878 1source code lines should not exceed more than 80 charactersMedium+Leonardo Sandoval Gonzalez2.3 M4RESOLVEDFIXED
11021 2Section on source archiving needs to discuss filtering optionsMediumScott Rifenbark2.3 M4RESOLVEDFIXED10 April 2017: RESOLVED
11027 0.5patchwork: Notify if status-change-through-email was attempted without required privilegesMediumJose Lamego2.3 M4RESOLVEDFIXED
11066 4Reference Kit Secure BootMediumMikko Ylinen2.3 M4RESOLVEDFIXED
11068 2QEMU as a supported platformMediumDmitry Rozhkov2.3 M4RESOLVEDFIXED
11070 2whole-disk encryptionMediumPatrick Ohly2.3 M4RESOLVEDFIXED
11071 2installer imageMediumPatrick Ohly2.3 M4RESOLVEDFIXED
11072 2integrity protectionMediumPatrick Ohly2.3 M4RESOLVEDFIXED
11076 Supported hardware definitionMediumJussi Laako2.3 M4RESOLVEDFIXED
11079 0.5devtool deploy.py should allow for changing the port for ssh/scpMediumTim Orling2.3 M4RESOLVEDFIXED
11080 Enabling testing TPM(v1.2) Support on QEMUMediumAmaranth Valluri2.3 M4RESOLVEDFIXED
11081 BT Audio SupportMediumJaska Uimonen2.3 M4RESOLVEDFIXED
11083 GPLv3 free computer vision profileMediumIsmo Puustinen2.3 M4RESOLVEDFIXED
11085 Computer vision demo/testing setupLowIsmo Puustinen2.3 M4RESOLVEDFIXED
11118 selftest: some testexport tests need a previous build to runMediumJose Perez C2.3 M4RESOLVEDNOTABUG
11129 thermald should be included in images without explicit pull-inMediumJussi Laako2.3 M4RESOLVEDFIXED
7671 Feature request: integrate task-level exports supportMediumChristopher Larson2.4RESOLVEDFIXED
7958 2Implement shallow git clone functionalityMediumChristopher Larson2.4RESOLVEDFIXED
8596 3Document proper way of adding a userspace header for the kernelMediumMark Hatle2.4RESOLVEDFIXED09 August 2017: RESOLVED
8631 3Fully document sysroot populationMediumKristi2.4RESOLVEDFIXED27 September 2017: RESOLVED
9350 4As a developer, I want a global variable exist for choosing the default SSL/TLS provider.MediumJussi Kukkonen2.4RESOLVEDWONTFIX
9998 5packaging: src separately from dbgMediumJuan Manuel Cruz Alcaraz2.4RESOLVEDFIXED
10087 RMC: RMC Project - reduce memory copyingLowNg, Wei Tee2.4RESOLVEDOBSOLETE
10126 5RMC: Bring supported RMC functions to grub-efi bootloaderMediumTodor Minchev2.4RESOLVEDOBSOLETE
10355 patchtest-oe: test method for wrong formatted patchesUndecidedDaniela Plascencia2.4RESOLVEDDUPLICATE
10383 1create test for subprocess calls to identify problemsMediumStephano Cetola2.4RESOLVEDFIXED
10512 3Create an automation module for a 2 to 1 USB MultiplexerMediumPlauchu Edwin2.4RESOLVEDOBSOLETE
10550 4Build yocto Eclipse CROPS documentation using Saxon/JaxonMediumbrian avery2.4RESOLVEDOBSOLETE
10564 5Fix PR Sharing PR server between builders with different metadataMediumJuan Manuel Cruz Alcaraz2.4RESOLVEDDUPLICATE
10580 4attach an html results page at the Autobulider's testing jobsMediumPlauchu Edwin2.4RESOLVEDDUPLICATE
10638 5RMC: Refactoring database generation in rmc.bbclassMediumTodor Minchev2.4RESOLVEDOBSOLETE
11133 5RMC: Multiple fingerprints per BoardMediumTodor Minchev2.4RESOLVEDOBSOLETE
11136 devtool: Being able to change a devtool generated recipe from git to a tagged versionMediumBehan Webster2.4RESOLVEDFIXED
11169 prelink recipe checks USER_CLASSES for image-prelinkMediumMark Hatle2.4RESOLVEDFIXED
11345 7Support both MUSL and x32 as a build option combinationMediumsweeaun2.4RESOLVEDMOVEDLET
11356 1oe-selftest: add an assertExists() function and change tests to use itMediumyeoh ee peng2.4RESOLVEDFIXED
11441 0.2archiver.bbclass should not cause kernel rebuildsMediumPatrick Ohly2.4RESOLVEDFIXED
11446 7Flexibility and configurability to boot from any partitionMediumsweeaun2.4RESOLVEDOBSOLETE
11451 17Bring in Juci from openWRT as an on target network configuratorMedium+Stanley Phoong2.4RESOLVEDFIXED
11653 5Remove uclibc-specific patches/overrides from recipesMediumRichard Purdie2.4RESOLVEDFIXED
11752 3selftest test cases should use the test data and/or tinfoil instead of bitbakeMediumLeonardo Sandoval Gonzalez2.4RESOLVEDWONTFIX
11824 1Show real host information instead of uninative infomationMediumLeonardo Sandoval Gonzalez2.4RESOLVEDFIXED
11888 1patchwork: no way to send a link to a patch from a seriesMediumJose Lamego2.4RESOLVEDFIXED
11897 checkvnc script fails on Centos 7 due to netstat being deprecatedMediumTracy Graydon2.4RESOLVEDFIXED
6319 1Automated storage and graphing of build performance metricsMedium+Markus Lehtonen2.4 M1RESOLVEDFIXEDTRT
8673 2distutils3 packages installed via an egg file cannot be imported by the python3 interpreterMedium+Jose Lamego2.4 M1RESOLVEDNOTABUG
8962 5AUH: Add support for meta-intelMedium+Aníbal Limón2.4 M1RESOLVEDFIXED
10641 2Python manifest script should also generate native RPROVIDESMedium+Jose Lamego2.4 M1RESOLVEDFIXED
10689 4oeqa: migrate selftest old framework to new frameworkMedium+Leonardo Sandoval Gonzalez2.4 M1RESOLVEDDUPLICATE
11067 4Reference Kit Industrial Robotics profileMedium+Dmitry Rozhkov2.4 M1RESOLVEDFIXED
11137 1WIC needs to support FAT16Medium+Ed Bartosh2.4 M1RESOLVEDFIXED
11180 Switch RPM4, dnf and co to Python3Medium+Alexander Kanavin2.4 M1RESOLVEDFIXED
11181 5Remove Python 2 as a host tool or needing to be built for our core imagesMedium+Alexander Kanavin2.4 M1RESOLVEDFIXED
11182 1Make it easier to add Python to an imageMedium+Ross Burton (Arm)2.4 M1RESOLVEDFIXED
11215 4Decouple test injection mechanism in DAFTMedium+Plauchu Edwin2.4 M1RESOLVEDFIXED
11219 5Newer test specification format needed for DAFTMedium+Plauchu Edwin2.4 M1RESOLVEDOBSOLETE
11233 1Improve test_archiver_allows_to_filter_on_recipe_name runtimeMedium+Leonardo Sandoval Gonzalez2.4 M1RESOLVEDINVALID
11234 1improve test_bmap_long runtimeMedium+Leonardo Sandoval Gonzalez2.4 M1RESOLVEDNOTABUG
11238 1improve test_postinst_roofs_and_boot performanceMedium+Leonardo Sandoval Gonzalez2.4 M1RESOLVEDNOTABUG
11282 1Write a wic tips and tricks for Minnowboard & JouleMedium+California Sullivan2.4 M1RESOLVEDFIXED
11283 7wic: allow wic to update a kernel or bootloader in a disk imageMedium+Ed Bartosh2.4 M1RESOLVEDFIXED
11290 3fetcher: donestamps for git repos are zero sized - missing Pickle dataMedium+Ross Burton (Arm)2.4 M1RESOLVEDWONTFIX
11294 0.5create-pull-request: add in-reply-to option to ensure patch/series threads don't breakMediumJose Lamego2.4 M1RESOLVEDFIXED
11305 0.5patchwork: Improve Series naming when no cover letter is providedMedium+Jose Lamego2.4 M1RESOLVEDFIXED
11320 3RMC: Extend grub-efi to process RMC database file from ESPMediumTodor Minchev2.4 M1RESOLVEDOBSOLETE
11355 2oe-build-perf-report: support viewing buildstatsMedium+Markus Lehtonen2.4 M1RESOLVEDFIXED
11413 Remove all the DEBIAN ftp server usage in SRC_URIsMedium+Maxin B. John2.4 M1RESOLVEDFIXED
11428 3Support building intel-iot-refkit with yocto-autobuilderMedium+Joshua Lock2.4 M1RESOLVEDFIXED
11450 6oeqa core add support for parallel runsHighAníbal Limón2.4 M1RESOLVEDFIXED
11462 5ROS-Core supportMediumDmitry Rozhkov2.4 M1RESOLVEDFIXED
11463 5RefKit: Python version alignmentLowDmitry Rozhkov2.4 M1RESOLVEDFIXED
11465 5Reference Kit Industrial Robotics Profile Detailed DocumentationMediumDmitry Rozhkov2.4 M1RESOLVEDFIXED
11467 14integrate a system update solutionHighPatrick Ohly2.4 M1RESOLVEDFIXED
11476 Nftables firewall supportMediumIsmo Puustinen2.4 M1RESOLVEDFIXED
11477 Detailed computer vision profile documentationMediumIsmo Puustinen2.4 M1RESOLVEDFIXED
11478 Move caffe from meta-refkit-extra to meta-refkitMediumIsmo Puustinen2.4 M1RESOLVEDFIXED
11482 0.5yocto-compat-layer.py: return non-zero exit codesMedium+Aníbal Limón2.4 M1RESOLVEDFIXED
11485 Refkit: Upgrade nodejs version(v5.11+)MediumAmaranth Valluri2.4 M1RESOLVEDFIXED
11493 1Enable building extensible SDK installer for profilesHighMikko Ylinen2.4 M1RESOLVEDFIXED
7040 5Support for /usr merge (à la systemd and Fedora)Medium+Amaranth Valluri2.4 M2RESOLVEDFIXED
7555 3make oe-init-build-env-memres default instead of oe-init-build-envHighPaul Eggleton2.4 M2RESOLVEDFIXED
8716 4Build summary page for incoming patch testingMedium+Jose Lamego2.4 M2RESOLVEDOBSOLETEGUI design pending
9277 1Improve archiver testingLowLeonardo Sandoval Gonzalez2.4 M2RESOLVEDDUPLICATE
9878 5feature request: secure boot layerHighCalifornia Sullivan2.4 M2RESOLVEDFIXED
10506 3Patchwork: Improve Bundle view to include build resultsMedium+Jose Lamego2.4 M2RESOLVEDOBSOLETE
10599 5oeqa: migrate selftest's test to use the new frameworkMedium+Leonardo Sandoval Gonzalez2.4 M2RESOLVEDFIXED
10604+ 5Add an autobuilder worker capable of HW image testingMedium+Aníbal Limón2.4 M2RESOLVEDFIXED
10632 2Add distro selection supportMediumDavid Reyna2.4 M2RESOLVEDFIXED
10720 1patchtest: Create a script for OE-Core to fetch and set up environment for patchtestMedium+Leonardo Sandoval Gonzalez2.4 M2RESOLVEDFIXED
10828 1get_tests_from_module() shouldn't assume oeSelfTestMedium+Aníbal Limón2.4 M2RESOLVEDFIXED
11031 1Regularly run checkpkg on yocto autobuilderMediumAlexander Kanavin2.4 M2RESOLVEDFIXED
11188 1devtool: optimise task executionMediumPaul Eggleton2.4 M2RESOLVEDFIXED
11192 Generate development image suitable for all RefKit profilesMediumJaska Uimonen2.4 M2RESOLVEDNOTABUG
11228 1Make decision on default Xorg driver for intelMedium+Jussi Kukkonen2.4 M2RESOLVEDNOTABUG
11286 2runqemu should validate the rootfs type it is trying to use and print clear message if unsupported.MediumRobert Yang2.4 M2RESOLVEDFIXED
11321 3RMC: grub-efi - append KBOOTPARAM to linux boot entry's cmdlineMediumTodor Minchev2.4 M2RESOLVEDOBSOLETE
11380 1Get rid of gnome-commonMedium+Jussi Kukkonen2.4 M2RESOLVEDFIXED
11383 2tinfoil: enable running tasks with dependenciesMedium+Paul Eggleton2.4 M2RESOLVEDFIXED
11417 2Avoid checksums invalidation when inherit from ccacheMedium+Ross Burton (Arm)2.4 M2RESOLVEDFIXED
11447 Configurability to boot from UEFI boot partition or direct boot without bootloaderMedium+California Sullivan2.4 M2RESOLVEDFIXED
11454 2Rationalise autobuilder configurationMedium+Joshua Lock2.4 M2RESOLVEDFIXED
11469 Graphics support for IoT Reference KitHighJussi Laako2.4 M2RESOLVEDFIXED
11481 Refkit image configuration guidelinesMediumIsmo Puustinen2.4 M2RESOLVEDFIXED
11530 5RMC:[EFI] modify shim to launch an EFI binary when not running in secure boot modeMediumNg, Wei Tee2.4 M2RESOLVEDWONTFIX
11610 1gdk-pixbuf: improve reproducibilityMedium+Jussi Kukkonen2.4 M2RESOLVEDFIXED
11627 3update max10 reference board to boot with 4.10 kernelMedium+Juro Bystricky2.4 M2RESOLVEDFIXED
6132 4Have persistent log data (/var/log)MediumChen Qi2.4 M3RESOLVEDFIXED06 Jan 2017: IN PROGRESS REVIEW
8717 2patchwork: keep build page up-to-date with important patch status changesMedium+Jose Lamego2.4 M3RESOLVEDOBSOLETE
8938 3oe-selftest: refactor command line arguments so usage is simplerMedium+Aníbal Limón2.4 M3RESOLVEDOBSOLETE
9708 oe-selftest --list-tests with options to control fields shownMediumAníbal Limón2.4 M3RESOLVEDOBSOLETE
10317 2oeqa tests are incompatible with python's unittest runnerMedium+Mariano Lopez2.4 M3RESOLVEDWONTFIX
10510 5devtool: add ability to export / import work in progressMedium+Leonardo Sandoval Gonzalez2.4 M3RESOLVEDFIXED
10667 2Define packagegroup for python3MediumJose Lamego2.4 M3RESOLVEDFIXED
10803 5Patchtest migration from python2 to python3Medium+Daniela Plascencia2.4 M3RESOLVEDFIXED
10804 3Patchtest-oe migration from python2 to python3MediumDaniela Plascencia2.4 M3RESOLVEDFIXED
10931 5Improve indicators on automated performance reportsMediumLeonardo Sandoval Gonzalez2.4 M3RESOLVEDFIXED
10937 2remove from oe-selftest buildsets the step for building an image prior the test sessionMedium+Joshua Lock2.4 M3RESOLVEDFIXED
10996 1test_ccache_tool taking too long on main ABMedium+Leonardo Sandoval Gonzalez2.4 M3RESOLVEDFIXED
11091 10update openssl to 1.1Medium+Alexander Kanavin2.4 M3RESOLVEDFIXEDLET
11241 2binary reproducibility: .pyc files contain timestampsMedium+Juro Bystricky2.4 M3RESOLVEDFIXED
11278 4wic: create an option to use entire diskMedium+Ed Bartosh2.4 M3RESOLVEDFIXED
11316 5Trim down LSB supportMedium+Alexander Kanavin2.4 M3RESOLVEDFIXED
11338 5RMC: records cannot be added to and removed from an existing RMC databaseMediumTodor Minchev2.4 M3RESOLVEDOBSOLETE
11529 0.1Add LLVMMedium+Khem Raj2.4 M3RESOLVEDFIXED
11547 5Add regression check for ptestMedium+Robert Yang2.4 M3RESOLVEDFIXED
11587 1add "fence flag" to cross toolchainMedium+Juro Bystricky2.4 M3RESOLVEDWORKSFORME
11592 3Add QA check for uppercase recipe namesMediumyeoh ee peng2.4 M3RESOLVEDFIXED
11676 10recipetool: create: add support for ROS modulesMedium+Mark Horn2.4 M3RESOLVEDFIXED
11697 1master builds shouldn't include qt4 anymoreMedium+Ross Burton (Arm)2.4 M3RESOLVEDFIXED
11745 2nightly-refkit CreateBBLayersConf should be dynamicMediumStephano Cetola2.4 M3RESOLVEDFIXED
11788 0.5Drop package publishingMedium+Joshua Lock2.4 M3RESOLVEDFIXED
11847 1Add an option to oe-selftest to run all tests except for [...]Medium+Leonardo Sandoval Gonzalez2.4 M3RESOLVEDFIXED
11848 0.5Run checkpkg oe-selftest separately from nightly/nightly-oe-selftest on a weekly basisHighJoshua Lock2.4 M3RESOLVEDFIXED
11916 0.5e2fsprogs-doc: improve reproducible buildLowJuro Bystricky2.4 M3RESOLVEDFIXED
2658 5Create Kernel Device Driver SDK (host-side)MediumScott Rifenbark2.4 M4RESOLVEDFIXED26 Sept 2017: RESOLVED
9960 5patchtest-oe: implement 'selftest' validation patches for the test suiteMedium+Daniela Plascencia2.4 M4RESOLVEDFIXED
10513 3Show Yocto Project compatible status in the layer indexMedium+Amanda Brindle2.4 M4RESOLVEDFIXED
11214 1perl and systemd-boot failing on configure steps with poky-tiny policyMedium+Aníbal Limón2.4 M4RESOLVEDWONTFIX
11452 5Add a YP Compatible (V2) flag/column for layers on layers.openembedded.orgHighAmanda Brindle2.4 M4RESOLVEDFIXED
11475 Rock-paper-scissors demo based on RefKit computer vision profileLowChristian da Costa2.4 M4RESOLVEDFIXED
11480 Integrate YOLO to RefkitLowIsmo Puustinen2.4 M4RESOLVEDFIXED
11581 3Performance enhancement for kernel recipe kernel_configcheckMediumBruce Ashfield2.4 M4RESOLVEDWORKSFORME
11591 2Enable x86: Set dl_platform and dl_hwcap from CPU featuresMediumJuro Bystricky2.4 M4RESOLVEDFIXED
11731 1Docs: poky and meta-intel branch names in quick start guide represent a moving targetMediumSaul Wold2.4 M4RESOLVEDFIXED07 Sept 2017: RESOLVED
11804 2Convenience branch dropdown when starting new buildsMedium+Joshua Lock2.4 M4RESOLVEDFIXED
11868 1wic.Wic.test_mkfs_extraopts - Testcase -1 opensuse422MediumJose Perez C2.4 M4RESOLVEDFIXED
11871 1distrodata.Distrodata.test_checkpkg - Testcase -1: ubuntu1604MediumJose Perez C2.4 M4RESOLVEDFIXED
11887 1patchwork: series page shows cover letter tab by default even if no cover letterMediumJose Lamego2.4 M4RESOLVEDFIXED
11901 3[meta-openwrt][meta-configuration] integrating juci-lighttpd for JuciMediumRebecca Chang2.4 M4RESOLVEDFIXED
11947 devtool upgrade needs to have some git configs set to get correct resultsMedium+Paul Eggleton2.4 M4RESOLVEDFIXED
   398      
Alexandru Georgescu
7575Alexandru Georgescu8Identify image recipesMediumAlex Franco2.1RESOLVEDFIXEDGUI design available
7491Alexandru Georgescu10AUH: Add support for boot qemu imagesMediumAníbal Limón2.1 M1RESOLVEDFIXED
7576Alexandru Georgescu5AUH: Add ptest supportMediumAníbal Limón2.1 M1RESOLVEDFIXED
7655Alexandru Georgescu1patchwork: proper support for seriesMediumJose Lamego2.1 M1RESOLVEDFIXED
7809Alexandru Georgescu2RRS: have the url reflect the current searchLowAníbal Limón2.1 M1RESOLVEDFIXED
8690Alexandru Georgescu3make npm style packages something devtool can also build/recipeize on the flyMedium+Paul Eggleton2.1 M3RESOLVEDFIXED
7855Alexandru Georgescu2Show blacklist information in layer indexMediumLeonardo Sandoval Gonzalez2.2 M1RESOLVEDFIXEDGUI design available
9244Alexandru Georgescu5patchtest-oe: Create tests to validate recipes, classes or config filesMedium+Leonardo Sandoval Gonzalez2.2 M2RESOLVEDFIXED
7654Alexandru Georgescu2patchwork: ensure superseded patches are marked as suchMedium+Jose Lamego2.2 M3RESOLVEDFIXED
8162Alexandru Georgescu4patchwork: clear out the superseded and already merged patchesMedium+Michael Halstead2.2 M4RESOLVEDFIXED
8193Alexandru Georgescu3add wiki reporting to public ABMediumUnassigned2.3RESOLVEDOBSOLETE
   11      
Aníbal Limón
8658Aníbal Limón0.5extensible SDK: make it more obvious when SDK installation failsMediumPaul Eggleton2.1RESOLVEDFIXED
6651Aníbal Limón5Trim size of extensible SDKMedium+Randy Witt2.1 M2RESOLVEDFIXED
8600Aníbal Limón2extensible SDK: add a means of easily adding pkgdata for a wide set of packagesMedium+Alexandru Georgescu2.1 M2RESOLVEDFIXED
8662Aníbal Limónextensible SDK: replace "SDK-Fixed" NATIVELSBSTRING usage with "universal"LowPaul Eggleton2.1 M2RESOLVEDFIXED
8723Aníbal Limónextensible SDK: remove limitation to 64-bit x86 machinesMedium+Randy Witt2.1 M2RESOLVEDFIXED
8949Aníbal LimónBuild extensible SDK on autobuilderHighBeth Flanagan2.1 M2RESOLVEDFIXED
8892Aníbal Limón5Extensible SDK: allow building a modified extensible SDK from the extensible SDKMedium+Paul Eggleton2.1 M3RESOLVEDFIXED
8999Aníbal Limón3Extensible SDK: allow basic kernel config customisationHighMarkus Lehtonen2.1 M3RESOLVEDFIXED
9091Aníbal Limón1Add extensible SDK testing on autobuilderMedium+Beth Flanagan2.1 M3RESOLVEDFIXED
8657Aníbal Limón1extensible SDK: improve handling for sanity checksMedium+Paul Eggleton2.2 M3RESOLVEDFIXED
   10      
Benjamin Esquivel
10394Benjamin Esquivel2Creation of component to emulate keyboard with USB-KM232HighJair Gonzalez2.3 M1RESOLVEDFIXED
   1      
Bogdan Alexandru Voiculescu
5953Bogdan Alexandru Voiculescu3Add a test to ensure buildhistory does not change signaturesMediumDaniel Istrate2.1 M2RESOLVEDFIXEDTC needed
   1      
Catalin Scrieciu
7067Catalin Scrieciu2Integrate 'grsecurity' package inside meta-cglMediumVaduva Alexandru2.1RESOLVEDINVALID
   1      
Cathy Shen
7850Cathy Shen10Handle native and target test dependency binaries in build test and export testMediumMariano Lopez2.2 M1RESOLVEDFIXED
8478Cathy Shen5Decoupling export test with Yocto build environmentMedium+Mariano Lopez2.2 M1RESOLVEDFIXED
8481Cathy Shen5Generate test tar balls for export testMedium+Mariano Lopez2.2 M1RESOLVEDFIXED
8536Cathy Shen5support un-extracted package (e.g. rpm) as one type of test binariesMedium+Mariano Lopez2.2 M1RESOLVEDFIXED
8694Cathy Shen5Add support for multiple binaries in one testMedium+Mariano Lopez2.2 M1RESOLVEDFIXED
9432Cathy Shen3Add test for exported test functionalityMedium+Mariano Lopez2.2 M1RESOLVEDDUPLICATE
8535Cathy Shen15export the test scripts under all layers' ./lib/oeqaMedium+Mariano Lopez2.2 M3RESOLVEDFIXED
   7      
Costin
6297Costin5Define install target scopeMedium+Scott Rifenbark2.1RESOLVEDFIXED18 Feb 2016: RESOLVED
6841Costin2'-v' switch and testimageMediumLucian Musat2.1RESOLVEDFIXED
8390Costin1AUH: Validate if git is configuredMediumAníbal Limón2.1 M1RESOLVEDFIXED
7601Costin4Add a test for the extensible SDKMedium+Aníbal Limón2.1 M3RESOLVEDFIXED
8436Costin3insane.bbclass: make package_qa_walk() can print all the messagesMedium+Robert Yang2.1 M3RESOLVEDFIXED
8437Costin3autotools.bbclass: use relative path to run configureMedium+Robert Yang2.1 M3RESOLVEDFIXED
8499Costin10Add specific WIC testsMediumDaniel Istrate2.1 M3RESOLVEDFIXED
8706Costin1Add oe-selftest test for locked signaturesMedium+Daniel Istrate2.1 M3RESOLVEDFIXED
8772Costinreview, audit and restructure the kytpes available in the yocto-kernel-cacheMedium+California Sullivan2.1 M3RESOLVEDFIXED
8816Costin4Add support for paravirtualized hardware random number generator for qemu machinesMedium+Saul Wold2.1 M3RESOLVEDFIXED
8179Costin10It should be possible to disable kernel features using config fragmentsMedium+Bruce Ashfield2.2 M3RESOLVEDFIXED
   11      
Cristina Agurida
8427Cristina Agurida2qemu machines enable usage of virtio driversMedium+Aníbal Limón2.1 M1RESOLVEDFIXED
8410Cristina Agurida2TEST_SUITES="auto" is not specified for all images regularly built by the autobuildersMedium+Alex Franco2.1 M3RESOLVEDFIXED
   2      
Daniel Istrate
6204Daniel IstrateWIC does not check presence of e2fsprogs-nativeMediumEd Bartosh2.1RESOLVEDFIXED
8559Daniel Istrate1Signing to sstate archives and signature verification should allow to use a custom GPG keys directoryMediumRoss Burton (Arm)2.1RESOLVEDFIXED
8498Daniel Istrate4QemuRunner fails to start the wic created imageMediumEd Bartosh2.1 M2RESOLVEDFIXED
8679Daniel Istrate3oe-selftest: measure test coverageMediumLeonardo Sandoval Gonzalez2.1 M2RESOLVEDFIXED
8691Daniel Istrate4Allow runqemu to start with a raw diskMediumEd Bartosh2.1 M2RESOLVEDFIXED
8458Daniel Istrate5insane.bbclass: buildpaths: skip it when set INHIBIT_PACKAGE_STRIPMediumHongxu Jia2.1 M3RESOLVEDOBSOLETE
8554Daniel Istrate3Support for self-contained "baremetal" CPU meta-layersMediumRichard Purdie2.2 M3RESOLVEDFIXED
   7      
David Rodriguez
6945David Rodriguez4kernel-dev: multiple kernel buildMedium+He Zhe2.2 M1RESOLVEDFIXED
9309David Rodriguez3patchtest: detect the target branch from mbox before patchingMedium+Leonardo Sandoval Gonzalez2.2 M1RESOLVEDFIXED
9310David Rodriguez1patchtest: check if the patchwork instance is alive before merging/testingMedium+Leonardo Sandoval Gonzalez2.2 M1RESOLVEDFIXED
9311David Rodriguez2patchtest: track last poll series' event inside patchtest so we do not depend on patchwork gitHighLeonardo Sandoval Gonzalez2.2 M1RESOLVEDFIXED
9402David Rodriguez0.5patchtest: filter incoming series by usersMedium+Leonardo Sandoval Gonzalez2.2 M1RESOLVEDFIXED
9565David Rodriguez1Add copy dir and delete files, dir to sshcontrolMedium+Mariano Lopez2.2 M1RESOLVEDFIXED
9569David Rodriguez3Add extract package function to the package managersMedium+Mariano Lopez2.2 M1RESOLVEDFIXED
8321David Rodriguez2yocto-bsp script should use argparse instead of optparse libraryMediumHumberto Ibarra2.2 M2RESOLVEDFIXED
9556David RodriguezThe EFI bootloaders should deploy startup.nsh for wicMedium+Christopher Larson2.2 M2RESOLVEDFIXED
9755David Rodriguezbuildhistory-diff contains loads of PKGR spam when used with PRSERVMedium+Ed Bartosh2.2 M2RESOLVEDFIXED
9766David Rodriguez3testimage: test import of tests from other layersMedium+Mariano Lopez2.2 M2RESOLVEDFIXED
7202David Rodriguez1Test for linux-dummyMediumJose Perez C2.3RESOLVEDFIXED
8504David Rodriguez5Identify and add if needed BSP test cases specific to meta-intelMediumFrancisco Pedraza2.4RESOLVEDINVALID
9636David Rodriguez5wic script should use argparse instead of optparse libraryMediumDaniela Plascencia2.4 M3RESOLVEDFIXED
   14      
David Lopez Barriba
10195David Lopez Barriba1Move to libinput as default x input driverMedium+Jussi Kukkonen2.3 M1RESOLVEDFIXED
10533David Lopez Barriba1Enable Maven/Tycho Command line build for Eclipse CROPS pluginMedium+Tim Orling2.3 M1RESOLVEDFIXED
10679David Lopez Barriba0.5Drop unneeded expansion parameter to getVar and getVarFlagMedium+Joshua Lock2.3 M1RESOLVEDFIXED
10691David Lopez Barriba2buildhistory-diff should detect directory renamesMedium+Ed Bartosh2.3 M2RESOLVEDFIXED
9592David Lopez Barriba4Add a mechanism for creating build appliance as a container imageHighbrian avery2.3 M3RESOLVEDOBSOLETE
6618David Lopez Barriba2Make the layer name searchable and show item page when search returns only one resultMediumJose Lamego2.4 M1RESOLVEDFIXED
9132David Lopez Barriba5Toaster automated testing inclusion at the AutobuilderMediumLibertad2.4 M3RESOLVEDWONTFIX
9635David Lopez Barriba5buildhistory-diff script should use argparse instead of optparse libraryMediumDaniela Plascencia2.4 M4RESOLVEDFIXED
   8      
Plauchu Edwin
11218Plauchu Edwin5Merged devauto library with DAFTMedium+Plauchu Edwin2.4 M1RESOLVEDOBSOLETE
   1      
yeoh ee peng
11244yeoh ee peng2QA: Validate Reference kit has BT audio support on gateway profileMediumJair Gonzalez2.4 M1RESOLVEDOBSOLETE
11246yeoh ee peng5QA: Validate Reference kit supports image installerMediumJair Gonzalez2.4 M1RESOLVEDOBSOLETE
11628yeoh ee peng4implement uboot for nios2 softcore on max10 reference boardMedium+Yau Wai Gan2.4 M3RESOLVEDFIXED
   3      
Francisco Pedraza
6658Francisco Pedraza7devtool: enable kernel developmentMedium+Markus Lehtonen2.1 M3RESOLVEDFIXED
9003Francisco Pedraza2Set up QA infrastructure for testing production setup of ToasterMedium+Mihail Stanciu2.1 M3RESOLVEDFIXED
9148Francisco Pedraza1Cover variable references not being expanded in python functionsMedium+Scott Rifenbark2.1 M3RESOLVEDFIXED3 March 2016: RESOLVED
7561Francisco Pedraza1Port beaglebone BSP to use xf86-video-modesettingsMedium+Plauchu Edwin2.2 M1RESOLVEDFIXED
8974Francisco Pedraza2Add eSDK benchmarkingMedium+Markus Lehtonen2.2 M1RESOLVEDFIXED
9292Francisco Pedraza0.1Update Graphic recipes with candidate versions in planned Graphic Stack 2016Q1 ReleaseMedium+Jianxun Zhang2.2 M1RESOLVEDFIXED
9414Francisco Pedrazaadd support for bmap-toolsMedium+Ed Bartosh2.2 M1RESOLVEDFIXED
9576Francisco Pedraza1Extensible SDK test output needs to include preparing_build_system.log on failureMedium+Leonardo Sandoval Gonzalez2.2 M1RESOLVEDFIXED
9112Francisco Pedrazapseudo connection startup/reworkHighJoshua Lock2.2 M2RESOLVEDFIXED
9299Francisco Pedraza3Enable Tracing boot and process times in testing imagesMedium+Aníbal Limón2.2 M2RESOLVEDFIXED
9361Francisco Pedraza3Failed to reconfigure a project in Eclipse with eSDKMedium+Tim Orling2.2 M2RESOLVEDFIXED
9412Francisco Pedraza5Implement python 3 support for wicMedium+Ed Bartosh2.2 M2RESOLVEDFIXED
9413Francisco Pedraza2bmap-tools support for wicMedium+Ed Bartosh2.2 M2RESOLVEDFIXED
9448Francisco Pedraza3Add mechanism for running image level QA checksMedium+Joshua Lock2.2 M2RESOLVEDFIXED
9613Francisco PedrazaExtensible SDK: Improve perceived performance of preparation during installMedium+Paul Eggleton2.2 M2RESOLVEDFIXED
9682Francisco Pedraza5enable xml output in OeTest class for report consumersMedium+Benjamin Esquivel2.2 M2RESOLVEDFIXED
6362Francisco Pedraza10Runtime machine configurationMedium+Jianxun Zhang2.2 M3RESOLVEDFIXEDwork post 8761
9004Francisco Pedraza4Produce container image providing extensible SDKMedium+Randy Witt2.2 M3RESOLVEDFIXED
9255Francisco Pedraza0.5Allow rootfs tasks to run in parallel with rpmHighStephano Cetola2.2 M3RESOLVEDFIXED
9298Francisco Pedraza4.5Autobuilder enable KVM on the cluster for x86, x86-64HighBill Randle2.2 M3RESOLVEDFIXED
9383Francisco Pedraza3Move to LSB 5Medium+Armin Kuster2.2 M3RESOLVEDFIXED
9450Francisco Pedraza2Add automated runtime tests that use the musl libc rather than glibcMedium+Bill Randle2.2 M3RESOLVEDFIXED
9454Francisco Pedraza10improve on why a recipe is builtMedium+Chen Qi2.2 M3RESOLVEDINVALID
9537Francisco Pedrazarecipetool: support node.js code outside of npmMedium+Paul Eggleton2.2 M3RESOLVEDFIXED
9751Francisco PedrazaExtensible SDK: add mode to include toolchain by defaultMedium+Paul Eggleton2.2 M3RESOLVEDFIXED
   25      
Warnings were generated during the execution of function
  1. Report truncated - count greater than max allowed 501 > 500

Old Milestone - Enhancements Need Verification - BY OWNER (1.X)

IDQAESummary (313 tasks) PAssigneeMilestoneStatusResolutionWhiteboard
   0      
 
806 4Consider using PatchELF rather than chrpath for modifying the RPATHLowJoshua Lock - Disabled1.4RESOLVEDWONTFIX
823 Ensure Poky can be run on non-Linux UnicesLowJoshua Lock - Disabled1.4RESOLVEDWONTFIX
874 1[AutoBuilder/FEAT] Set Bug to Fixed automatically when building in AutoBuilderLowBeth Flanagan1.4RESOLVEDWONTFIX
1613 Embedded java environment or even JDK supportLowSong Liu1.4RESOLVEDINVALID
1618 4MeeGo / Tizen GPLv2 SyncLowSaul Wold1.4RESOLVEDFIXED
1632 3Eval Patch management toolsLowSaul Wold1.4RESOLVEDOBSOLETE
1650 Need documentation on contributing patches and codeLowScott Rifenbark1.4RESOLVEDFIXED17-Nov-2011: Resolved Fixed with 3.8 of dev manual.
2645 [DOC] The ADT documentation should be improved to include additional command line instructionsMediumScott Rifenbark1.4RESOLVEDFIXED1 March 2013: In Progress Review
3435 10Investigate fast boot optimization options for non-SystemD init system.LowRadu Moisan1.4RESOLVEDNOTABUG
3621 Source in -dbg packages is wasteful and not massively usefulLowRoss Burton (Arm)1.4RESOLVEDFIXED
1474 12QEMU won't run on a system that does not support tunctlLowAndrei Dinu1.5RESOLVEDFIXED
1612 1Build statistics reportingLowBeth Flanagan1.5RESOLVEDOBSOLETE
1763 10[USE CASE] More universally bootable live imagesMediumDarren Hart1.5RESOLVEDFIXED(Waiting on EFI/SYSLINUX/HYBRID Patches)
1778 2License wrangling, stage 3MediumBeth Flanagan1.5RESOLVEDDUPLICATE(1.3)
2275 3License compliance: failure to detect new license filesLowBeth Flanagan1.5RESOLVEDDUPLICATE
3413 [Performance] Use the profiling and tracing tools to see where build performance might be improvedMediumTom Zanussi1.5RESOLVEDFIXEDInvestigating
3723 2smart: Performance enhancement for attemptonly and complementary installsMediumMark Hatle1.5RESOLVEDFIXED
4205 not so many recent builds displayed in Grid displayMediumBeth Flanagan1.5RESOLVEDFIXED02 January 2014: I am investigating potential doc needs here.
4335 2Default FILES_PN shouldn't hard-code udev pathMediumRoss Burton (Arm)1.5RESOLVEDINVALID
4413 Extend Yocto ADT Project Template to support CMake type projectsMediumAtanas Gegov Oss1.5RESOLVEDFIXED
4430 Bring buildhistory-web up-to-dateMediumPaul Eggleton1.5RESOLVEDFIXED
5214 Improve PACKAGECONFIG explanationMediumScott Rifenbark1.5RESOLVEDFIXED07 October 2013: RESOLVED
5271 EMGD 1.18 kernel components need to be upgraded to the 3.10 kernelLowTom Zanussi1.5RESOLVEDFIXED
4178 14Add FUSE: File system in UserspaceLowHongxu Jia1.5 M1RESOLVEDFIXED
4341 3udev-hwdb postinstall does not run on hostMediumLaurentiu Palcu1.5 M1RESOLVEDFIXEDRelease Note 1.4
1633 4AMT driver integrationMediumNitin Kamble1.5 M2RESOLVEDFIXED
4418 5Wayland support in toolkitsMediumRoss Burton (Arm)1.5 M2RESOLVEDFIXED
4761 replace unionfs with aufs in live imageMediumChen Qi1.5 M2RESOLVEDFIXED
1487 qemu: when booting from live CD, X cannot be started needs unionfsLowChen Qi1.5 M3RESOLVEDFIXED
4352 5prune pn-depends.dot, packages-depends.dot and task-depends.dotLowRobert Yang1.5 M3RESOLVEDFIXED
3868 20Add gcc security flagsHighSaul Wold1.5 M4RESOLVEDFIXED08 April 2014: Setting documentation flag to "Done."
4079 Ability to ignore a package (don't install a package)HighMark Hatle1.5 M4RESOLVEDFIXED10 Sept 2013: RESOLVED (with doc change)
4103 Stop using linux live and replace with read-only rootfsMediumChen Qi1.5 M4RESOLVEDFIXED
4705 [QA] - verify - Filter the content of the recipes tableMedium+Andreea Brandusa Proca1.5.1RESOLVEDOBSOLETE
4707 [QA] - verify - Filter the content of the packages tableMedium+Andreea Brandusa Proca1.5.1RESOLVEDOBSOLETE
4723 [QA] - verify - Sort the content of the packages tableMediumIonut Chisanovici1.5.1RESOLVEDFIXED
4808 [QA] - verify Ability to remove a packageHighAlexandru Georgescu1.5.1RESOLVEDFIXED
1511 Support versioned scm snapshots for mirroringMediumRichard Purdie1.6RESOLVEDFIXED
1829 Developer Patch Submission Template ImprovementsLowPaul Eggleton1.6RESOLVEDOBSOLETE
1973 Enhance BitBake manualMediumScott Rifenbark1.6RESOLVEDFIXED10 April 2014: RESOLVED
2424 1Rename core imagesMediumPaul Eggleton1.6RESOLVEDFIXED20 March 2014: Doc flag reset
2465 5add/enable more jasperforest drivers (NTB and Crystal Beach 3 DMA/DCA drivers)MediumNitin Kamble1.6RESOLVEDWONTFIX
3441 staticdev-pkgs should be added to meta-toolchain-sdk tooLowPaul Eggleton1.6RESOLVEDWONTFIX
3885 3define site macros for x32 in the x32-linux site config fileMediumNitin Kamble1.6RESOLVEDNOTABUG
4137 1.6 Test Automation Tracking BugHighStefan Stanacar1.6RESOLVEDFIXED
4302 Create a custom error message to deal with missing layer directoriesMedium+valentin1.6RESOLVEDOBSOLETE
4425 Prevent including the same file twiceMediumRichard Purdie1.6RESOLVEDFIXED
4653 [QA] - verify - Create a custom error message to deal with missing layer directoriesMedium+Lucian Musat1.6RESOLVEDWONTFIX
4679 [QA] - verify - create infrastructure to support direct image upgardingLowAlexandru Palalau1.6RESOLVEDWORKSFORME
4685 1[QA] - verify - Add method to configure preferred ABI when using RPMLowAlexandru Georgescu1.6RESOLVEDWONTFIX
4687 [QA] - verify - Create Interactive bitbake commandline modeMedium+Stoicescu Cornel1.6RESOLVEDWORKSFORME
4691 [QA] - verify - 1.6 Test Automation Tracking BugHighStefan Stanacar1.6RESOLVEDFIXED
4779 5Refactor rootfs_ipk.bbclassMediumLaurentiu Palcu1.6RESOLVEDFIXEDImplementation finished, waiting after dependencies
4781 5Refactor rootfs_deb.bbclassMediumLaurentiu Palcu1.6RESOLVEDFIXEDImplementation finished, waiting after dependencies
4782 3Remove meta-toolchain-gmaeMediumRoss Burton (Arm)1.6RESOLVEDFIXED21 March 2014: Reset documentation flag to "No"
4856 Improve usability of bitbake -c listtasksMediumPaul Eggleton1.6RESOLVEDFIXED20 March 2014: Doc flag reset
5072 Tests need a better way of determining if a package it's installedMediumStefan Stanacar1.6RESOLVEDFIXED
5281 Server mode should generate port number if not setMediumRichard Purdie1.6RESOLVEDFIXED
5286 package_rpm handling of MULTILIB_PREFIX_LIST needs refactoringMediumPaul Eggleton1.6RESOLVEDFIXED
5297 Support 2013Q3 Intel Graphics Stack Release in Yocto ProjectMediumNitin Kamble1.6RESOLVEDFIXED
5301 Ability to track DISTRO_FEATURE useMediumRichard Purdie1.6RESOLVEDFIXED
5324 [distro] Consider providing distro testing solutionMediumAlexandru Palalau1.6RESOLVEDFIXED08 April 2014: Setting documentation flag to "No."
5358 Avoid buildhistory changing do_package checksumsMediumPaul Eggleton1.6RESOLVEDFIXED
5368 Stop using release tarballs for main metadata releasesMedium+Scott Rifenbark1.6RESOLVEDFIXED11 March 2014: RESOLVED
5406 do_split_packages should set SUMMARY instead of DESCRIPTIONLowPaul Eggleton1.6RESOLVEDFIXED20 March 2014: Doc flag reset
5410 Write installed package list to deploy dirMediumPaul Eggleton1.6RESOLVEDFIXED20 March 2014: Doc flag reset
5436 Add the ability to specify static uid / gid pairs to be used by packages at build time for post install scriptsMediumMark Hatle1.6RESOLVEDFIXED
5454 [Autobuilder] Package index performance improvementMedium+Beth Flanagan1.6RESOLVEDFIXED
5471 [QA] - verify - Automate BSP TestingHighAlexandru Georgescu1.6RESOLVEDWONTFIX
5472 BitBake manual: copy / adjust BitBake variablesMedium+Scott Rifenbark1.6RESOLVEDFIXED22 April 2014: RESOLVED/FIXED
5480 Integrate Wayland 1.2+MediumRoss Burton (Arm)1.6RESOLVEDFIXED
5583 Test Weston on qemuMediumvalentin1.6RESOLVEDFIXED
5591 cmake.bbclass should support separate build directoriesMediumRoss Burton (Arm)1.6RESOLVEDFIXED
5598 [QA] - verify - Bitbake resident server autoloading/unloadingMedium+Ionut Chisanovici1.6RESOLVEDWORKSFORME
5616 3Hard reset capabilityHighCristian Iorga1.6RESOLVEDFIXED18 April 2014: Setting documentation flag to "Done".
5663 Hard to debug failing interceptsMediumLaurentiu Palcu1.6RESOLVEDFIXED
5665 run-postinsts should have native systemd supportMediumRoss Burton (Arm)1.6RESOLVEDFIXED
5704 Write manifest creation python class/routineMediumLaurentiu Palcu1.6RESOLVEDFIXED08 April 2014: Setting documentation flag to "No."
5717 GITSM fetcher should use ud.basecmdMediumRichard Purdie1.6RESOLVEDFIXED
5724 bitbake -e sometimes is not usefulMediumRichard Purdie1.6RESOLVEDFIXED
5770 Document the default for BB_NUMBER_THREADS and PARALLEL_MAKEMediumScott Rifenbark1.6RESOLVEDFIXED31 January 2014: Marked the "Documentation change" field to "Done"
5118 4[HOB] meta-hob layer should dissapearMediumCristiana Voicu1.6 M1RESOLVEDFIXED
5442 2sanity.bbclass: check TMPDIR is not on nfsMediumRobert Yang1.6 M1RESOLVEDFIXED26 March 2014: Setting documentation flag to "Done."
5450 [Autobuilder] Deferred deletion of buildsMediumBeth Flanagan1.6 M2RESOLVEDFIXED
4780 5Refactor rootfs_rpm.bbclassMediumHongxu Jia1.6 M3RESOLVEDFIXEDThe Rpm Image Creation has finished and been tested, start the incremental development.
5435 Add the ability to create an image from a package feedMediumHongxu Jia1.6 M3RESOLVEDDUPLICATE
5486 Update kernel lab to 1.5 (dora)LowTom Zanussi1.6 M3RESOLVEDFIXED
5529 5Split PACKAGES into PACKAGES_DEV, PACKAGES_DBG and so onUndecidedRobert Yang1.6 M3RESOLVEDINVALID
1894 10Incremental ipk image generationLowHongxu Jia1.6 M4RESOLVEDFIXED(Test Case Ready)
4119 Make it possible to create custom kernel headers packageMediumBruce Ashfield1.6 M4RESOLVEDDUPLICATE31 March 2014: Resetting documentation flag to "No."
5113 10archive*.bbclass: need refactorMediumRobert Yang1.6 M4RESOLVEDFIXED
5444 41.6 Autobuilder Enhancement Tracking bugHighBeth Flanagan1.6 M4RESOLVEDFIXED
5556 5A way to force all the recipes rebuildUndecidedRobert Yang1.6 M4RESOLVEDWONTFIX
5557 5An easy way to build recipe from sourceUndecidedRobert Yang1.6 M4RESOLVEDWORKSFORME
3821 Add Python 3.x recipeMediumKhem Raj1.6 M5RESOLVEDFIXED09 April 2014: Set documentation flag to "Done."
5495 10yocto-bsp 1.6 upgrade and automation enhancementsMediumTom Zanussi1.6 M5RESOLVEDFIXED11 April 2014: Documentation flag set to "Done."
5614 5Automated testing master image generation / operationHighStefan Stanacar1.6 M5RESOLVEDFIXED17 April 2014: Marked documentation flag to "Done".
5820 Link warnings to their corresponding tasks (when applicable)MediumAlexandru Damian1.6 M5RESOLVEDWONTFIXGUI design available; needs data completion test
6013 1genext2fs: remove itMediumRobert Yang1.6 M5RESOLVEDFIXED24 March 2014: Set Documentation flag to "No".
4642 [QA] - verify - Refactor plug-in code to create a common remote communication util plug-inMedium+Alexandru Georgescu1.6.1RESOLVEDWORKSFORME
4659 [QA] - verify - Implement Shuku proposalMedium+Alexandru Palalau1.6.1RESOLVEDWORKSFORME
4683 [QA] - verify - Merge buildstats into build history and have one data collection mechanismMedium+Alexandru Palalau1.6.1RESOLVEDWORKSFORME
4724 [QA] - verify - Deployment user experience enhancementMedium+Stoicescu Cornel1.6.1RESOLVEDWORKSFORME
5434 [QA] Add test plan for testing uClibc BuildsMedium+Alexandru Palalau1.6.1RESOLVEDWORKSFORME
5465 [QA] - verify - meta-intel: intel microcode updateMedium+Alexandru Palalau1.6.1RESOLVEDWORKSFORME
5466 [QA] - verify - Sharing PR server between builders with different metadataMedium+Stoicescu Cornel1.6.1RESOLVEDWORKSFORME
5519 [QA] - verify - wic updatesMedium+Ionut Chisanovici1.6.1RESOLVEDWONTFIX
5595 [QA] - verify - Toaster must be able to stop a bitbake server, and clean all artifactsMedium+Andreea Brandusa Proca1.6.1RESOLVEDWORKSFORME
5599 [QA] - verify - Optimise away meta-oe X init mechanismMedium+Alexandru Georgescu1.6.1RESOLVEDWORKSFORME
545 3Improve SDK sysroot extensibility and workflowMediumChen Qi1.7RESOLVEDOBSOLETE
641 [DOC] need a doc for qemu usageMediumTrevor Woerner1.7RESOLVEDFIXED31 July: IN PROGRESS REVIEW
1691 5[HOB] make IMAGES_TYPE a per recipe settingMediumCristiana Voicu1.7RESOLVEDWONTFIX
3140 3Autobuilder should build an image with each packaging formatMediumBeth Flanagan1.7RESOLVEDFIXED
3345 15[HOB] Add a target for adt-installerMediumCristiana Voicu1.7RESOLVEDWONTFIX10 Sept 2013: Some doc notes added
3743 Packaging license textsMediumBeth Flanagan1.7RESOLVEDFIXED
4075 20Improve the installer user experienceMediumChen Qi1.7RESOLVEDFIXED
4394 Intel Data Plane Development Kit (DPDK) supportMediumWei Sern Chan1.7RESOLVEDFIXED
4697 [QA] - verify - Search the content of the builds tableMediumYuan Sun1.7RESOLVEDWORKSFORME
4698 [QA] - verify - Filter the content of the builds tableMediumYuan Sun1.7RESOLVEDWORKSFORME
4701 [QA] - verify - Filter the content of the bitbake variables tableMediumYuan Sun1.7RESOLVEDWORKSFORME
4702 [QA] - verify - Filter the content of the tasks tableMediumYuan Sun1.7RESOLVEDWORKSFORME
4704 [QA] - verify - Search the content of the tasks tableMediumYuan Sun1.7RESOLVEDWORKSFORME
4706 [QA] - verify - Search the content of the recipes tableMediumYuan Sun1.7RESOLVEDWORKSFORME
4708 [QA] - verify - Search the content of the packages tableMediumYuan Sun1.7RESOLVEDWORKSFORME
4709 [QA] - verify - Filter the content of the build time tableMediumYuan Sun1.7RESOLVEDWORKSFORME
4710 [QA] - verify - Search the content of the build time tableMediumYuan Sun1.7RESOLVEDWORKSFORME
4711 [QA] - verify - Sort the content of the build time tableMediumYuan Sun1.7RESOLVEDWORKSFORME
4719 [QA] - verify - Sort the content of the builds tableMediumYuan Sun1.7RESOLVEDWORKSFORME
4720 [QA] - verify - Sort the content of the bitbake variables tableMediumYuan Sun1.7RESOLVEDWORKSFORME
4721 [QA] - verify - Sort the content of the tasks tableMediumYuan Sun1.7RESOLVEDWORKSFORME
4722 [QA] - verify - Sort the content of the recipes tableMediumYuan Sun1.7RESOLVEDWORKSFORME
5006 Allow package management to update sysroot components of the SDKMediumChen Qi1.7RESOLVEDOBSOLETE
5479 3Use gstreamer-vaapi instead of MiXMediumRoss Burton (Arm)1.7RESOLVEDOBSOLETE
5563 toaster change REST API implementation to use Django REST frameworkMediumAlexandru Damian1.7RESOLVEDWONTFIX
5689 5need a tool to verify to HOMEPAGEMediumChong Lu1.7RESOLVEDFIXED
5705 Support 2013Q4 Intel Graphics Stack Release in Yocto ProjectMediumvalentin1.7RESOLVEDFIXED
6071 Autobuilder class docs - __init__.pyMediumBeth Flanagan1.7RESOLVEDDUPLICATE
6097 Support 2014Q1 Intel Graphics Stack Release in Yocto ProjectMediumRoss Burton (Arm)1.7RESOLVEDOBSOLETEMoved from Laurentiu to Unassigned
6160 Show QA check name next to error messageLowChong Lu1.7RESOLVEDFIXED
6173 Update kexec-tools to 2.0.6MediumArmin Kuster1.7RESOLVEDFIXEDMoved from Laurentiu to Unassigned
6217 bitbake.conf should set defaults for BB_NUMBER_THREADSMediumRoss Burton (Arm)1.7RESOLVEDFIXED
6225 [Usage Flow] Improve the Yocto Project development workflowMediumJessica1.7RESOLVEDWONTFIX
6226 [Usage Flow] Improve the kernel development workflowMediumJessica1.7RESOLVEDOBSOLETE
6227 [Usage Flow] Improve the system development workflowMediumJessica1.7RESOLVEDOBSOLETE
6228 [Usage Flow] Improve the application development workflowMediumJessica1.7RESOLVEDOBSOLETE
6229 [Usage Flow] Improve support for Yocto Project enablersMediumJessica1.7RESOLVEDOBSOLETE
6262 bitbake debug does not show .bbappend and .inc filesMediumRichard Purdie1.7RESOLVEDFIXED
6320 Drop *-config binconfig scriptsMediumSaul Wold1.7RESOLVEDFIXED
6354 PublishArtifacts needs md5sums as an artifact.MediumBeth Flanagan1.7RESOLVEDFIXED
6360 linux-yocto: Maintain meta historyMediumBruce Ashfield1.7RESOLVEDFIXED
6493 typo in postinstall error messageLowRichard Purdie1.7RESOLVEDFIXED
6513 wic needs to support creating FAT partitionsMediumTom Zanussi1.7RESOLVEDFIXED
6574 qt4: Avoid duplicate flags in the g++-unix.confMediumRichard Purdie1.7RESOLVEDFIXED
6605 create an extension point in bitbake/buildinfohelperMediumAlexandru Damian1.7RESOLVEDWONTFIX
6621 Document debug-without-srcMediumScott Rifenbark1.7RESOLVEDFIXED15 August 2014: RESOLVED
5490 Support multiple Bitbake server backends for each Toaster webserverMediumAlexandru Damian1.7 M1RESOLVEDFIXED
5541 design Build REST APIMediumAlexandru Damian1.7 M1RESOLVEDWONTFIX
5974 Buildsets should pass all properties from triggering schedulerMediumBeth Flanagan1.7 M1RESOLVEDFIXED
6363 Update kernel lab to 1.6 (daisy)MediumTom Zanussi1.7 M1RESOLVEDFIXED
6403 Automate RP's release part of the process to avoid regressionsMedium+Tracy Graydon1.7 M1RESOLVEDFIXED
2416 xmlto/xsltproc stylesheets cannot be found even when they are installed in sysrootMediumHongxu Jia1.7 M2RESOLVEDFIXED
2610 1poky-tiny builds should be marked as failed if the image size is above a specified thresholdMediumRobert Yang1.7 M2RESOLVEDFIXED
5412 standardize how .bbappend files do FILESEXTRAPATHMediumHongxu Jia1.7 M2RESOLVEDFIXED
5521 Document file checksumsMediumScott Rifenbark1.7 M2RESOLVEDFIXED02 June 2014: RESOLVED
6544 Rewrite eglibc-utils/usr/bin/tzselect as a posix shMediumHongxu Jia1.7 M2RESOLVEDFIXED
1238 7Man pages (and other documentation) are not compressedLowHongxu Jia1.7 M3RESOLVEDFIXED
4073 2Add method to configure preferred ABI when using RPMLowRobert Yang1.7 M3RESOLVEDFIXEDIMAGEGEN
5747 Create a test to look for most issues reports in logsMediumLucian Musat1.7 M3RESOLVEDFIXED
5895 Document the conf-notes.txt fileLowScott Rifenbark1.7 M3RESOLVEDFIXED29 July 2014: RESOLVED
6237 Ability to identify build host and build directoryMediumAlexandru Damian1.7 M3RESOLVEDFIXEDGUI design pending
6240 Toaster must be able to create a build environment and launch the Bitbake server (remote use case)MediumAlexandru Damian1.7 M3RESOLVEDFIXED
6263 Release documents are needed for some significant changes among recipesLowScott Rifenbark1.7 M3RESOLVEDOBSOLETE06 May 2014: RESOLVED/OBSOLETE
6281 Release note buildstep for autobuilderMediumBeth Flanagan1.7 M3RESOLVEDDUPLICATE
6390 Add section on fixing parallel make racesMediumScott Rifenbark1.7 M3RESOLVEDFIXED31 July 2014: RESOLVED
6396 2Check image size after it is generatedMediumRobert Yang1.7 M3RESOLVEDDUPLICATE
6463 5oe-core: create a meta binary package for the image recipeLowRobert Yang1.7 M3RESOLVEDWONTFIX
6499 Add more GPLv3-like licenses to non-GPLv3 examplesMediumScott Rifenbark1.7 M3RESOLVEDFIXED22 July 2014: RESOLVED
6538 Display submission date / time informationLowRoxana Ciobanu1.7 M3RESOLVEDFIXEDGUI design available
6586 create extension point in toasterMediumFarrell Wymore1.7 M3RESOLVEDOBSOLETE
6639 only allowed sstate-cache objects are allowed in a build (read-only sstate-cache)MediumHongxu Jia1.7 M4RESOLVEDOBSOLETE
1662 5Use the per-file dependencies in deb and ipkg packagesLowRobert Yang1.8RESOLVEDFIXED
4444 10meta-intel: support for video encode/transcodeMediumSaul Wold1.8RESOLVEDFIXED
5206 5Sato video player needs to be replacedMediumRoss Burton (Arm)1.8RESOLVEDFIXED
5265 Add wildcard support for SANITY_TESTED_DISTROSMediumPaul Eggleton1.8RESOLVEDFIXED
5312 3yocto-bsp: get rid of 'strange' characters in yocto-bsp template filenamesMediumTom Zanussi1.8RESOLVEDFIXED
5344 5Split up IMAGE_FEATURES - debug-tweaks into logical componentsMediumSaul Wold1.8RESOLVEDFIXED12 February 2015: Docs updated
5571 Re-validate checksums in do_unpackMediumAlejandro Hernandez1.8RESOLVEDFIXED
6078 glew depends on libx11MediumRoss Burton (Arm)1.8RESOLVEDNOTABUG
6298 To enable 64-bit target machine booted with sato-sdk image to compile 32-bit applicationMediumSaul Wold1.8RESOLVEDNOTABUG
6487 Add Aarch64 qemu target.MediumKai Kang1.8RESOLVEDFIXED
6552 Need a proper way to install Toaster dependenciesMediumPaul Eggleton1.8RESOLVEDFIXED
6642 Add a package QA check for ${D} in postinstall script functionsMediumAlejandro Hernandez1.8RESOLVEDFIXED
6736 Link errors to the AutobuilderMediumMichael Wood1.8RESOLVEDFIXEDGUI design available
6770 Improve storing build information in imagesMediumAlejandro Hernandez1.8RESOLVEDFIXED
6789 Move all Toaster tables to AngularJSMediumMichael Wood1.8RESOLVEDWONTFIX
6853 Include LTSI kernel in release processMediumSaul Wold1.8RESOLVEDFIXED
6857 add support for python 3.4.2MediumAlejandro Hernandez1.8RESOLVEDFIXED
6968 Rename defaultval flag to _defaultvalMediumRoss Burton (Arm)1.8RESOLVEDFIXED
6982 Add a package QA check for ${D} in FILESMediumAlejandro Hernandez1.8RESOLVEDFIXED
7119 Autobuilder should link to errors.yoctoproject.orgMediumBeth Flanagan1.8RESOLVEDFIXED
7126 Enhance QA checks to detect build host path usageMediumAlejandro Hernandez1.8RESOLVEDFIXED
7245 send-error-report tool data in post body rather than paramMediumMichael Wood1.8RESOLVEDFIXED
5594 Add documentation on optimising build performanceMediumScott Rifenbark1.8 M1RESOLVEDFIXED21 November 2014: RESOLVED
5026 1Ability to set TMPDIR in autobuilder.confMediumBeth Flanagan1.8 M2RESOLVEDWORKSFORME
5200 5Improve the handling of CONFFILESMediumChen Qi1.8 M2RESOLVEDFIXED
6023 Toaster should simply start instead of throwing a "lock state" errorMediumAlexandru Damian1.8 M2RESOLVEDFIXED
6523 0.5Look into RAM usageLowMichael Wood1.8 M2RESOLVEDFIXEDGUI design available
6540 2Enhancements to the error details pageLowMichael Wood1.8 M2RESOLVEDFIXEDGUI design available
6542 2Add filtering capabilities to the search results pageLowMichael Wood1.8 M2RESOLVEDFIXEDGUI design available
6952 Replace procps with procps-ngMediumSaul Wold1.8 M2RESOLVEDFIXED
3548 eclipse plugin should have a logging featureMediumTodor Minchev1.8 M3RESOLVEDFIXED
4934 Make konsole work with KDE 4 for OE_TERMINALLowPaul Eggleton1.8 M3RESOLVEDFIXED
5348 Add ability to fetch layers from layer indexMediumChong Lu1.8 M3RESOLVEDFIXED
5991 1Allow more flexible versioned layer dependenciesMediumPaul Eggleton1.8 M3RESOLVEDFIXED
6310 8grub-efi: should contain filesMediumRobert Yang1.8 M3RESOLVEDFIXED
6946 kernel-dev: meta-data cleanup and auditMediumBruce Ashfield1.8 M3RESOLVEDFIXED
6977 5mkfs.ext3 is slow to copy rootfs to new file systemMediumRobert Yang1.8 M3RESOLVEDDUPLICATE
7036 Support for python in "recipetool create"MediumChristopher Larson1.8 M3RESOLVEDFIXED
7059 Upgrade python 2.x to 2.7.9MediumAlejandro Hernandez1.8 M3RESOLVEDFIXED
7092 linux-yocto: improve do_patch performanceMediumBruce Ashfield1.8 M3RESOLVEDFIXED
7163 Should use South for schema migrationMediumMichael Wood1.8 M3RESOLVEDFIXED
5463 Document tune files / variablesMediumScott Rifenbark1.8 M4RESOLVEDFIXED17 March 2015: RESOLVED
6397 10Fix "Argument list too long" issuesLowRobert Yang1.8 M4RESOLVEDFIXED
7034 15check whether all the qa checks worksMediumRobert Yang1.8 M4RESOLVEDFIXED
7252 1Enable 2014Q4 Intel Graphics Stack ReleaseMediumAníbal Limón1.8 M4RESOLVEDFIXED
7341 Performance issue in do_rootfs (mkfs.ext*)MediumRichard Purdie1.8 M4RESOLVEDFIXED
7370 Don't warn for defconfig+scc autogenerated BSP descriptionMediumBruce Ashfield1.8 M4RESOLVEDFIXED
7417 Add section on changing hostnameMediumScott Rifenbark1.8 M4RESOLVEDFIXED17 March 2015: IN PROGRESS DESIGN
6744 1extensible SDK: handle path restrictions imposed by build systemMediumBrendan Le Foll1.9RESOLVEDFIXED
7441 do_kernel_configme fails when patches create directoriesMediumBruce Ashfield1.9RESOLVEDFIXED
7964 recipetool: add sub-command to just create a bbappendLowPaul Eggleton1.9RESOLVEDFIXED
7630 1Provide some hint for the "textrel" QA issueUndecidedScott Rifenbark1.9 M1RESOLVEDFIXED27 April 2015: RESOLVED
6202 1Linux-yocto.bb suggests running bitbake -c devshell on do_patch failureMediumBruce Ashfield1.9 M2RESOLVEDFIXED
4146 5Allow a layer to include another layerMediumJason Wessel1.9 M3RESOLVEDWORKSFORME
6667 1Enable DRM_CIRRUS_QEMUMediumBruce Ashfield1.9 M3RESOLVEDFIXED
7282 2linux-yocto: accidentally skips patchesMediumBruce Ashfield1.9 M3RESOLVEDFIXED
7720 10make the world build work without x11 in DISTRO_FEATURESMediumRobert Yang1.9 M3RESOLVEDFIXED
8110 5insane.bbclass: check the /etc/<files> are set by CONFFILESUndecidedRobert Yang1.9 M3RESOLVEDINVALID
8169 binconfig-disabled class should make config scripts print a human-readable errorMediumRoss Burton (Arm)1.9 M3RESOLVEDFIXED
   239      
Alexandru Georgescu
5893Alexandru GeorgescuRationalise bootchart supportMediumMax Eliaser1.7RESOLVEDFIXED
1569Alexandru Georgescu6[QA/Test] Add recipe for rt tests and automate test (ptest)MediumMaxin B. John (inactive)1.8RESOLVEDFIXED
6444Alexandru GeorgescuMove on target kernel module support to separate recipe? (Improve Performance and developer experience)Medium+Darren Hart1.8RESOLVEDFIXED
5400Alexandru GeorgescuBest practices for multi-machine buildsMedium+Scott Rifenbark1.8 M1RESOLVEDFIXED24 November 2014: RESOLVED
6435Alexandru Georgescu10Use the build system within the SDKMedium+Paul Eggleton1.8 M3RESOLVEDFIXED
6979Alexandru Georgescu1Port mail script to New PRSMediumAníbal Limón1.8 M3RESOLVEDFIXED
7783Alexandru GeorgescuYP 1.9 Dev. Tools EnhancementsMediumStephen K Jolley1.9RESOLVEDWORKSFORME
7489Alexandru Georgescu3AUH: Improve installation/usageMediumAníbal Limón1.9 M1RESOLVEDFIXED
7652Alexandru Georgescu10patchwork: ensure that merged patches get properly marked as suchMedium+Jose Lamego1.9 M2RESOLVEDFIXED
7970Alexandru Georgescu5patchwork: patches sent to the meta OE list are auto-archived after a few hours/daysUndecidedJose Lamego1.9 M2RESOLVEDNOTABUG
6559Alexandru Georgescu6Construct the SDK using sstate archivesMedium+Chen Qi1.9 M3RESOLVEDFIXED
6560Alexandru Georgescu5Add script to update installed SDK based on sstate manifestsMedium+Chen Qi1.9 M3RESOLVEDFIXED
7348Alexandru Georgescu1We should use the ext4 driver for ext2/3MediumBruce Ashfield1.9 M3RESOLVEDFIXED
   13      
Catalin Scrieciu
7069Catalin Scrieciu2Integrate 'makedumpfile' package inside meta-cglMediumVaduva Alexandru1.9RESOLVEDFIXED
   1      
Stoicescu Cornel
4106Stoicescu CornelDeployment user experience enhancementMediumSaul Wold1.8RESOLVEDFIXEDCover bug no direct estimate
   1      
Cristian Iorga
6205Cristian IorgaAdd support for building nativesdk-qemu to meta-mingw/meta-darwinMedium+Cristian Iorga1.7 M3RESOLVEDFIXEDMoved from Laurentiu to Cristian
   1      
Cristina Agurida
4421Cristina Agurida5systemd performance improvementsMediumChen Qi1.9RESOLVEDFIXED
7475Cristina Agurida0.5bitbake-layers show-recipes filtered by classes inherited?MediumPaul Eggleton1.9RESOLVEDFIXED
7839Cristina Aguridabitbake-layers: remove-layer: accept just layer directoryLowPaul Eggleton1.9RESOLVEDFIXED
1971Cristina Agurida5Enhance BA to run in VirtualBoxMediumJuro Bystricky1.9 M1RESOLVEDFIXED02 April 2014: Some web page adjustments made.
7479Cristina Agurida3BlueZ 5.xx should be the default stack for Bluetooth supportMediumCristian Iorga1.9 M1RESOLVEDFIXED
   5      
David Lopez Barriba
6943David Lopez Barriba2.5kernel-dev: make Kconfig audit output visibleMedium+Bruce Ashfield1.8 M4RESOLVEDFIXED
   1      
Lucian Musat
6791Lucian MusatIntegrate the fetcher with a gitexternalsrc class for large team developmentMediumRichard Purdie1.9RESOLVEDFIXED
7667Lucian Musat1Feature request: include expanded_data in the ConfigParsed eventMediumRichard Purdie1.9RESOLVEDFIXED
7668Lucian Musat1Feature request: inject 'd' as well as 'e' into event handlersMediumRichard Purdie1.9 M1RESOLVEDFIXED
5275Lucian Musat1bbnote etc just use echoMediumPaul Eggleton1.9 M2RESOLVEDFIXED
   4      
Juan Ramos
6361Juan Ramos2.5Make kernel-configme warnings visible on the consoleMedium+Bruce Ashfield1.8 M3RESOLVEDFIXED
   1      
oscar lopez arandas
6944oscar lopez arandas5kernel-dev: kernel rebuild on targetMedium+Bruce Ashfield1.8 M2RESOLVEDFIXED
   1      
Stephen K Jolley
7778Stephen K JolleyYP 1.9 Autobuilder EnhancementsMediumStephen K Jolley1.9RESOLVEDWORKSFORME
7779Stephen K JolleyYP 1.9 Overall EnhacementsMediumStephen K Jolley1.9RESOLVEDWORKSFORME
7780Stephen K JolleyYP 1.9 Toaster EnhancmentsMediumStephen K Jolley1.9RESOLVEDWORKSFORME
7781Stephen K JolleyYP 1.9 OS ToolingMediumStephen K Jolley1.9RESOLVEDWORKSFORME
7782Stephen K JolleyYP 1.9 Meta-Intel EnhancementMediumStephen K Jolley1.9RESOLVEDWORKSFORME
7784Stephen K JolleyYP 1.9 Bitbake EnhancementsMediumStephen K Jolley1.9RESOLVEDWORKSFORME
7785Stephen K JolleyYP 1.9 Documentation EnhancementsMediumStephen K Jolley1.9RESOLVEDWORKSFORME
7786Stephen K JolleyYP 1.9 Testing EnhancementsMediumStephen K Jolley1.9RESOLVEDWORKSFORME
7808Stephen K JolleyYP 1.9 Error reporting system improvementsMediumStephen K Jolley1.9RESOLVEDWORKSFORME
7815Stephen K JolleyYP 1.9 Package updates required enhacementsMediumStephen K Jolley1.9RESOLVEDWORKSFORME
7816Stephen K JolleyYP 1.9 Recipe Upgrades, AUH, & RRS EnhancementsMediumStephen K Jolley1.9RESOLVEDWORKSFORME
7817Stephen K JolleyYP 1.9 Optimizations and Misc. EnhancementsMediumStephen K Jolley1.9RESOLVEDWORKSFORME
7826Stephen K JolleyYP 1.9 Eclipse plug-in enhancementsMediumStephen K Jolley1.9RESOLVEDWORKSFORME
7838Stephen K JolleyYP 1.9 Deployment ImprovementsMediumStephen K Jolley1.9RESOLVEDWORKSFORME
7841Stephen K JolleyYP 1.9 Dev. Tools (patchwork) EnhancementsMediumStephen K Jolley1.9RESOLVEDWORKSFORME
7860Stephen K JolleyYP 1.9 Autobuilder Enhancements (part 2)MediumStephen K Jolley1.9RESOLVEDFIXED
7861Stephen K JolleyYP 1.9 Dev. Tools (devtool:) EnhancementsMediumStephen K Jolley1.9RESOLVEDWORKSFORME
7862Stephen K JolleyYP 1.9 Dev. Tools (SDK) EnhancementsMediumStephen K Jolley1.9RESOLVEDWORKSFORME
7863Stephen K JolleyYP 1.9 Optimizations and Misc. Enhancements (part 2)MediumStephen K Jolley1.9RESOLVEDWORKSFORME
7867Stephen K JolleyYP 1.9 Toaster Enhancements (Part 2)MediumStephen K Jolley1.9RESOLVEDWORKSFORME
7881Stephen K JolleyYP 1.9 Testing Enhancements (part 2)MediumStephen K Jolley1.9RESOLVEDWORKSFORME
7842Stephen K JolleyYP 1.9 M1 Overall EnhancementsMediumStephen K Jolley1.9 M1RESOLVEDOBSOLETE
7859Stephen K JolleyYP 1.9 M1 Overall Enhancements (part 2)MediumStephen K Jolley1.9 M1RESOLVEDOBSOLETE
7843Stephen K JolleyYP 1.9 M2 Overall EnhancementsMediumStephen K Jolley1.9 M2RESOLVEDWORKSFORME
7858Stephen K JolleyYP 1.9 M2 Overall Enhancement (part 2)MediumStephen K Jolley1.9 M2RESOLVEDWORKSFORME
7844Stephen K JolleyYP 1.9 M3 Overall EnhancementsMediumStephen K Jolley1.9 M3RESOLVEDWORKSFORME
7857Stephen K JolleyYP 1.9 M3 Overall Enhancements (part 2)MediumStephen K Jolley1.9 M3RESOLVEDWORKSFORME
   27      
Mihail Stanciu
6515Mihail StanciuAbility to add custom layer directory sources for ToasterMediumAlexandru Damian1.8 M1RESOLVEDFIXED
6483Mihail Stanciufeature unavailable page neededMediumDavid Reyna1.8 M3RESOLVEDFIXEDGUI design available
7291Mihail StanciuAdd message with "daemon" program location on startLowAlexandru Damian1.8 M3RESOLVEDFIXED
6646Mihail Stanciu1Implement rm_old_workMediumRichard Purdie1.9RESOLVEDFIXED
7340Mihail StanciuPerformance issue in do_rootfs (license_create_manifest)MediumBeth Flanagan1.9RESOLVEDFIXED
7485Mihail Stanciu2Add SRC_URI and SRCREV selection to kernel buildersMediumBeth Flanagan1.9 M1RESOLVEDFIXED
7508Mihail Stanciu1package_deb: Run AB in Debian and non-debian based hostsMediumBeth Flanagan1.9 M1RESOLVEDFIXED
7685Mihail Stanciu1KMETA/KBRANCH split for kernel override buildsetsMediumBeth Flanagan1.9 M1RESOLVEDFIXED
7688Mihail Stanciu2Kernel props need to build SRC_URI automaticallyMediumBeth Flanagan1.9 M1RESOLVEDFIXED
   9      
Valentin Hangan
4362Valentin HanganRefactor plug-in code to create a common remote communication util plug-inMediumTodor Minchev1.8RESOLVEDINVALID
   1      
Yi Zhao
2112Yi Zhao2The 'build appliance' installable should contain / have access to sstate caches for all targetsMediumScott Rifenbark1.7 M3RESOLVEDFIXED08 August 2014 - RESOLVED
6936Yi Zhao2Add ability to use native toolchain inside of the SDK copy of the buildsystemMedium+Randy Witt1.8 M3RESOLVEDFIXED
   2      
Yuan Sun
4278Yuan Sun4tasks: Filter the content of the tasks tableMediumRavi Chintakunta1.6 M3RESOLVEDFIXEDGUI design available
4381Yuan Sun3buildtime: Filter the content of the build time tableMediumDavid Reyna1.6 M3RESOLVEDFIXEDGUI design available
4382Yuan Sun4buildtime: Search the content of the build time tableMediumDavid Reyna1.6 M3RESOLVEDFIXEDGUI design available
4383Yuan Sun3buildtime: Sort the content of the build time tableMediumDavid Reyna1.6 M3RESOLVEDFIXEDGUI design available
4943Yuan SunProvide help informationMediumBelen Barros Pena1.6 M4RESOLVEDFIXEDGUI design available
5748Yuan SunBring in tasks descriptions from documentation.conf into ToasterMediumRavi Chintakunta1.6 M4RESOLVEDFIXEDGUI
6232Yuan SunDesign the ability to create new projectsMediumBelen Barros Pena1.7 M2RESOLVEDFIXEDGUI design in progress
   7      
Personal tools