2.5 QA Bugs To Verify

From Yocto Project
Jump to: navigation, search

2.5 BUGS

2.5 RESOLVED Bugs - Need Verification - BY OWNER

IDQAESummary (197 tasks) PAssigneeMilestoneStatusResolutionWhiteboard
   0      
 
11990 2Screen corruption with QEMU when running built qemux86 imageMedium+Alex Lennon2.5 M1RESOLVEDWONTFIX
11978 2python-native is being built without IPV6 enabledMedium+Alejandro Hernandez2.5 M1RESOLVEDFIXED
12022 5signing.Signing.test_signing_packages hangs on ubuntu1704.yocto.ioMedium+Alexander Kanavin2.5 M2RESOLVEDFIXED
12238 Remove stale UPSTREAM_VERSION_UNKNOWNMedium+Alexander Kanavin2.5 M2RESOLVEDFIXED
12348 5Integration Meson build systemMedium+Alexander Kanavin2.5 M2RESOLVEDFIXED
12396 2AUH: retrieving logs after running testimages is broken in multiple waysMedium+Alexander Kanavin2.5 M2RESOLVEDFIXED
12425 1Upgrade rpm to 4.14.0+ to support binary reproducibilityMedium+Alexander Kanavin2.5 M2RESOLVEDFIXED
12472 2webkitgtk is vulnerable to Meltdown and Spectre defectsHighAlexander Kanavin2.5 M2RESOLVEDFIXED
12477 Possible bad interaction between shared-state uninative and gobject-introspectionMedium+Alexander Kanavin2.5 M2RESOLVEDFIXED
11996 5pseudo: cannot use unnamed temporary files (O_TMPFILE)Medium+Alexander Kanavin2.5 M3RESOLVEDFIXED
12533 [2.2.3 rc2] selftest: setUpClass failed failing on ubuntu 17.10 (oeqa.selftest.signing.Signing)Medium+Alexander Kanavin2.5 M3RESOLVEDDUPLICATE
12596 python3-native do_compile failure on master-nextMedium+Alexander Kanavin2.5 M4RESOLVEDFIXED
12618 syslog doesn't start under systemdHighAlexander Kanavin2.5 M4RESOLVEDFIXED
12630 postinst intercepts fail in SDKsMedium+Alexander Kanavin2.5 M4RESOLVEDFIXED
12661 Require LAYERSERIES_COMPAT_X to be set in yocto-check-layer for YP CompatibilityMedium+Alexander Kanavin2.5 M4RESOLVEDFIXED
11930 1Gateway timeout error searching for recipes without keywordMedium+Amanda Brindle2.5 M2RESOLVEDFIXED
11943 1oe-pkgdata-util should support RPROVIDESMedium+Amanda Brindle2.5 M2RESOLVEDFIXED
12334 buildhistory-diff misreports RPROVIDESMedium+Amanda Brindle2.5 M3RESOLVEDFIXED
12092 Sources (/usr/src/debug) missing in -dbg packages when MACHINE="qemumips"Medium+Amanda Brindle2.5 M4RESOLVEDFIXEDBackport 2.3.n and 2.4.n
12553 waf.bbclass fails to provide useful errorMedium+Amanda Brindle2.5 M4RESOLVEDFIXED
12506 3remove config for obsolete machines from yocto-kernel-cacheMedium+Anuj Mittal2.5 M3RESOLVEDFIXED
12508 qemu hangs while running oe-selftestMedium+Anuj Mittal2.5 M3RESOLVEDFIXED
12338 checklayer: undefined LayerErrorMedium+Anuj Mittal2.5 M4RESOLVEDFIXED
12559 2buildhistory-diff: directory rename detection sometimes goes crazyMedium+Anuj Mittal2.5 M4RESOLVEDFIXED
10541 5Use "new project template" framework to create sample Devtool projectMedium+brian avery2.5RESOLVEDWONTFIX
10546 5use CDT "new build system" to enable building for Devtool projectMedium+brian avery2.5RESOLVEDWONTFIX
10557 Replace Eclipse Poky plugin with Eclipse CROPS pluginMedium+brian avery2.5RESOLVEDINVALID
10556 5Docker tooling support to manipulate CROPS containers from the Eclipse CROPS pluginMedium+brian avery2.5 M2RESOLVEDOBSOLETE
12034 5backtrace in dmesg on qemuppc with 4.9Medium+Bruce Ashfield2.5 M2RESOLVEDWORKSFORME
12027 4Merge linux-yocto git trees to a single one to reduce download times and mirror sizesMedium+Bruce Ashfield2.5 M3RESOLVEDFIXED
12228 Race between do_make_sccripts() and recipes using the scripts it createsMedium+Bruce Ashfield2.5 M3RESOLVEDFIXED
12487 1kernel-yocto: configuration fragment with defconfig in name is garbled.Medium+Bruce Ashfield2.5 M3RESOLVEDFIXED
12640 recipes-kernel contains unnecessary recipesMedium+Bruce Ashfield2.5 M4RESOLVEDFIXED
10987 5Use initramfs-framework for initialization by default in OE-CoreMedium+California Sullivan2.5 M3RESOLVEDFIXED
12578 test_qemu_efi (oeqa.selftest.wic.Wic) fails on Fedora27 in masterMedium+California Sullivan2.5 M4RESOLVEDFIXED
12583 install scripts need smarter sizing of the boot partitionMedium+California Sullivan2.5 M4RESOLVEDFIXED
10548 4Eclipse CROPS plugin support for debugging via gdb to QEMUMedium+Chin Huat Ang2.5 M2RESOLVEDWONTFIX
10549 3Eclipse CROPS plugin support for debugging via gdb to hardware targetMedium+Chin Huat Ang2.5 M2RESOLVEDWONTFIX
10805 3Tinfoil usage in the test-suiteMedium+Daniela Plascencia2.5 M1RESOLVEDFIXED
11055 2tests: patch upstream status check fails erroneouslyMedium+Daniela Plascencia2.5 M1RESOLVEDFIXED
11518 1Upstream-Status Submitted and Inappropriate check for where/reason infoMedium+Daniela Plascencia2.5 M1RESOLVEDFIXED
10694 2rpm does not detect file clashes on do_rootfsMedium+dengke2.5RESOLVEDOBSOLETE
11548 5Reduce local Pending patchesMedium+dengke2.5 M3RESOLVEDNOTABUG
10773 3QA Bitbake: extend coverage for event unit testMedium+yeoh ee peng2.5 M2RESOLVEDFIXED
12444 [Test Case 1542] test_2_logrotate fails in MinnowMax with core-image-lsb-sdk-genericx86-64 imageMedium+yeoh ee peng2.5 M2RESOLVEDINVALID
11483 5Automate testcases for package managementMedium+yeoh ee peng2.5 M3RESOLVEDDUPLICATE
11488 5Testimage: Add tests for ipk/opkg like dnf/rpm onesMedium+yeoh ee peng2.5 M3RESOLVEDDUPLICATE
11363 15Support building and deploying multiple kernels for a single imageMedium+Haris Okanovic2.5 M2RESOLVEDFIXEDLET
11639 installing grub and grub-efi with conflictionMedium+Hongxu Jia2.5 M3RESOLVEDFIXED
12093 5do_populate_sdk RPM metadata conflict between nativesdk-cmake and nativesdk-qtbase-toolsMedium+Hongxu Jia2.5 M4RESOLVEDOBSOLETE
12209 qemuppc: Cannot manage 'undefined' PCI device type '<NULL>'Medium+Jackie Huang2.5 M1RESOLVEDReportedUpstream
12358 mozjs_17.0.0.bb:do_compile failed with DEFAULTTUNE "mips"Medium+Jackie Huang2.5 M1RESOLVEDWONTFIX
12594 large number of host-user-contaminated QA warnings with Fedora 27HighJackie Huang2.5 M4RESOLVEDFIXED
12632 matchbox: gconf isn't able to apply changesMedium+Jaewon Lee2.5 M4RESOLVEDFIXED
12028 4Create Test Plan for Kernel Test SuiteMedium+Jair Gonzalez2.5 M1RESOLVEDFIXED
12127 5Duplicate log observed on oe-selftest runsMedium+Jair Gonzalez2.5 M1RESOLVEDFIXED
12174 1RRS not reporting correct version for ca-certificatesMedium+Jose Lamego2.5 M1RESOLVEDFIXED
12094 2ptest: modify the result chart so that the current release commit is compared with the previous commit releaseHighJose Perez C2.5 M1RESOLVEDFIXED
12103 3Intermittent failures in updating submodules for intel-iot-refkit repositoryMedium+Joshua Lock2.5 M1RESOLVEDWORKSFORME
12326 1Rename beaglebone machine in meta-yocto-bspMedium+Joshua Lock2.5 M1RESOLVEDFIXED
12377 [morty-next] oe-selftest failedMedium+Joshua Lock2.5 M1RESOLVEDFIXED
12327 5Split embedded shell commands out into callable scriptsMedium+Joshua Lock2.5 M2RESOLVEDFIXED
12357 devtool sdk-install unable to add componentMedium+Joshua Lock2.5 M2RESOLVEDFIXED
12104 2Reduce the number of exported environment variablesMedium+Joshua Lock2.5 M3RESOLVEDFIXED
10415 1devtool: add: override preferred kernel when a new one is addedMedium+Juan Manuel Cruz Alcaraz2.5RESOLVEDFIXED
11700 1tcl_8.6.6: tclConfig.sh: non-deterministic generationMedium+Juro Bystricky2.5 M1RESOLVEDFIXED
11705 1gobject-introspection_1.50.0 contains various references to the host build systemMedium+Juro Bystricky2.5 M1RESOLVEDFIXED
11472 1Python Makefile contains many references to the build systemMedium+Juro Bystricky2.5 M2RESOLVEDFIXED
12221 3inconsistent .gnu_debuglinkMedium+Juro Bystricky2.5 M2RESOLVEDOBSOLETE
11178 2Use SOURCE_DATE_EPOCHMedium+Juro Bystricky2.5 M3RESOLVEDFIXED
11179 1Ensure TZ is also set to a consistent valueMedium+Juro Bystricky2.5 M3RESOLVEDFIXED
12058 3Qemu fails to start on recent kernels with KVM alloc() failureMedium+Juro Bystricky2.5 M3RESOLVEDNOTABUG
12277 1.5dbus-test-ptest is brokenMedium+Juro Bystricky2.5 M3RESOLVEDFIXED
11176 3Add optional command to rootfs-postprocess to remove non-determinism from rootfsMedium+Juro Bystricky2.5 M4RESOLVEDFIXED
11177 2Generate archives with deterministic metadataMedium+Juro Bystricky2.5 M4RESOLVEDMOVED
12422 2Support reproducible build for core-image-minimal imagesMedium+Juro Bystricky2.5 M4RESOLVEDFIXED
12544 kernel-module-xxx contain non-deterministic srcversionMedium+Juro Bystricky2.5 M4RESOLVEDFIXED
12625 (reproducibility) libc6-dbg contains build host referencesMedium+Juro Bystricky2.5 M4RESOLVEDFIXEDreproducibility
12662 nativesdk-diffutils build fails with mingw toolchainMedium+Juro Bystricky2.5 M4RESOLVEDFIXED
12679 commit: "apply MLPREFIX renaming to all package classes" breaks mingw buildHighJuro Bystricky2.5 M4RESOLVEDFIXED
12353 mips screen-4.6.2-r0 do_compileMedium+Kai Kang2.5 M1RESOLVEDOBSOLETE
11303 Variable tracking spikes memory usage during up-front recipe parsingMedium+Christopher Larson2.5RESOLVEDINVALID
12622 lsb kernels causing preferred version not found warningsMedium+Kevin Hao2.5 M4RESOLVEDFIXED
11800 1NOAUTOPACKAGEDEBUG undocumentedMedium+Kristi2.5 M1RESOLVEDFIXED19 DECEMBER, 2017: RESOLVED
11911 2connection lost between host-target on a nightly-arm-lsb AB buildMedium+Kristi2.5 M2RESOLVEDFIXED19 DECEMBER, 2017: RESOLVED
12537 1Ubuntu 14.04 is still listed in supported distros listMedium+Kristi2.5 M3RESOLVEDFIXED30 March 2018: RESOLVED
12546 eclipse-poky repo being renamed to eclipse-yoctoMedium+Kristi2.5 M4RESOLVEDFIXED15 February 2018: RESOLVED
12547 emoved the fetchall and checkuriall tasks, "bitbake X --runall=fetch" and "bitbake X --runall=checkuri" replace themMedium+Kristi2.5 M4RESOLVEDFIXED23 February 2018: RESOLVED
10874 3oe-selftest: 35% of the testing time is concentrated in 5 tests (out of ~200)Medium+Leonardo Sandoval Gonzalez2.5 M1RESOLVEDFIXED
11821 1nightly-oe-selftest 2.4_M1-574-g2ec756257e failedMedium+Leonardo Sandoval Gonzalez2.5 M1RESOLVEDFIXED
12218 devtool modify failing in fedora 26Medium+Leonardo Sandoval Gonzalez2.5 M1RESOLVEDDUPLICATE
11580 1oe-selftest: blocking buildhistory enablement is too onerousMedium+Leonardo Sandoval Gonzalez2.5 M2RESOLVEDWONTFIX
12385 oe-selftest: unable run test case moduleMedium+Leonardo Sandoval Gonzalez2.5 M2RESOLVEDFIXED
12253 5Guest VM has errors on tap cleaningMedium+Leonardo Sandoval Gonzalez2.5 M3RESOLVEDFIXED
12210 2populate_sdk_ext failed when multilibMedium+Robert Yang2.5 M2RESOLVEDFIXEDBackport to 2.4.1 and 2.3.3 if needed.
12270 2[rocko] [Test Case 1534] runqemu fails using esdk in nfs modeMedium+Robert Yang2.5 M2RESOLVEDFIXEDBackport 2.3.3 and 2.4.1?
12343 1Let QEMU_USE_KVM can be set to 1Medium+Robert Yang2.5 M2RESOLVEDFIXED
12341 ERROR: go-cross-canadian-x86-64-1.9-r0 do_compile: Function failedMedium+Matt Madison2.5 M1RESOLVEDFIXED
12704 Go fails to build on older hostsMedium+Matt Madison2.5 M4RESOLVEDFIXED
11960 1.5groupadd fails on ubuntu 16.04Medium+Maxin B. John2.5 M1RESOLVEDFIXED
12235 1image.bbclass: Consider adding --apparent-size to du -ks for get_rootfs_sizeMedium+Maxin B. John2.5 M1RESOLVEDDUPLICATE
12361 Fetcher failure for URL: "http://www.webdav.org/neon/neon-0.30.2.tar.gz"Medium+Maxin B. John2.5 M1RESOLVEDFIXEDPlease backport to pyro (2.3)
12461 IMAGE_TYPES cpio.lz4 isbrokenMedium+Maxin B. John2.5 M4RESOLVEDFIXEDBackport 2.4.2
12552 checkuri fails in masterMedium+Maxin B. John2.5 M4RESOLVEDWORKSFORME
12565 watchdog.service dead on startup with systemdMedium+Maxin B. John2.5 M4RESOLVEDFIXED
12460 Change in push.yoctoproject.org fingerprint causing connection timeout and autobuilder hangMedium+Michael Halstead2.5 M2RESOLVEDFIXED
12073 1selftest: setUpClass failed failing on ubuntu 17.04 (oeqa.selftest.signing.Signing)Medium+oscar lopez arandas2.5 M1RESOLVEDDUPLICATE
12575 Task do_make_scripts from imx-test_git.bb seems to be empty?!Medium+Otavio Salvador2.5 M4RESOLVEDFIXED
11763 1bitbake-diffsigs: -t matches wrong task signature filesMedium+Paul Eggleton2.5 M1RESOLVEDFIXED
12286 0.25python-gevent_1.0.1.bb requires https for all downloads nowMedium+Paul Eggleton2.5 M1RESOLVEDFIXED
12293 1SWIG not supporting node.js version > 7Medium+Paul Eggleton2.5 M1RESOLVEDFIXED
12318 0.25devtool upgrade+finish not deleting old filesMedium+Paul Eggleton2.5 M1RESOLVEDFIXED
9566 4devtool documentation is duplicated in dev and sdk manualsMedium+Paul Eggleton2.5 M4RESOLVEDFIXED23 March 2018: RESOLVED
12387 BBMASK is ignored for populate_sdk_extMedium+Paul Eggleton2.5 M4RESOLVEDWONTFIX
12184 2sysvinit-inittab_2.88dsf.bb: ${base_bindir}/start_getty?Medium+Robert Berger2.5 M4RESOLVEDFIXED
12297 1gcc7 fixes for armv5e [ARM] PR 82445 - (no boot)Medium+Khem Raj2.5 M1RESOLVEDFIXED
12336 1musl 1.18 fails to build for armv5teMedium+Khem Raj2.5 M1RESOLVEDFIXED
11672 0.1gcc 7 format-truncation off by one with O2Medium+Khem Raj2.5 M4RESOLVEDFIXED
12302 2kernel's perf compilation failing in nightly-arm-lsbMedium+Randy MacLeod2.5 M3RESOLVEDWORKSFORME
12163 1Obtuse error if build dir != cwdMedium+Richard Purdie2.5 M1RESOLVEDFIXED
12183 3core-image-sato nightly-ppc failed to boot during testimageMedium+Richard Purdie2.5 M1RESOLVEDFIXED
12232 0.5bitbake-layers create-layer has bad BBFILES entryMedium+Richard Purdie2.5 M1RESOLVEDFIXED
12301 Kernel boot hanging on 4.12.14 with qemux86-64Medium+Richard Purdie2.5 M1RESOLVEDFIXED
12329 testimage execution interrupted for nightly-x86Medium+Richard Purdie2.5 M1RESOLVEDFIXED
12039 2mips packages corrupt oe-selftestMedium+Richard Purdie2.5 M2RESOLVEDFIXED
12464 Failure when get_srcrev runs from fakeroot tasksMedium+Richard Purdie2.5 M2RESOLVEDFIXEDBackport 2.2.4, 2.3.4, and 2.4.2?
12373 Feature Backfilling doesn't work for multilibHighRichard Purdie2.5 M3RESOLVEDFIXED
12507 multiconfig throws python error on fresh checkout of OE-core on 'bitbake -c listtasks'Medium+Richard Purdie2.5 M3RESOLVEDWORKSFORME
12510 fetchall doesn't fetch PACKAGE_WRITE_DEPSMedium+Richard Purdie2.5 M3RESOLVEDFIXED
12550 Name change of eclipse-poky -> eclipse-yocto will cause breakage in AB eclipse plugin jobsMedium+Richard Purdie2.5 M4RESOLVEDFIXED
12606 lttng-tools not working after version upgradeMedium+Richard Purdie2.5 M4RESOLVEDFIXED
12250 3[ross/mut] nightly-x86 failed QEMU abortMedium+Ross Burton2.5 M1RESOLVEDFIXED
12251 1[ross/mut] nightly-oe-selftest failedMedium+Ross Burton2.5 M1RESOLVEDFIXED
12255 [ross/mut] test_dnf_reinstall failed on nightly-ppc-lsb sanity testMedium+Ross Burton2.5 M1RESOLVEDINVALIDBackport 2.3.3 and 2.4.1?
11513 2Python3 isn't multilib compatibleMedium+Ross Burton2.5 M2RESOLVEDFIXED
12057 2Package license wrong in RPM for ${PN} when ${LICENSE_${PN}} != ${LICENSE}Medium+Ross Burton2.5 M2RESOLVEDFIXEDBackport 2.4.2
12139 1ERROR: Multiple .bb files are due to be built which each provide gzip-nativeMedium+Ross Burton2.5 M2RESOLVEDFIXED
12265 2Can't build older versions of glibc when host features version 2.26Medium+Ross Burton2.5 M2RESOLVEDFIXEDBackport 2.3.3 and 2.4.1?
12397 patch_do_patch fails to detect patch failureMedium+Ross Burton2.5 M2RESOLVEDDUPLICATE
12410 cannot use pigz, pigz is not a drop in replacement for gzipMedium+Ross Burton2.5 M2RESOLVEDFIXED
10450 20Reduce fuzz factor when patching filesMedium+Ross Burton2.5 M3RESOLVEDFIXEDLET
11106 1eSDK generation fails with rm_workMedium+Ross Burton2.5 M3RESOLVEDOBSOLETE
12469 do_patch does not fail in a rare caseMedium+Ross Burton2.5 M3RESOLVEDDUPLICATE
12513 python3-dev contains build host references in ./usr/bin/python3.5m-configMedium+Ross Burton2.5 M3RESOLVEDFIXEDreproducible
12529 scripts/distro/build-recipe-list.py misses a large number of recipesMedium+Ross Burton2.5 M3RESOLVEDFIXED
12567 parallel_make_argument brokenHighRoss Burton2.5 M3RESOLVEDFIXED
12577 binutils 2.30 + musl + systemd + gobject-introspection failsMedium+Ross Burton2.5 M3RESOLVEDFIXED
10047 1Piglit isn't in images (removed from tools-testapps)Medium+Ross Burton2.5 M4RESOLVEDWONTFIX
11809 1Possible race in xcb recipesMedium+Ross Burton2.5 M4RESOLVEDFIXED
12605 likely race in gcc-runtime's do_package_write_rpmMedium+Ross Burton2.5 M4RESOLVEDFIXED
11967 creating root file systems using 'elf' failed with error convert_magic 00000000 != a5a5a5a5Medium+Saul Wold2.5 M1RESOLVEDFIXED
12162 ERROR: do_kernel_metadata: Could not locate BSP definitionMedium+Saul Wold2.5 M1RESOLVEDFIXED
12173 4wic cp,rm,ls of a partition e.g. ic ls myimage.wic:1/ fails if host mtools are not installedMedium+Saul Wold2.5 M1RESOLVEDFIXED
11714 3Intel AC 7260 Bluetooth interface stops responding after disabling BluetoothMedium+Saul Wold2.5 M2RESOLVEDWORKSFORME
11643 Special dot files . and .. exist for both for directories and filesMedium+Seebs2.5 M3RESOLVEDFIXED
12449 mkostemp() not implementedHighSeebs2.5 M3RESOLVEDFIXED
12379 pseudo cp loses sticky directory bitMedium+Seebs2.5 M4RESOLVEDFIXED
12568 application with "clone" can't work in bitbake devshellMedium+Seebs2.5 M4RESOLVEDNOTABUG
12191 5need to document new wic features wic cp, wic rm, and wic ls.Medium+Scott Rifenbark2.5 M1RESOLVEDFIXED13 Oct 2017: RESOLVED
12370 1Create new YP Overview ManualMedium+Scott Rifenbark2.5 M2RESOLVEDNOTABUG09 February 2018: RESOLVED/NOT A BUG
12300 4remove yocto-[bsp|kernel] documentationMedium+Scott Rifenbark2.5 M4RESOLVEDFIXED10 May 2018: RESOLVED
12167 1Remove yocto-layer now that bitbake-layers has been mergedMedium+Stephano Cetola2.5 M1RESOLVEDFIXED
12186 1add musl/qemux86-64 targetMedium+Stephano Cetola2.5 M1RESOLVEDFIXED
12494 1remove quark on meta-intel abMedium+Stephano Cetola2.5 M2RESOLVEDWONTFIX
12495 1Add Stephano & Cal to QA Alert EmailsMedium+Stephano Cetola2.5 M3RESOLVEDFIXED
12496 1update dropdowns to include sumoMedium+Stephano Cetola2.5 M3RESOLVEDFIXED
12030 5Complete section "3.11. Task Checksums and Setscene"Medium+Stephano Cetola2.5 M4RESOLVEDFIXED19 April 2018: RESOLVED
12558 No debugsrc is collected for static librariesMedium+Stephano Cetola2.5 M4RESOLVEDFIXED
12628 MACHINE_EXTRA_RRECOMMEND syntax not the bestMedium+Stephano Cetola2.5 M4RESOLVEDFIXED
12581 0.3libxml-namespacesupport-perl recipe is at a development releaseMedium+Tim Orling2.5 M4RESOLVEDFIXED
10534 5Create docker container to run RCPTT for Eclipse CROPS pluginMedium+Unassigned2.5RESOLVEDWONTFIX
11381 4oe-build-perf-report: show task summaryMedium+Unassigned2.5RESOLVEDFIXED
11382 4oe-build-perf-report: display changes in build contentMedium+Unassigned2.5RESOLVEDFIXED
11965 2autogen-native: /bin/sh: bad interpreter: Permission deniedMedium+Yi Zhao2.5 M2RESOLVEDOBSOLETE
   174      
Aaron Chan
12699Aaron Chan[2.5 M3 rc1] [OE-core] [autobuilder2] - buildoptions.ArchiverTest.test_arch_work_dir_and_export_source - Testcase 926: FAILED - oescripts.BuildhistoryDiffTests.test_buildhistory_diff - Testcase 295: FAILED - runtime_test.TestImage.test_testimage_dnf - TesMedium+Aaron Chan2.5 M4RESOLVEDNOTABUG
12700Aaron Chan[2.5 M3 rc1][poky-tiny][Centos7][autobuilder2] - Clobber build dir - failed to load utilsMedium+Aaron Chan2.5 M4RESOLVEDWONTFIX
12701Aaron Chan[2.5 M3 rc1][OE Core:Centos7] - Unpack shared repositoriesMedium+Aaron Chan2.5 M4RESOLVEDDUPLICATE
12647Aaron Chan[2.5 M3 rc1][OE-Core:Debian9] recipe xcursor-transport-theme went backwards, breaks package feedsHighPaul Eggleton2.5 M4RESOLVEDFIXED
12655Aaron Chan[2.5 M3 rc1][OE Core:Debian9] layerappend.LayerAppendTests.test_layer_appends - Testcase 1196: ERRORHighPaul Eggleton2.5 M4RESOLVEDFIXED
   5      
Apoorv
5866Apoorv5Reproducible builds: identical binariesMedium+Juro Bystricky2.5 M1RESOLVEDOBSOLETE
   1      
apoorv sangal
12566apoorv sangal[AUH] 'tmp' dir is hard-codedHighAlexander Kanavin2.5 M4RESOLVEDFIXED
12426apoorv sangalLayer index updates not being runHighMichael Halstead2.5 M2RESOLVEDFIXED
   2      
Ashwin Soman
12536Ashwin Soman[Meta-Intel 2.5 M1 RC1] Unable to boot up Minnowboard with core-image-sato-sdk-intel-core2-32Medium+California Sullivan2.5 M1RESOLVEDFIXED
   1      
yeoh ee peng
11757yeoh ee pengselftests: do not touch existing build artifactsMedium+Patrick Ohly2.5 M1RESOLVEDFIXED
12403yeoh ee peng[QEMU]core-image-sato: no input from keyboard nor mouse for x86HighRoss Burton2.5 M1RESOLVEDFIXED
   2      
Francisco Pedraza
12285Francisco Pedrazadevtool: upgrade: fails with a TypeErrorMedium+Paul Eggleton2.5 M1RESOLVEDFIXED
12356Francisco Pedrazadevtool search produces tracebacks and not returning the search resultsMedium+Paul Eggleton2.5 M2RESOLVEDFIXED
12177Francisco Pedraza2Support wic in the esdkMedium+Rebecca Chang2.5 M2RESOLVEDFIXED
   3      
Mohamad Noor Alim
12665Mohamad Noor Alim[2.5 M3 rc1] OpenSUSE42.3 runtime test fail at runtime_test.TextExport, runtime_test.TestImage, runtime_test.TestImage and oe_runmake.HighPaul Eggleton2.5 M4RESOLVEDFIXED
   1      
Stephen K Jolley
10230+Stephen K Jolleyoeqa refactor and improvements (master bug)Medium+Stephen K Jolley2.5 M3RESOLVEDFIXED
   1      
Toaster default assignee
12509Toaster default assignee[Eclipse] Drop yocto-bsp functionalityMedium+Chin Huat Ang2.5 M3RESOLVEDFIXED
12514Toaster default assigneeeclipse-poky: use modern form of AM_INIT_AUTOMAKE in configure.ac templateMedium+Chin Huat Ang2.5 M3RESOLVEDFIXED
12459Toaster default assignee1corrupted patch for bldcollector URL fileHighDavid Reyna2.5 M2RESOLVEDFIXED
12555Toaster default assignee1Toaster will not shut down due to extra PID from DjangoMedium+David Reyna2.5 M3RESOLVEDFIXED
12713Toaster default assigneeMove Toaster lookup to YP-2.5 Sumo releaseMedium+David Reyna2.5 M4RESOLVEDFIXED
12669Toaster default assigneeeclipse-plugin-neon/oxygen can't build yocto-docs masterHighScott Rifenbark2.5 M4RESOLVEDFIXED
   6      
Yi Zhao
10473Yi Zhao1Fail to launch custom qemu image with runqemuMedium+Leonardo Sandoval Gonzalez2.5 M1RESOLVEDOBSOLETE
   1      

2.5 RESOLVED Bugs - Need Verification - MEDIUM, LOW

IDQAESummary (170 tasks) PAssigneeMilestoneStatusResolutionWhiteboard
   0      
 
11740 2DAFT: Enable BeagleBone OTG Ethernet interface on genericx86 images.MediumAlejandro Hernandez2.5RESOLVEDFIXED
9602 2AUH: Run automated tests on alternative C librariesMediumAlexander Kanavin2.5RESOLVEDFIXED
11615 1auh: Send summary to maintainers when upgrade failsMediumAlexander Kanavin2.5RESOLVEDFIXED
12360 1Make AUH/devtool/distrodata play nice with each otherMediumAlexander Kanavin2.5 M3RESOLVEDFIXED
11207 1Add bbclass searchMediumAmanda Brindle2.5RESOLVEDFIXED
11208 1Email notification on publicationMediumAmanda Brindle2.5RESOLVEDFIXED
11415 1layerindex: gather available PACKAGECONFIG optionsMediumAmanda Brindle2.5RESOLVEDFIXED
12129 5Show recipe dependencies in layer indexMediumAmanda Brindle2.5RESOLVEDFIXED
3343 2perf script: install audit-libs-python to get syscall name for syscall-displaying scriptsLowAnuj Mittal2.5RESOLVEDFIXED
12121 muslx32: qat16 compilation errorMediumAnuj Mittal2.5RESOLVEDFIXED
12527 problems when trying to build kernel from multiple providersMediumAnuj Mittal2.5RESOLVEDNOTABUG
12504 [2.5 M1 RC3] LTP Test: LTP tests hung up on NUC7 and not able to complete full runMediumAnuj Mittal2.5 M4RESOLVEDWONTFIX
12333 gobject-introspection freezes during compilation when using OE rockoMediumGino Badouri2.5RESOLVEDWONTFIX
10539 4Use "new project template" framework to create sample GTK projectMediumbrian avery2.5RESOLVEDINVALID
10540 2Use "new project template" framework to create sample CMake projectMediumbrian avery2.5RESOLVEDINVALID
10542 use CDT "new build system" to enable building for the various supported Project typesMediumbrian avery2.5RESOLVEDINVALID
12488 Improve logging of event handlerMediumBhargava Sreekantappa Gayathri2.5RESOLVEDNOTABUG
10966 4Make the IMAGE_BOOT_FILES interface generally availableMediumCalifornia Sullivan2.5RESOLVEDWONTFIX
11837 1XSERVER uses xf86-video-mga from meta-oe instead of meta-intelMediumCalifornia Sullivan2.5RESOLVEDFIXED
12019 3Use xf86-video-modesettings instead of -intelMediumCalifornia Sullivan2.5RESOLVEDFIXED
12542 [Meta-Intel 2.5 M1 RC1] Unable to build poky tiny image where microcode source was inaccessibleMediumCalifornia Sullivan2.5 M1RESOLVEDFIXED
12188 4Make wic the default image type for genericx86 and genericx86-64MediumCalifornia Sullivan2.5 M3RESOLVEDFIXED
10537 2Use "new project template" framework to create sample Make projectMediumChin Huat Ang2.5RESOLVEDWONTFIX
10538 4Use "new project template" framework to create sample Automake projectMediumChin Huat Ang2.5RESOLVEDWONTFIX
10547 Eclipse CROPS plugin support for debugging via gdbMediumChin Huat Ang2.5RESOLVEDWONTFIX
11445 wic: allow wic to support additional partition (e.g. 4th partition)MediumChin Kooi KHOR2.5RESOLVEDOBSOLETE
11596 5bzip2-ptest: improve reproducible buildMediumCinly Ooi2.5 M1RESOLVEDFIXED
11711 5check proper prefix on subjectMediumDaniela Plascencia2.5RESOLVEDINVALID
9927 2yocto-bsp: listing properties stdout and data send to -o option should be the sameMediumDaniela Plascencia2.5 M1RESOLVEDOBSOLETE
9928 2yocto-bsp: logical if statements should be avoided in json return by list subcommandMediumDaniela Plascencia2.5 M1RESOLVEDOBSOLETE
11328 1tests: test_lic_files_chksum_presence uses a variable not always provided by BitbakeMediumDaniela Plascencia2.5 M1RESOLVEDFIXED
11753 3patchwork should track the HEAD commit id in stored patchesMediumDaniela Plascencia2.5 M1RESOLVEDOBSOLETE
11755 3patchtest-oe: test checking changes in lic_files_chcksum not failing when lacking the explanation in commit messageMediumDaniela Plascencia2.5 M1RESOLVEDFIXED
11519 1check for four-space indented in python metadataMediumDaniela Plascencia2.5 M2RESOLVEDOBSOLETE
12193 1Add env for shell calls in localhostbecontrollerMediumDavid Reyna2.5 M3RESOLVEDFIXED
12339 python-cryptography 2.0.3 from OE rocko requires -pthread in CFLAGS on some platformsMediumDerek Straka2.5RESOLVEDFIXED
2273 4Evaluate current image space settingsLowEd Bartosh2.5RESOLVEDFIXED
11891 4Port bmaptools to Python 3MediumEd Bartosh2.5RESOLVEDFIXED
6926 5Create yocto-bsp testsuite/testplanMediumyeoh ee peng2.5RESOLVEDOBSOLETE
10147 4Create a tool to compare the automated test list against the Testopia Test list DBMediumyeoh ee peng2.5 M4RESOLVEDFIXED
10499 NUC6 freezes on core-image-sato using genericx86-64 with kernel 4.1.33Lowyeoh ee peng2.5 M4RESOLVEDNOTABUG
12220 [OE-seltest] Some automated test cases are being missed in the test run.Mediumyeoh ee peng2.5 M4RESOLVEDFIXED
12435 Update testopia and templates. Remove some TCs and replace duplicates.Mediumyeoh ee peng2.5 M4RESOLVEDFIXED
10487 3readline examples should go in -doc packageMediumHongxu Jia2.5RESOLVEDFIXED
10752 2Add test to verify help option in oe scripts and ensure it's displayed when no required arguments are specifiedMediumJair Gonzalez2.5RESOLVEDINVALID
11216 4Convert DAFT in a service available for any Yocto auto builder workerMediumJair Gonzalez2.5RESOLVEDOBSOLETE
11217 2Remove DAFT's DHCP server dependencyMediumJair Gonzalez2.5RESOLVEDOBSOLETE
12369 improve error message when file conflict on modeMediumJosé Bollo2.5RESOLVEDWONTFIX
11886 2patchwork: series info page is uglyMediumJose Lamego2.5 M1RESOLVEDFIXED
11805 5Create yocto-bsp/yocto-kernel tools testsMediumJose Perez C2.5 M1RESOLVEDINVALID
11806 5Create test for yocto-kernel toolMediumJose Perez C2.5 M1RESOLVEDINVALID
7698 5Update to latest version of buildbotMediumJoshua Lock2.5RESOLVEDFIXED
10437 5Improve PublishArtifacts (remove hard-coded paths & assumptions)MediumJoshua Lock2.5RESOLVEDFIXED
10503 1Enable the capability to check the details of an image when is already bootedMediumJoshua Lock2.5RESOLVEDFIXED
10779 3Ensure auto.conf is restored at the end of build steps which modify itMediumJoshua Lock2.5RESOLVEDFIXED
11235 2Improve configuration parser - better error reporting and more lenientMediumJoshua Lock2.5RESOLVEDOBSOLETE
11508 0.5Bugs in MultiBranch GitPoller example code and limitation in buildbot libraryMediumJoshua Lock2.5RESOLVEDOBSOLETE
11509 1In default config, the autobuilder PR server does not workMediumJoshua Lock2.5RESOLVEDWONTFIX
11789 2Image build and sanity test in one bitbake invocationMediumJoshua Lock2.5RESOLVEDOBSOLETE
11825 4A "Let's try that again" buttonMediumJoshua Lock2.5RESOLVEDFIXED
12308 0.5Need to set oe-core branch in branch population?MediumJoshua Lock2.5RESOLVEDFIXED
12463 Split buildhistory repo creation into separate build stepMediumJoshua Lock2.5RESOLVEDFIXED
11671 1[openssh] Interrupting host key generation can prevent SSH loginMediumJoshua Watt2.5RESOLVEDFIXED
11920 2libperl5: improve binary reproducibilityLowJuro Bystricky2.5RESOLVEDFIXED
11921 3libstdc++-staticdev_7.1.0: improve reproducibilityLowJuro Bystricky2.5RESOLVEDFIXED
11958 2nativesdk-gnutls fails on system with toolchain installed in default location (using headers from toolchain)MediumJuro Bystricky2.5RESOLVEDFIXED
12000 [mingw32] nativesdk-mingw-w64-runtime fails to compileLowJuro Bystricky2.5RESOLVEDFIXED
12061 1failed to build eSDKMediumJuro Bystricky2.5RESOLVEDOBSOLETE
12215 2.5ptest-runner libpcre one failedMediumJuro Bystricky2.5RESOLVEDFIXED
12230 1ptest-runner FAIL: run-new-exp, 2.4_M4_rc2MediumJuro Bystricky2.5RESOLVEDWONTFIX
12291 2libc6: build not deterministicMediumJuro Bystricky2.5RESOLVEDFIXED
12324 1.5ptest-runner may run some tests twiceLowJuro Bystricky2.5RESOLVEDFIXED
12516 e2fsprogs: POT-​Creation-​Date removed non-deterministicallyMediumJuro Bystricky2.5RESOLVEDFIXEDreproducible
12523 (reproducibility) python3-gpg contains build host referencesMediumJuro Bystricky2.5RESOLVEDFIXED
12526 (reproducibility) jpeg-tools, libjpeg62 contain build dateMediumJuro Bystricky2.5RESOLVEDFIXEDreproducibility
10953 2util-linux installs libtool wrapper scripts instead of binaries for ptestMediumJuro Bystricky2.5 M1RESOLVEDFIXED
11811 2ptest-busybox cases failedMediumJuro Bystricky2.5 M4RESOLVEDNOTABUGbackport 2.3 & 2.4
11392 2Document how to specify a branch / tag / revision when using devtool add with a remote URLMediumKristi2.5 M1RESOLVEDFIXED26 September 2017: RESOLVED
12016 2Values for path variables in bitbake hello world tutorial make it harder to build upon itMediumKristi2.5 M2RESOLVEDFIXED22 DECEMBER 2017: RESOLVED
12089 1Need to document BBFILES_DYNAMICMediumKristi2.5 M2RESOLVEDFIXED05 February 2018: RESOLVED
12458 1DEFAULTTUNE link is incorrectMediumKristi2.5 M3RESOLVEDFIXED21 February 2018: IN PROGRESS REVIEW
11525 3wic: /etc/fstab to mount partitions with UUID instead of kernel name descriptorsMediumKristi2.5 M4RESOLVEDFIXED23 February 2018: RESOLVED
12467 1instructions for centos are wrongMediumKristi2.5 M4RESOLVEDFIXED18 January 2018: RESOLVED
9945 4patchtest-oe: check pull request series against git repositoryMediumLeonardo Sandoval Gonzalez2.5RESOLVEDOBSOLETE
9946 5patchtest: must be able to test the series on every branch specified on mbox summaryMediumLeonardo Sandoval Gonzalez2.5RESOLVEDFIXED
10477 2yocto-bsp: tool should output a conf file to be consume by the qemu runnerMediumLeonardo Sandoval Gonzalez2.5RESOLVEDOBSOLETE
10738 1patchtest: Patches not sent as reply to their respective series/root message should trigger a warning messageMediumLeonardo Sandoval Gonzalez2.5RESOLVEDINVALID
11368 Autobuilder ran out of memory during nightly-oe-selftestMediumLeonardo Sandoval Gonzalez2.5RESOLVEDDUPLICATE
11601 0.5check new patches are indicated in the SRC_URIMediumLeonardo Sandoval Gonzalez2.5RESOLVEDDUPLICATE
11780 1Commit message failures should link to commit patch guidelinesMediumLeonardo Sandoval Gonzalez2.5 M1RESOLVEDFIXED
10956 1selftest: sstatetessts should use world instead of image targets, making it distro agnosticMediumLeonardo Sandoval Gonzalez2.5 M2RESOLVEDFIXED
11793 create opkg and dpkg indexMediumLibertad2.5 M4RESOLVEDWONTFIX
12442 1FAILED: oe-selftest -r devtool.DevtoolTests.test_create_workspaceMediumRobert Yang2.5 M2RESOLVEDFIXED
10312 2Failed to execute child process "oe-gnome-terminal-phonehome" (No such file or directory)MediumMing Liu2.5RESOLVEDFIXED
10944 2syslog: don't use update-alternatives for init scriptsMediumMarkus Lehtonen2.5RESOLVEDFIXED
10300 2libunwind fails to build with ld-is-goldMediumMaxin B. John2.5RESOLVEDWORKSFORME
12051 0.5hostap-utils download site is downMediumMaxin B. John2.5 M1RESOLVEDFIXED
12486 links to QA test in wiki inaccessibleMediumMichael Halstead2.5RESOLVEDFIXED
10934 3RRS doesn't notice .lz upgradesMediumPaul Eggleton2.5RESOLVEDFIXED
10939 1devtool: upgrade: handle toplevel directory (S) changing in upstream tarballMediumPaul Eggleton2.5RESOLVEDFIXED
11399 1devtool modify does not work with S != "${WORKDIR}/git" and multiple git repos in playMediumPaul Eggleton2.5RESOLVEDFIXED
11516 2devtool: modify: handle switch to musl libc properlyMediumPaul Eggleton2.5RESOLVEDFIXED
11948 1devtool upgrade walks the file tree and execs a git add for each fileMediumPaul Eggleton2.5RESOLVEDFIXED
12317 using DEFAULT_PREFERENCE with SRCREV = "${AUTOREV}" can't workMediumPaul Eggleton2.5RESOLVEDINVALID
12381 devtool: deploy-target: only set port when explicitly requestedMediumPaul Eggleton2.5 M2RESOLVEDFIXED
12428 Check your system clockLowprsolucoes2.5RESOLVEDNOTABUG
12264 IMAGE_FSTYPES += "... wic.bmap ..." bmaptool freaking outMediumRobert Berger2.5 M1RESOLVEDNOTABUGBackport 2.3.3 and 2.4.1?
12222 populate_sdk fails with multilib due to lib32- packages uninstallableMediumRebecca Chang2.5 M2RESOLVEDWORKSFORME
11121 2Error in depmodwrapper-cross_1.0.bb when archiver inheritedMediumRichard Purdie2.5RESOLVEDFIXED
12497 [2.5 M1 RC3] Build Appliance : failed to build core-image-sato image & build-appliance-imageMediumRichard Purdie2.5RESOLVEDFIXED
12418 1Stale reference to meta-yoctoMediumRichard Purdie2.5 M2RESOLVEDINVALID30 March 2018: Set doc flag to "done"
11762 1Lacking documentation on virtual providersMediumRichard Purdie2.5 M3RESOLVEDFIXED23 March 2018: RESOLVED
12462 Git configuration can break poky scriptsMediumRichard Purdie2.5 M3RESOLVEDNOTABUG
4349 5An easy way to find out why a recipe is built and installed (RDEPENDS)MediumRoss Burton2.5RESOLVEDFIXED
8064 1ptest fails tracker bugMediumRoss Burton2.5RESOLVEDOBSOLETE
9539 3Resolve string formatting issues in busyboxMediumRoss Burton2.5RESOLVEDWONTFIX
10841 2pTest : Various test cases are failing on "dbus-test" moduleMediumRoss Burton2.5RESOLVEDDUPLICATE
11343 Wrong execution order of PACKAGESPLITFUNCSMediumRoss Burton2.5RESOLVEDDUPLICATE
11808 5cve-check does not match previous SW versionsMediumRoss Burton2.5RESOLVEDReportedUpstream
11936 1sato display should show ip address if availableMediumRoss Burton2.5RESOLVEDNOTABUG
11998 1sed-ptest missingMediumRoss Burton2.5RESOLVEDFIXED
12258 LICENSE in packagegroup?MediumRoss Burton2.5RESOLVEDFIXED
12321 ubuntu 16.04 not supporting to buildMediumRoss Burton2.5RESOLVEDNOTABUG
12196 1Update GStreamer to 1.12.3MediumRoss Burton2.5 M1RESOLVEDFIXED
8730 8separate code generating python manifest file from manifest information and improve the manifest generationMediumRoss Burton2.5 M2RESOLVEDFIXED
11510 6Improve the way we handle python's packaging (autopackaging)MediumRoss Burton2.5 M2RESOLVEDFIXEDLET
11694 7Python JSON manifest should be parsed directly by bitbakeMediumRoss Burton2.5 M2RESOLVEDFIXEDLET
11695 7Add task to create python manifest(s) automaticallyMediumRoss Burton2.5 M2RESOLVEDFIXEDLET
12398 libxslt intermittent fetch failuresMediumRoss Burton2.5 M2RESOLVEDFIXED
12608 maintainers.inc contains references to non-existent recipesMediumRoss Burton2.5 M4RESOLVEDFIXED
12384 [meta][util-linux] mount: /proc: operation permitted for root only.MediumSaul Wold2.5RESOLVEDMOVEDBackport 2.3.3 and 2.4.1?
11880 2kernel-devsrc: multiple System.map files present in kernel-build-artifactsMediumSaul Wold2.5 M2RESOLVEDFIXED
11309 Pseudo locks up with high numbers of threadsMediumSeebs2.5RESOLVEDFIXED
12371 5Purge concepts from YP Reference ManualMediumScott Rifenbark2.5 M4RESOLVEDFIXED09 February 2018: RESOLVED
12419 1Section 4.21.4.3.1 results in 404 error and failure to synchronize cacheMediumScott Rifenbark2.5 M4RESOLVEDFIXED20 March 2018: RESOLVED
11723 2automatically run yocto-compat-layer on meta-intel meta-intel buildsMediumStephano Cetola2.5RESOLVEDDUPLICATE
12125 1runqemu-gen-tapdevs not working when using directly from build-dirMediumStephano Cetola2.5RESOLVEDWONTFIXBackport 2.3.3?
11814 3Add a warning if buildhistory remote push failsMediumStephano Cetola2.5 M2RESOLVEDWONTFIX
11018 3Auto deploy and boot meta-intel images built with the ABMediumStephano Cetola2.5 M3RESOLVEDWONTFIX
12128 20Rework the Quickstart and intro to the manualsMediumStephano Cetola2.5 M3RESOLVEDFIXED
10603 Integrate the automated device testing to the AutobuilderMediumStephen K Jolley2.5RESOLVEDOBSOLETE
12582 0.1recipes-lsb4/perl recipes are still in maintainers.incMediumTim Orling2.5RESOLVEDFIXED
12126 upgrade meta-intel-clear-containers to 3.0MediumTodor Minchev2.5 M1RESOLVEDFIXED
2087 3Fix or otherwise address existing failing LTP and POSIX compliance testsLowYi Zhao2.5 M2RESOLVEDOBSOLETE
12518 1Ctrl+C doesn't close menuconfig terminalMediumYi Zhao2.5 M3RESOLVEDWONTFIX
   145      
Apoorv
7174Apoorv1AUH can't tell when MACHINE is set with = in local.conf and thus multi-machine build won't workLowAlexander Kanavin2.5RESOLVEDFIXED
9267Apoorv3test_parselogs (oeqa.runtime.parselogs.ParseLogsTest) failed on NUC 6i5SYH, firmware load for i915/skl_guc_ver4.bin failedMediumCalifornia Sullivan2.5RESOLVEDFIXED
10063Apoorv5testimage: Add tests for apt/dpkg like smart/rpm onesMediumyeoh ee peng2.5 M3RESOLVEDFIXED
   3      
apoorv sangal
12423apoorv sangalDjango is running in debug modeMediumPaul Eggleton2.5RESOLVEDFIXED
   1      
David Lopez Barriba
8735David Lopez Barriba5AUH: Use tinfoil instead of parse the recipe itselfMediumAlexander Kanavin2.5RESOLVEDOBSOLETE
   1      
yeoh ee peng
10672yeoh ee peng1AUH log's tarball should have relative path starting at the timestampMediumAlexander Kanavin2.5RESOLVEDFIXED
10801yeoh ee peng3devtool: upgrade: report diff for changed files referred to by LIC_FILES_CHKSUMMediumAlexander Kanavin2.5 M1RESOLVEDFIXED
10598yeoh ee peng5AUH: make use of devtool upgrade (or at least share code)MediumAlexander Kanavin2.5 M3RESOLVEDFIXED
12118yeoh ee pengmuslx32: webkitgtk compilation errorMediumAnuj Mittal2.5RESOLVEDFIXED
12119yeoh ee pengmuslx32: boost compilation errorMediumAnuj Mittal2.5RESOLVEDFIXED
12120yeoh ee pengmuslx32: gdb compilation errorMediumAnuj Mittal2.5RESOLVEDFIXED
12122yeoh ee pengmuslx32: systemd-boot compilation errorMediumAnuj Mittal2.5RESOLVEDFIXED
12123yeoh ee pengmuslx32: acpica compilation errorMediumAnuj Mittal2.5RESOLVEDFIXED
10455yeoh ee peng2[morty][Test Case 1059] Parselogs is failing on genericx86 (32 and 64 bits) giving error: blk_update_request: I/O error, dev loop0MediumCalifornia Sullivan2.5 M3RESOLVEDFIXED
11950yeoh ee peng(refkit) Error compiling libtpm-native-1.0MediumMikko Ylinen2.5RESOLVEDOBSOLETE
11951yeoh ee peng(refkit) tpm-tools-native-1.3.9.1 compile errorMediumMikko Ylinen2.5RESOLVEDOBSOLETE
   11      
Juan Ramos
9563Juan Ramos5yocto-kernel script should use argparse instead of optparse libraryMediumDaniela Plascencia2.5RESOLVEDOBSOLETE
11765Juan Ramos5Create DAFT test fixture for BSP QA cyclesMediumJair Gonzalez2.5RESOLVEDFIXED
9787Juan Ramos4create selftest for useradd-staticidsMediumJose Perez C2.5 M2RESOLVEDFIXED
   3      
Libertad
11909LibertadEclipse plugin build forces ipv4 when it should notMediumbrian avery2.5RESOLVEDWONTFIX
12095Libertad1Toolchain.Host.Mismatch problemMediumChin Huat Ang2.5 M2RESOLVEDWONTFIX
11642Libertad5Use DAFT to execute BSP's automated test on QA cycles.MediumJair Gonzalez2.5RESOLVEDOBSOLETE
12087Libertad0.5Eclipse Oxygen needs to be added. Eclipse Mars needs to be droppedMediumJoshua Lock2.5 M1RESOLVEDFIXED
   4      
oscar lopez arandas
9564oscar lopez arandas5yocto-layer script should use argparse instead of optparse libraryMediumDaniela Plascencia2.5RESOLVEDOBSOLETE
   1      
Stephen K Jolley
10536Stephen K JolleyUse "new project template" framework to create sample projectsMediumbrian avery2.5RESOLVEDINVALID
   1      

Please note that all contributions to Yocto Project may be edited, altered, or removed by other contributors. If you do not want your writing to be edited mercilessly, then do not submit it here. You are also promising us that you wrote this yourself, or copied it from a public domain or similar free resource (see Yocto Project:Copyrights for details). Do not submit copyrighted work without permission!

Summary:

This is a minor edit  Watch this page

Save page Show preview Show changes Cancel | Editing help (opens in new window) page discussion edit history move watch Yeoh, Ee Peng talk preferences watchlist contributions log out navigation Main page Recent changes Random page search

Go   Search

tools What links here Related changes Upload file Special pages Powered by MediaWiki Privacy policy About Yocto Project Disclaimers

Personal tools