1.4 Features to Test Case

From Yocto Project
Jump to: navigation, search

This page is work progress; the data displayed may not be correct/complete.


Contents

1.5 Features that need to have TC's as soon as possible:

IDRequesterSummary (626 tasks) MilestoneAssigneeStatusSeverityPWhiteboard
1088Gary ThomasMore fully document packaging systems1.5 M5Paul EggletonRESOLVEDnormalLow
1159Scott GarmanNeed to change numeric user/groupids to names in device_table-minimal.txt1.5 M5Chen QiVERIFIEDenhancementMedium
2766Yi Zhaocoreutils build error with long TMPDIR: Argument list too long1.5 M5Robert YangRESOLVEDnormalMedium
3938Yi Zhaorouterstation/mpc8315e: connman startup unused ethernet port when using nfs1.5 M5Mihai PricaRESOLVEDnormalMedium+
4128Randy MacLeodcommon perl packages should be added to oe-core.1.5 M5Hongxu JiaVERIFIEDenhancementMedium
4151Stefan StanacarImprovments for the performance tests script1.5 M5Stefan StanacarVERIFIEDenhancementMedium+
4360Ross Burtonbluez5 QA warnings in multilib1.5 M5Mihai PricaRESOLVEDnormalMedium
4487Stefan StanacarISO images don't boot under qemu - hang at waiting for removable media1.5 M5Chen QiVERIFIEDnormalMedium
4660Alexandru Georgescu[QA] - verify - Add Bastille Linux Support to Yocto1.5 M5Stoicescu CornelVERIFIEDenhancementHigh
4693Alexandru Georgescu[QA] - verify - A small common BSP with graphics for as many platforms as possible (x86)1.5 M5Stoicescu CornelVERIFIEDenhancementHigh
4726Alexandru Georgescu[QA] - verify - Improvments for the performance tests script1.5 M5Stefan StanacarVERIFIEDenhancementMedium+
4727Cristian IorgaOpening build logs does not work in HOB under Build Appliance1.5 M5Cristian IorgaVERIFIEDnormalMedium
4730Belen Barros PenaProduce documentation for Web Hob1.5 M5Scott RifenbarkVERIFIEDenhancementMedium17 September 2013 - RESOLVED
4783Yi Zhao[adt-installer] ARM: target arch change from armv5te to armv7a-vfp-neon in environment setting script.1.5 M5Laurentiu PalcuVERIFIEDnormalMedium+
4818Alexandru Georgescuno version displayed in /etc/version1.5 M5Paul EggletonVERIFIEDnormalMedium
4832Chandrak[Test Case 225] ethernet static ip set in connman1.5 M5Cristian IorgaVERIFIEDnormalMedium
4863Alexandru Palalausystemd failed proc-sys-fs-binfmt_misc.mount service1.5 M5Ross BurtonVERIFIEDnormalMedium+
4866Paul EggletonSDK installer fails on hosts with Python 3.x1.5 M5Laurentiu PalcuRESOLVEDnormalMedium+24 March 2014: Set Documentation flag to "Done".
4867Holger Freytherpkg_postinst_kernel-image calls depmod but there is no RDEPENDS on module-init-tools-depmod1.5 M5Darren HartRESOLVEDnormalMedium
4880Chen QiUse a uniform way to determine whether rootfs is read-only1.5 M5Chen QiRESOLVEDnormalMedium
4888Chen QiTake into consideration that possibility of /var/lib on a separate writable media in case of a read-only rootfs1.5 M5Chen QiRESOLVEDnormalMedium
4999Belen Barros PenaLabeling changes need in the "Select from my image recipes" dialog1.5 M5Cristiana VoicuVERIFIEDenhancementMedium
5000Belen Barros PenaHob forgets the image recipe I had selected1.5 M5Cristiana VoicuVERIFIEDnormalMedium
5001Belen Barros PenaMy image recipes should not be listed permanently in the combo box1.5 M5Cristiana VoicuVERIFIEDnormalMedium
5003Belen Barros PenaThe 'Description' field in the 'Save image recipe' dialog does not enforce the character limit1.5 M5Cristiana VoicuVERIFIEDminorLow
5004Belen Barros PenaThe "Save image recipe" dialog should be populated when I am saving changes to a custom image recipe1.5 M5Cristiana VoicuVERIFIEDnormalMedium
5028Cristian IorgaBlueZ 5 packs tests in a -tests package1.5 M5Mihai PricaRESOLVEDnormalMedium
5034Cristian Iorga"File a bug" button does not work under Build Appliance1.5 M5Mihai PricaVERIFIEDnormalMedium
5045Stefan Stanacarsmart fails with Cannot allocate memory1.5 M5Paul EggletonVERIFIEDnormalMedium+
5047Mihai Prica[ruqemu] iptables rule does not get cleaned1.5 M5Chen QiRESOLVEDnormalMedium
5048Mihai Prica[runqemu] failure when already in use tap interface1.5 M5Chen QiRESOLVEDnormalMedium
5051Jonathan LiuERROR: Can NOT get PRAUTO, exception timed out1.5 M5Richard PurdieVERIFIEDcriticalHigh
5052Yi Zhao[HOB] Can not choose non-x86 qemu to build1.5 M5Cristiana VoicuVERIFIEDnormalMedium
5056Saul Woldpossible parallel make issue with telepathy-mission-control1.5 M5Cristian IorgaRESOLVEDnormalMedium
5060Hongxu Jialist-packageconfig-flags.py: search bitbake lib dir failed1.5 M5Hongxu JiaRESOLVEDnormalMedium
5061Cristiana Voicu[Build-appliance] Can not choose non-x86 qemu to build1.5 M5Cristian IorgaVERIFIEDnormalMedium+
5063Stoicescu Cornelrunning bitbake from a location inside build/ gives python trace call1.5 M5Richard PurdieVERIFIEDnormalMedium01 October 2013 - Completed Doc requirement
5065Elvis DowsonDocument the fact that the SRCREV_meta needs to be updated after modifying the linux-yocto metadata meta branch1.5 M5Scott RifenbarkRESOLVEDmajorMedium13 September 2013: IN PROGRESS REVIEW
5067Robert Yangbitbake make-3.81 prints stack trace of python calls1.5 M5Robert YangRESOLVEDnormalMedium24 March 2014: Set Documentation flag to "No".
5070Cristiana Voicu[HOB] MACHINE should be saved in conf files usign ?=1.5 M5valentinRESOLVEDnormalMedium
5071Belen Barros PenaCannot build anything after interrupting a build1.5 M5Alexandru DamianVERIFIEDnormalMedium+
5074Belen Barros PenaIn the All Builds table, clicking on a cell in the Target column returns 4041.5 M5Alexandru DamianVERIFIEDnormalMedium+
5075Andreea Brandusa Proca[webhob-poky/master]Wrong script type.1.5 M5Alexandru DamianVERIFIEDnormalMediumbitbake, toasterui
5077Ning Zhangbeagleboard can not boot up with 1.5_M4.rc2 image1.5 M5Liming WangVERIFIEDmajorHigh
5078NavaniPopulate_sdk does not build correct cross toolchain for arm.1.5 M5Laurentiu PalcuRESOLVEDmajorMedium+
5081Paul EggletonCleanup of perl recipes in meta-security1.5 M5mulhernRESOLVEDnormalMedium
5084Paul Eggletonlibcap-ng has seemingly erroneous DEPENDS on libcap1.5 M5mulhernRESOLVEDminorLow
5088Alexandru Palalau[OE-Core]Buildhistory fails to report error if PR of some recipes go backwards1.5 M5Paul EggletonVERIFIEDnormalMedium
5091Larry BakerFix for libtool-cross do_qa_configure error when building cross gfortran1.5 M5Richard PurdieRESOLVEDcriticalMedium+
5093Peter A. Bigotadd pointer to kernel architecture manuals1.5 M5Scott RifenbarkRESOLVEDnormalLow07 October 2013: RESOLVED
5094Robert YangCheck whether multiple versions of the same PN are due to be built1.5 M5Robert YangVERIFIEDnormalMedium
5095Yi ZhaoKeyboard doesn't work on qemumips1.5 M5Bruce AshfieldVERIFIEDnormalMedium+
5099Robert Yangglib-2.0: host contamination issue1.5 M5Robert YangRESOLVEDnormalUndecided
5100Ning ZhangUse "yocto-kernel patch add" added a patch, then core-image-sato build hangs.1.5 M5Bruce AshfieldVERIFIEDnormalMedium+
5101Andreea Brandusa ProcaWrong number of recipes.1.5 M5Cristiana VoicuVERIFIEDnormalMedium
5102Alexandru Georgescucannot liveboot or install crownbay-noemgd 1.5_M41.5 M5Nitin KambleVERIFIEDnormalMedium
5103Alexandru Georgescuowl-video can not play ogv video file properly on crownbay1.5 M5Ross BurtonVERIFIEDnormalMedium
5104Mihai Lindnercommon-pc missing CONFIGs of atom-pc1.5 M5Darren HartVERIFIEDnormalMedium+
5106Jonathan Liuyocto-bsp: fails to create bsp with ${TOPDIR} in BBLAYERS1.5 M5Tom ZanussiVERIFIEDnormalMedium
5107Jonathan Liuyocto-bsp: kernel should be 3.10 by default1.5 M5Tom ZanussiVERIFIEDmajorMedium+
5109YunguoUSB 3.0 is not supported in genericX86-641.5 M5Darren HartVERIFIEDmajorMedium+
5110YunguoMissing iwlwifi-7260 firmware1.5 M5Darren HartRESOLVEDmajorMedium+
5111Mihai PricaError for ptest when default shell is dash1.5 M5Saul WoldRESOLVEDnormalMedium
5112Yunguoiwconfig doesn't work1.5 M5Darren HartRESOLVEDmajorMedium
5115Andreea Brandusa Proca[webhob-poky/master]No value for some fields.1.5 M5Alexandru DamianVERIFIEDnormalMedium+
5116Peter A. Bigotmissing qt4-x11-free dependency on gtk1.5 M5Paul EggletonRESOLVEDnormalMedium
5117Stoicescu Cornelgeneric-x86-64 image does not recover display after standby1.5 M5Nitin KambleVERIFIEDnormalMedium
5119DiegoPanda3D segfaults if running with OpenGL instead of OpenGL ES backend.1.5 M5Otavio SalvadorRESOLVEDnormalMedium
5121Chen QiStarting apmd failed at system startup1.5 M5Saul WoldRESOLVEDnormalMedium
5122LiRongQingaclocal hardlinks causing problems when creating sstate tarballs1.5 M5Richard PurdieRESOLVEDnormalMedium+
5123LiRongQingbtrfs-tools_git failed (d0_compile) when enable parallel building1.5 M5LiRongQingRESOLVEDnormalMedium
5124Chen Qibuilding kmod with 'ptest' in DISTRO_FEATRUES failed1.5 M5Tudor FloreaRESOLVEDnormalMedium
5125LiRongQingptest-runner should check both of /use/lib and /use/lib641.5 M5LiRongQingRESOLVEDnormalMedium
5126LiRongQingptest-runner can not deal with soft link under /usr/lib or /usr/lib64, such as perl5 --> perl1.5 M5LiRongQingRESOLVEDnormalMedium
5127Jackie Huangbase.bbclass: do_unpack failed for *.xz files if xz is not installed on host1.5 M5Saul WoldVERIFIEDnormalMedium
5128Chen Qido_install_ptest_base doesn't behave as expected if the host is ubuntu (dash)1.5 M5Chen QiRESOLVEDnormalMedium
5129Chen Qido_install_ptest_base should have cleandirs flag1.5 M5Chen QiRESOLVEDnormalMedium
5130Stoicescu Cornelaudio is not working on genericx86 images1.5 M5Nitin KambleVERIFIEDnormalMedium
5131Beth FlanaganSlow/hung boot failure for qemumips/qemuppc image test1.5 M5Ross BurtonRESOLVEDnormalMedium+
5133Chandrak[Test Case 207] sudoku-savant project compile in sdk image1.5 M5Laurentiu PalcuVERIFIEDnormalMedium+
5136Robert Yangbuildhistory.bbclass: doesn't work when PV changed1.5 M5Chen QiRESOLVEDnormalMedium
5137Robert Yange2fsprogs: blkid should be in ALTERNATIVE_LINK_NAME1.5 M5Chen QiRESOLVEDnormalMedium
5138Robert Yangnativesdk-linux-libc-headers: do_install: Argument list too long1.5 M5Robert YangRESOLVEDnormalMedium
5141Kai KangFail to build midori1.5 M5Kai KangRESOLVEDnormalMedium
5144LiRongQingwhen use systemd, "systemctl --user" can not print out expected info1.5 M5Ross BurtonRESOLVEDnormalMedium
5145Stefan Stanacardo_package_write_rpm failed for libproxy1.5 M5Saul WoldVERIFIEDnormalMedium
5151Hongxu JiaLSB Desktop Tests: desktop-xml failed1.5 M5Hongxu JiaRESOLVEDnormalMedium
5152Hongxu JiaLSB Command Check: install_initd and remove_initd not found1.5 M5Hongxu JiaRESOLVEDnormalMedium
5153Hongxu JiaLSB 4.1 Library Check: Unable to find library libqt-mt.so.31.5 M5Hongxu JiaRESOLVEDnormalMedium
5154Jackie HuangLSB python tests: 3 tests failed: test_codecs test_re test_unicode1.5 M5Hongxu JiaRESOLVEDnormalMedium
5156Kai Kangdpkg fails to do_configure for qemumips641.5 M5Marius AvramRESOLVEDnormalMediumWR
5160Kai Kangwebkit-gtk build failed randomly with "Memory exhausted"1.5 M5Joe SlaterRESOLVEDnormalMedium
5161Jon NettletonEglibc 2.18 binaries will not boot on non-NEON hardware1.5 M5Khem RajRESOLVEDnormalMedium
5162Mark HatleUnable to build core-image-sato due to dependencies1.5 M5Ross BurtonVERIFIEDnormalMedium+
5164Chen QiLive image's initramfs should distinguish between iso and hddimg1.5 M5Chen QiRESOLVEDnormalMedium+
5165Paul Eggletonbluez5 fails at do_package_write_*1.5 M5Saul WoldRESOLVEDnormalMedium
5166Nitin Kamblenuc: mouse is getting disabled after few seconds of inactivity1.5 M5Nitin KambleRESOLVEDnormalMedium
5167LiRongQingLSB tcl tests: 21 failures for 'Tcl Tests' on qemux86-641.5 M5Hongxu JiaRESOLVEDnormalMedium
5168Robert Yangperf: no source after do_unpack1.5 M5Robert YangRESOLVEDnormalMedium
5169Jackie Huangcore-image-minimal: do_rootfs failed when NO_RECOMMENDATIONS set to 11.5 M5Chen QiRESOLVEDnormalMedium
5171Robert Yangicu-native: do_install: Segmentation fault1.5 M5Robert YangRESOLVEDnormalMedium
5172Ross BurtonCache failing when _remove used1.5 M5Richard PurdieRESOLVEDnormalMedium+
5173Björn ArnelidWARNING: addon feature "features/nfsd/nfsd-enable" was not found1.5 M5Saul WoldVERIFIEDnormalMedium
5174Martin Jansalibtool with bashisms enabled in script can be shared through sstate-cache with host where /bin/sh is dash and cause build issues1.5 M5Richard PurdieRESOLVEDnormalMedium
5175Hongxu JiaLSB Command Check: su not found1.5 M5Hongxu JiaRESOLVEDnormalMedium
5176Yi ZhaoAll qemu and BSPs fail to boot via nfs with 1.5 M5 rc1 build1.5 M5Jukka RissanenVERIFIEDmajorMedium+
5181Yi Zhao[adt-installer] Fail to install adt1.5 M5Laurentiu PalcuVERIFIEDnormalMedium+
5184Robert Yangtelepathy-mission-control: do_compile failed1.5 M5Robert YangRESOLVEDnormalMedium
5186Belen Barros Pena[webhob-poky/master] "Started on" and "Completed on" times are incorrect1.5 M5Alexandru DamianVERIFIEDnormalMediumtoasterui
5188Belen Barros Pena[webhob-poky/master] "Output" column in Builds table is blank1.5 M5Cristiana VoicuVERIFIEDnormalMedium
5191Belen Barros Pena[webhob-poky/master] The "image?" column in the builds table is blank1.5 M5Alexandru DamianVERIFIEDnormalMedium
5193Belen Barros Pena[webhob-poky/master] Incorrect DESCRIPTION value for recipes1.5 M5Alexandru DamianVERIFIEDnormalMedium
5195Belen Barros Pena[webhob-poky/master] In the simple interface, the "Recipe dependency" column is blank1.5 M5Alexandru DamianVERIFIEDnormalMedium
5196Belen Barros Pena[webhob-poky/master] Package dependency information cannot be read1.5 M5Alexandru DamianVERIFIEDnormalMedium
5197Belen Barros Pena[webhob-poky/master] the "Packages for <target>" table is empty1.5 M5Alexandru DamianVERIFIEDnormalMedium
5198Belen Barros Pena[webhob-poky/master] no variable descriptions shown for prefixed / suffixed variables1.5 M5Cristiana VoicuVERIFIEDnormalMedium
5201Robert Yangdo_rootfs: File name too long (deep tmpdir)1.5 M5Robert YangRESOLVEDnormalMedium
5205Stoicescu Cornelmeta-intel: some images fail to build -sdk image1.5 M5Paul EggletonVERIFIEDnormalMedium+
5207Paul EggletonSSH test fails with nightly-qa-systemd1.5 M5Stefan StanacarVERIFIEDnormalMedium+
5209Anders Darander[u-boot][Regression] u-boot fw_printenv no longer built and packaged1.5 M5Anders DaranderVERIFIEDmajorMedium+
5212Jackie Huangfindutils_4.2.31: do_install failed by doc build failure1.5 M5Jackie HuangRESOLVEDnormalMedium
5217Belen Barros Pena[webhob-poky/master] incorrect warnings_no value in the builds table1.5 M5Cristiana VoicuVERIFIEDnormalMedium
5221Saul Wold[autobuilder] perf build failures on meta-fsl-ppc1.5 M5Otavio SalvadorRESOLVEDcriticalHigh
5222Saul Wold[autobuilder] universe target is failing with multiple provider ERRORs instead of warnings1.5 M5Richard PurdieRESOLVEDmajorHigh
5223Saul Wold[autobuilder] u-boot-fw-utils does not build correctly1.5 M5Otavio SalvadorRESOLVEDmajorHigh
5230Paul Eggletoncore-image-minimal now contains shadow1.5 M5Saul WoldVERIFIEDnormalMedium+
5233Mihai Lindnerudevd failed to execute /etc/udev/scripts/mount.sh1.5 M5Darren HartVERIFIEDnormalMedium
5237Mihai Lindnerkernel panic - missing "root=" boot option1.5 M5Darren HartRESOLVEDnormalMedium
5239Saul Wold[autobuilder] u-boot does not build correctly1.5 M5Zhenhua LuoRESOLVEDnormalMedium+
5241Olivier Guiterpackage_deb fails in do_rootfs1.5 M5Laurentiu PalcuVERIFIEDmajorMedium+
5242Belen Barros Pena[webhob-poky/master] Builds fail at linux-libc-headers.do_package1.5 M5Alexandru DamianVERIFIEDnormalMedium
5246Paul EggletonVariable dependency parsing does not handle braces within functions well1.5 M5Richard PurdieRESOLVEDnormalMedium+
5248Hongxu Jiacore-image-lsb: FPU doesn't work correctly on qemux86-641.5 M5Saul WoldVERIFIEDnormalMedium+
5249Richard Purdiemeta-fsl-ppc should not be overriding linux-libc-headers1.5 M5Zhenhua LuoRESOLVEDnormalMedium+
5250Mihai Lindnerpsplash: inconsistent basehash for do_compile task1.5 M5Paul EggletonVERIFIEDnormalMedium
5258Alexandru Damian[webhob-poky/master] missing sstate_checksum1.5 M5Alexandru DamianVERIFIEDnormalMedium
5259Alexandru Georgescuadt-installer uses wrong permissions when extracting the sysroot1.5 M5Laurentiu PalcuVERIFIEDmajorMedium+
5262Alexandru Palalau[yocto-bsp] Failed building image for BSP(qemuarm) created with yocto-bsp1.5 M5Tom ZanussiVERIFIEDnormalMedium
5263Chen Qibuildhistory should always record PKG, PKGE, PKGV and PKGR1.5 M5Chen QiRESOLVEDnormalMedium
5277Yi Zhao[adt-installer] arm-poky-linux-gnueabi-gcc: command not found1.5 M5Richard PurdieRESOLVEDnormalMedium+20 March 2014: Doc flag reset to "No"
5279Ada Solcanusb mouse and keyboard don't work at liveboot on emenlow1.5 M5Nitin KambleVERIFIEDnormalMedium+
5288Ionut ChisanoviciIncremental RPM image generation fails1.5 M5Saul WoldVERIFIEDnormalMedium+
5303Stoicescu Cornelreference manual entry for buildhistory is incorrect1.5 M5Scott RifenbarkVERIFIEDnormalMedium+03 October 2013: RESOLVED
5340Alexandru Georgescu[ADT] cannot configure CVS project using adt with mips and ppc1.5 M5Richard PurdieVERIFIEDmajorHigh
5353Yi Zhao[ADT] adt-installer failed to install on 32bit host1.5 M5Beth FlanaganRESOLVEDmajorMedium+
1950Darren HartEFI only live images are not bootable1.5 M4Darren HartRESOLVEDnormalMedium
2308Song LiuA small common BSP with graphics for as many platforms as possible (x86)1.5 M4Ross BurtonVERIFIEDenhancementHigh
3506Cristian Iorga[Build Appliance] Build Appliance does not include an web browser1.5 M4Mihai PricaVERIFIEDenhancementMedium
3812Richard PurdieBitbake event handlers recieve all events1.5 M4Cristiana VoicuVERIFIEDenhancementMedium+
3848Darren HartCreate ext* filesystems using libext2fs and debugfs1.5 M4Robert YangVERIFIEDenhancementMedium+
3867Scott GarmanAdd Bastille Linux Support to Yocto1.5 M4mulhernVERIFIEDenhancementHigh
3868Dave StewartAdd gcc security flags1.5 M4Saul WoldRESOLVEDenhancementHigh08 April 2014: Setting documentation flag to "Done."
4072Mark HatleAvoid circular dependencies when building initramfs that includes kernel modules1.5 M4Bruce AshfieldVERIFIEDenhancementHigh11 March 2014: resetting doc flag to "Done"
4079Mark HatleAbility to ignore a package (don't install a package)1.5 M4Mark HatleRESOLVEDenhancementHigh10 Sept 2013: RESOLVED (with doc change)
4103Jason WesselStop using linux live and replace with read-only rootfs1.5 M4Chen QiRESOLVEDenhancementMedium
4142Jason WesselAvoid cache reload for incremental development using a backgrounded bitbake server1.5 M4Richard PurdieVERIFIEDenhancementMedium+
4281Belen Barros PenaView log files1.5 M4Alexandru DamianVERIFIEDenhancementMedium+
4321Belen Barros PenaThe height of an information window must not exceed the screen height1.5 M4Cristiana VoicuVERIFIEDminorMedium
4368Robert YangWay to list all the PACKAGECONFIG's flags1.5 M4Hongxu JiaVERIFIEDenhancementMedium
4494Cristian IorgaSetting static IP addresses via connman ethernet provisioning mechanism does not allow manual IP adress change1.5 M4Cristian IorgaRESOLVEDnormalMedium
4599venkata ramana gConnection Properties shows the network disabled, for UNFS qemuarm target1.5 M4venkata ramana gRESOLVEDnormalMedium
4640Alexandru Georgescu[QA] - Verify - Create ext* filesystems using libext2fs and debugfs1.5 M4Mihai LindnerVERIFIEDenhancementMedium+
4678Alexandru Georgescu[QA] - verify - Port YP Plug-in to Kepler release1.5 M4Alexandru GeorgescuVERIFIEDenhancementMedium+
4689Alexandru Georgescu[QA] - verify - Avoid cache reload for incremental development using a backgrounded bitbake server1.5 M4Stoicescu CornelVERIFIEDenhancementMedium+
4695Alexandru Georgescu[QA] - verify - Upgrade gcc to 4.8 for 1.51.5 M4Mihai LindnerVERIFIEDenhancementMedium+
4717Alexandru Georgescu[QA] - verify - Bitbake event handlers recieve all events1.5 M4Stoicescu CornelVERIFIEDenhancementMedium+
4718Alexandru Georgescu[QA] - verify - Add gcc security flags1.5 M4Mihai LindnerVERIFIEDenhancementHigh
4837Holger Freytherbusybox syslog has two different configuration files depending on the init system1.5 M4Chen QiVERIFIEDenhancementMedium
4852David Anderssystem boot stops after installing efi memory1.5 M4Darren HartVERIFIEDmajorMedium+
4860Stefan Stanacarsyslog in systemd image ignores it's config file1.5 M4Chen QiVERIFIEDnormalMedium+
4876Calin Dragomirbuild directory needs to be cleaned if webhob fails to start1.5 M4Calin DragomirVERIFIEDnormalMedium+
4879Chen Qinss postinst cannot be configured offline1.5 M4Hongxu JiaRESOLVEDnormalMedium
4881Chen QiCannot move the mount of /media/xxx over to $ROOT_DIR/media/xxx in live image1.5 M4Chen QiRESOLVEDnormalMedium
4882Chen Qiudev has an implicit dependency on initscripts, which is not appropriate1.5 M4Chen QiRESOLVEDnormalMedium
4883Chen QiNo directory error for populate-volatile.sh at rootfs time1.5 M4Chen QiRESOLVEDnormalMedium
4884Chen QiX cannot start in qemu live images1.5 M4Chen QiVERIFIEDnormalMedium+
4885Chen Qilighttpd: /www directory should be writable in read-only rootfs1.5 M4Chen QiRESOLVEDnormalMedium
4887Chen Qiopenssh not working well with read-only rootfs1.5 M4Chen QiRESOLVEDnormalMedium
4889Hongxu Jiapython-native: remove unused and duplicated sitecustomize.py1.5 M4Hongxu JiaRESOLVEDnormalMedium
4896Yi Zhao[lsb image] pidof: invalid options on command line1.5 M4Hongxu JiaRESOLVEDnormalMedium
4911Laszlo PappWiki: Distribution Support outdated1.5 M4Scott RifenbarkRESOLVEDnormalMedium18 September 2013: RESOLVED
4927Laszlo PappMake Archlinux a supported or document the unwillingness of rolling-release1.5 M4Scott RifenbarkRESOLVEDnormalLow31 October 2013: RESOLVED
4937Chen QiError at rootfs time: "tar: .: file changed as we read it"1.5 M4Chen QiRESOLVEDnormalMedium
4939Chen QiCannot start qemu image in environment created by buildtools-tarball.1.5 M4Chen QiRESOLVEDnormalMedium
4962Chunrong Guorandom: segmentation fault1.5 M4Zhenhua LuoVERIFIEDnormalMedium+
4963Belen Barros PenaNot possible to launch Hob when Web Hob is running1.5 M4Alexandru DamianVERIFIEDnormalMedium+
4973Stefan Stanacarrunqemu: Could not initialize SDL(No available video device) for core-image-sato on Fedora 191.5 M4Kai KangVERIFIEDmajorHigh
4977Yi Zhao[Build Appliance] An error message when launch hob1.5 M4Cristian IorgaVERIFIEDnormalMedium+
4984Joerg Bogesftp conection close core-image-base1.5 M4Saul WoldRESOLVEDnormalMedium
4990Nitin Kamblegrub-efi-native_2.00.bb, do_compile is failing1.5 M4Saul WoldRESOLVEDnormalMedium
4991Yi ZhaoInvalid symbolic link kernel image in qemu rootfs1.5 M4Darren HartRESOLVEDnormalMedium
4992Paul EggletonMouse unusable on NUC1.5 M4Nitin KambleVERIFIEDnormalMedium+
4993Yang ShiKernel module package naming1.5 M4Mark HatleRESOLVEDnormalMedium
4997Chen Qigrub 0.97 doesn't work well1.5 M4Chen QiRESOLVEDnormalMedium
5009Stefan Stanacardpkg-native compile fails on F191.5 M4Kai KangVERIFIEDnormalUndecided
5015Alexandru Damianapi: create final definition of webhob APIs1.5 M4Alexandru DamianVERIFIEDenhancementHigh
5016Alexandru Damianapi: implement APIs corresponding to definition1.5 M4Alexandru DamianVERIFIEDenhancementHigh
5018Chen QiImprove the minimal installer in OE and fix bugs in it1.5 M4Chen QiRESOLVEDnormalUndecided
5022Andreea Brandusa Proca[webhob-poky/master]Wrong values for some bitbake variables.1.5 M4Alexandru DamianVERIFIEDminorMedium
5029Cristian Iorgalibasound-module-bluez should have a version for BlueZ 51.5 M4Cristian IorgaRESOLVEDnormalMedium
5030Cristian IorgaMultiple providers are available for runtime libasound-module-bluez (bluez4, bluez5) warning1.5 M4Cristian IorgaRESOLVEDnormalMedium
5058Jessicacan't kill webhob1.5 M4Alexandru DamianVERIFIEDnormalMedium+
5062Stefan Stanacarssh doesn't work in sato (dropbear) images1.5 M4Saul WoldVERIFIEDmajorHigh
5064Peter A. BigotCONFIG_CC_OPTIMIZE_FOR_SIZE overridden for arm targets1.5 M4Bruce AshfieldRESOLVEDnormalMedium
5096Ross Burtonxf86-video-intel fails when opengl isn't a DISTRO_FEATURE1.5 M4Ross BurtonRESOLVEDnormalMedium+
1115Xiaofeng YanLSB 4.1 error from wide character1.5 M3Hongxu JiaRESOLVEDnormalMedium
1487Bruce Ashfieldqemu: when booting from live CD, X cannot be started needs unionfs1.5 M3Chen QiRESOLVEDenhancementLow
2370Jiajun Xu[Build Appliance] no xdg-open for "View Files"1.5 M3Cristian IorgaVERIFIEDenhancementMedium
3017Stefan StanacarX fails to start in VirtualBox in 1.3 M3 build appliance1.5 M3Cristian IorgaVERIFIEDenhancementLow
3808Belen Barros PenaAdd an option to include the ADT tarball into your target image1.5 M3Cristiana VoicuVERIFIEDenhancementMedium
3916Ross Burtonrootfs_rpm doesn't support BAD_RECOMMENDATIONS1.5 M3Paul EggletonVERIFIEDenhancementMediumIMAGEGEN
4004Alexandru Georgescucannot write to usb using File Manager on Atom-pc1.5 M3Hongxu JiaVERIFIEDnormalMedium
4074Mark HatleDuring filesystem construction add a method to add/modify users and groups settings1.5 M3Chen QiVERIFIEDenhancementMedium
4096Kai KangLSB Library Check requres nss1.5 M3Hongna XuVERIFIEDenhancementMedium
4123Khem RajUpgrade gcc to 4.8 for 1.51.5 M3Khem RajVERIFIEDenhancementMedium+
4127Randy MacLeodAdd tcpdump version 4.3.0 or later1.5 M3Cristian IorgaVERIFIEDenhancementMedium
4305Paul EggletonSmart reports "no package provides" when a conflict occurs1.5 M3Paul EggletonVERIFIEDnormalMedium+
4352Robert Yangprune pn-depends.dot, packages-depends.dot and task-depends.dot1.5 M3Robert YangRESOLVEDenhancementLow
4363JessicaPort YP Plug-in to Kepler release1.5 M3JessicaVERIFIEDenhancementMedium+
4366Robert YangSeveral variables' assignments are hard to understand1.5 M3Chen QiVERIFIEDenhancementLow
4367Robert YangCleanup the assignments (=)1.5 M3Jesse ZhangVERIFIEDenhancementMedium
4377Robert Yang[Performance] The switch to turn off the generation of .sigdata file1.5 M3Robert YangVERIFIEDenhancementMedium
4379Robert Yang[Performance] The switch to turn off the generation of temp/run.* file1.5 M3Robert YangRESOLVEDnormalUndecided
4386Belen Barros PenaAdd image types to Hob1.5 M3valentinVERIFIEDnormalMedium
4455Ioana GrigoropolCreate new remote communication utilities plug-in supporting remote tools & bitbake commander plugins functionalities1.5 M3Ioana GrigoropolRESOLVEDnormalMedium
4511jojoerror for using oprofile.ko to profiling1.5 M3DaianeRESOLVEDnormalLow
4631Nitin Kambleupdate emgd recipe to 1.18 version1.5 M3Nitin KambleVERIFIEDenhancementMedium
4692Alexandru Georgescu[QA] - verify - Security Tools - consider fedora/gentoo runtime security tools1.5 M3Stoicescu CornelVERIFIEDenhancementHigh
4713Alexandru Georgescu[QA] - verify - Save and retrieve customised image recipes (was Templates)1.5 M3Andreea Brandusa ProcaVERIFIEDenhancementMedium+
4732Saul WoldWrong path to terminfo files in buildtools-tarball causes python version check to fail1.5 M3Hongxu JiaRESOLVEDnormalMedium+
4741Sebastian SchreiberNetfilter NAT not configured properly/different for Kernel 3.8.41.5 M3Nitin KambleRESOLVEDnormalMedium
4756Holger FreytherKernel upgrade on x86 is difficult/impossible1.5 M3Darren HartRESOLVEDnormalMedium
4789Jonathan Liucan't build gcc recipe - /usr/lib/libstdc++.so: could not read symbols: File in wrong format1.5 M3Jonathan LiuVERIFIEDnormalMedium+
4798Yi Zhaobitbake -g can't detect certain nonexistent package1.5 M3Robert YangVERIFIEDnormalMedium
4806Alexandru Georgescu[QA] - verify knotty must be able to run as a remote client1.5 M3Andreea Brandusa ProcaVERIFIEDenhancementMedium+
4809Alexandru Georgescu[QA] - verify make bitbake support multiple clients model1.5 M3Andreea Brandusa ProcaVERIFIEDenhancementMedium+
4813Alexandru Georgescucannot compile autotools project using i586 toolchain1.5 M3JessicaVERIFIEDnormalLow
4814Stoicescu Cornelrpm is broken on 1.5 M2 RC1 lsb images1.5 M3Chen QiVERIFIEDnormalMedium+
4815Stoicescu Cornelreboot/shutdown compromises installation for lsb-sdk images1.5 M3Chen QiVERIFIEDnormalMedium+
4816Ning Zhangbeagleboard could not startup with 20130703-3 image1.5 M3Bruce AshfieldVERIFIEDmajorHigh
4829Yi Zhao[Test Case 340] Build core-image-minimal with build-appliance-image1.5 M3Cristian IorgaVERIFIEDnormalMedium+
4835Wenzong.Fanxterm-256color causes python version check to fail1.5 M3Hongxu JiaRESOLVEDnormalMedium+
4847Cristian IorgaBuild Appliance is unable to restart in vmWare Player1.5 M3Cristian IorgaVERIFIEDnormalMedium+
4853Nick GCan't install prebuilt SDK1.5 M3Stefan StanacarRESOLVEDcriticalMedium+
4857Frank Fighting71[Hob] After setting SSTATE_MIRRORS, Settings button at image configuration not available1.5 M3Cristiana VoicuVERIFIEDcriticalHigh
4859Cristian IorgaBuild Appliance does not boot in vmWare Player1.5 M3Jonathan LiuVERIFIEDmajorHigh
4861Belen Barros Penacore-image-weston should not be in the base image combo box when poky-tiny is selected1.5 M3Cristiana VoicuVERIFIEDnormalMedium
4873Calin Dragomirwebhob cannot find bitbake.lock on start1.5 M3Alexandru DamianVERIFIEDmajorHigh
4875Calin Dragomirwebhob needs Django 1.4 to run1.5 M3Alexandru DamianVERIFIEDmajorMedium+
4886Chen Qi/etc/rc5.d/S20irattach: /etc/sysconfig/irda: Read-only file system1.5 M3Chen QiRESOLVEDnormalMedium
4894Jessicastop webhob issues1.5 M3Alexandru DamianVERIFIEDmajorHigh
4903Laszlo PappNo proper error message for layer version mismatch1.5 M3Ross BurtonRESOLVEDnormalMedium
4904Ning ZhangAutobuilder built beagleboard 20130724-2 image failed1.5 M3Stefan StanacarRESOLVEDnormalMedium
4917Cristian IorgaX server crashes under Build Appliance while switching between pcmanfm and terminals applications1.5 M3Ross BurtonRESOLVEDnormalMedium+
4918Nitin Kambled-bus daemon fails to start1.5 M3Ross BurtonRESOLVEDcriticalHigh
4926Hongxu Jiasu conflicts between attempted installs of util-linux and shadow1.5 M3Hongxu JiaVERIFIEDnormalMedium
4946Diego[Regression] X crash on Yocto with i.MX6Q BSP 3.5.7-1.0.0 softfloat1.5 M3Otavio SalvadorRESOLVEDnormalMedium
4955Ioana Grigoropol[adt_installer] Allow relative paths for specifying sysroot location1.5 M3Laurentiu PalcuRESOLVEDnormalMedium
4970Nitin KambleERROR: Function failed: Fetcher failure for URL: 'file://parallel-make-archives.patch'. Unable to fetch URL from any source.1.5 M3Darren HartVERIFIEDcriticalHigh
349Qing He[QT] fotowall warns iconv failure in QIconvCodec1.5 M2Jonathan LiuRESOLVEDminorLow
1584Richard PurdieSecurity Tools - consider fedora/gentoo runtime security tools1.5 M2Andrei DinuVERIFIEDenhancementHigh
1633Song LiuAMT driver integration1.5 M2Nitin KambleRESOLVEDenhancementMedium
2064Dexuan Cui[BSP] mount shows "/dev/sda4 on /media/sda4" but /media/sda4 doesn't exist1.5 M2Hongxu JiaRESOLVEDminorLow
3190Richard PurdieRefactor packaging sanity tests from package.bbclass to insane.bbclass1.5 M2Robert YangVERIFIEDenhancementMedium+
3329Andreea Brandusa ProcaCan not close hob from command line if an additional window is opened ("Settings" or "Advanced Configuration")1.5 M2valentinVERIFIEDnormalMedium
3705Maksym ZhelieznyiExisting filesystems aren't cleanly unmounted after booting from USB-drive1.5 M2Hongxu JiaRESOLVEDmajorLow
3908Stefan StanacarKernel panic on qemux86-64 when using runqemu kvm and cpu host1.5 M2Richard PurdieVERIFIEDnormalMedium+release note for 1.4
3988Jessicamake bitbake support multiple clients model1.5 M2Alexandru DamianVERIFIEDenhancementMedium+
4167Nitin KambleIncorporate Intel Graphics Stack Release 2013q11.5 M2Laurentiu PalcuVERIFIEDenhancementMedium
4193Belen Barros PenaSave and retrieve customised image recipes (was Templates)1.5 M2Cristiana VoicuVERIFIEDenhancementMedium+
4207Saul WoldSwitch to using busybox instead of tinylogin1.5 M2Chen QiVERIFIEDenhancementMedium+
4237Alexandru Georgescu[crownbay] offline mode does not work using connman-properties1.5 M2Cristian IorgaVERIFIEDnormalMedium
4303Ioana GrigoropolImprove bitbake commander plugin for supporting remote projects for system development1.5 M2Ioana GrigoropolVERIFIEDenhancementMedium+
4348Robert YangThe DESCRIPTION doesn't support "\n"1.5 M2Robert YangVERIFIEDenhancementLow
4371Robert Yang[Performance] sstate.bbclass: avoid mirror some files from the sstate cache1.5 M2Robert YangVERIFIEDenhancementLow
4385Stoicescu Cornelbitbake remake-native fails at do_configure1.5 M2PetterVERIFIEDnormalMedium
4388Belen Barros PenaAfter building an image, Hob reports the estimated image size in the "Edit Packages" screen1.5 M2Cristiana VoicuVERIFIEDnormalMedium
4392Robert Yang[Performance] sstate.bbclass: turn off some cache files' generation1.5 M2Robert YangVERIFIEDenhancementMedium
4396Robert YangSome bb.error should be bb.warn1.5 M2Robert YangVERIFIEDnormalMedium
4406Xufeng ZhangYocto-linux-rt: BUG() warning is triggered in rt kernel when run 'perf top' command on ARM/PowerPC1.5 M2Xufeng ZhangRESOLVEDnormalMedium
4415Ross BurtonIntegrate GStreamer 1.01.5 M2Cristian IorgaVERIFIEDenhancementMedium
4418Ross BurtonWayland support in toolkits1.5 M2Ross BurtonRESOLVEDenhancementMedium
4438Jonathan LiuUpdate syslinux to 4.06 (or 5.01)1.5 M2Jonathan LiuRESOLVEDnormalMedium
4462Stefan StanacarAdd support to qemuimagetest to boot and test more IMAGE_FSTYPES1.5 M2Stefan StanacarVERIFIEDenhancementMedium
4463Stefan StanacarAdd multilib builds to AB with opkg package manager1.5 M2Stefan StanacarVERIFIEDenhancementMedium
4465Alexandru DamianHOB cannot run on a remote machine1.5 M2Alexandru DamianVERIFIEDenhancementMedium+
4466Alexandru Damianknotty must be able to run as a remote client1.5 M2Alexandru DamianVERIFIEDenhancementMedium+
4488Denys DmytriyenkoSDK installer doesn't handle spaces in path1.5 M2Laurentiu PalcuRESOLVEDnormalMedium
4491Robert Yangimprove the definition of bb.fatal()1.5 M2Robert YangVERIFIEDenhancementMedium
4549Ke Zouqemuarm could not startup with 20130521-1 image (gcc 4.8)1.5 M2Bruce AshfieldVERIFIEDmajorMedium+
4550Yi ZhaoADT: iptables autoreconf run fails on CentOS1.5 M2Hongxu JiaRESOLVEDnormalMedium
4556JessicaFix issue for changed RSA key1.5 M2Ioana GrigoropolRESOLVEDnormalMedium+
4558Ning Zhangscript "yocto-kernel config add" could add one component more than one times1.5 M2Ning ZhangRESOLVEDnormalLow
4566Ke Zourouterstation pro cannot bootup with NFS in yocto 1.5 20130521-1 build1.5 M2Simarpreet SinghRESOLVEDnormalMedium+
4571Andreea Brandusa ProcaRedirection fails when stop parsing recipes.1.5 M2Cristiana VoicuVERIFIEDnormalMedium+
4586Paul BeamAppliance doesn't build. Missing ssp_nonshared1.5 M2Saul WoldVERIFIEDnormalMedium+
4592Nobuhiro IwamatsuPlease update ltsi branch1.5 M2Bruce AshfieldRESOLVEDnormalMedium
4595Yi ZhaoInvalid symbolic link file modules-arch.tgz in tmp/deploy/images directory1.5 M2Yi ZhaoRESOLVEDnormalMedium
4615Cristian Iorgameta-intel BSPs all fail with lsb: emgd-driver no package provider build crash (including meta-minnow)1.5 M2Nitin KambleRESOLVEDnormalMedium+
4617Hongxu Jiaddimage: incompatibility with dash1.5 M2Hongxu JiaRESOLVEDnormalMedium
4618Yi Zhao[Autobuilder] Some toolchains are built twice with 20130604-5 build1.5 M2Beth FlanaganVERIFIEDnormalMedium
4626Saurav Kumar GuptaCreaterepo is not working1.5 M2Saul WoldRESOLVEDnormalMedium
4632Alex Olsonudev 182 init script should mount devtmpfs instead tmpfs1.5 M2Saul WoldRESOLVEDmajorMedium
4643Alexandru Georgescu[QA] - Verify - make hardlinks for files in DEPLOY_DIR when possible1.5 M2Mihai LindnerVERIFIEDenhancementMedium+
4644Alexandru Georgescu[QA] - verify - Add warning if ${PN} is in OVERRIDES1.5 M2Mihai LindnerVERIFIEDenhancementMedium+
4647Alexandru Georgescu[QA] - verify - Refactor packaging sanity tests from package.bbclass to insane.bbclass1.5 M2Mihai LindnerVERIFIEDenhancementMedium+
4648Alexandru Georgescu[QA] - verify - Improve hob client communication with bitbake backend via xmlrpc1.5 M2Andreea Brandusa ProcaVERIFIEDenhancementMedium+
4649Alexandru Georgescu[QA] - Verify - make hardlinks for files in DEPLOY_DIR when possible1.5 M2Andreea Brandusa ProcaVERIFIEDenhancementMedium+
4651Alexandru Georgescu[QA] - verify - Package perl-tests should be converted to perl-ptest1.5 M2Mihai LindnerVERIFIEDenhancementMedium+
4656Alexandru Georgescu[QA] - verify - "Brought in by" sorting should take into account the (+#) information1.5 M2Andreea Brandusa ProcaVERIFIEDenhancementMedium+
4657Alexandru Georgescu[QA] - verify - Clicking the "cancel" button should reset the table sorting to the defaults1.5 M2Andreea Brandusa ProcaVERIFIEDenhancementMedium+
4663Alexandru Georgescu[QA] - verify - Switch to using busybox instead of tinylogin1.5 M2Mihai LindnerVERIFIEDenhancementMedium+
4677Alexandru Georgescu[QA] - verify - Improve bitbake commander plugin for supporting remote projects for system development1.5 M2Alexandru GeorgescuVERIFIEDenhancementMedium+
4736Jack Mitchellpopulate_sdk compile failures; when run after target build1.5 M2Laurentiu PalcuRESOLVEDnormalMedium+
4737Stefan StanacarX server fails to start on qemux86-641.5 M2Laurentiu PalcuVERIFIEDnormalMedium+
4738Chen Qiudev-cache doesn't work well on OE/Yocto based systems1.5 M2Chen QiRESOLVEDnormalMedium
4745Hongxu Jiaautomount failed occasionally at system coldplug time1.5 M2Hongxu JiaRESOLVEDnormalMedium
4746Hongxu Jiainvoke "/etc/init.d/systemd-udevd restart" failed1.5 M2Hongxu JiaRESOLVEDnormalUndecided
4749Hongxu Jiawget:do_configure failed1.5 M2Hongxu JiaRESOLVEDnormalUndecided
4752Paul EggletonSome QA errors no longer enabled1.5 M2Paul EggletonVERIFIEDmajorHigh
4753Richard PurdieNeed to document usage of buildtools-tarball1.5 M2Scott RifenbarkVERIFIEDenhancementHigh19 July 2013 - RESOLVED
4758Hongxu Jiaadt_installer: perl lib version doesn't match perl script on Ubuntu-13.041.5 M2Hongxu JiaRESOLVEDnormalMedium
4759Scott RifenbarkWarnings generated during build1.5 M2Saul WoldVERIFIEDnormalMedium
4760Hongxu Jiaadt-installer: installation failed when permission deny on the installation directory1.5 M2Hongxu JiaRESOLVEDnormalMedium
4761Chen Qireplace unionfs with aufs in live image1.5 M2Chen QiRESOLVEDenhancementMedium
4770Ross BurtonEnable USB touchscreens1.5 M2Tom ZanussiVERIFIEDenhancementMedium
4773Cristiana Voicupatch for ghostscript does not apply1.5 M2Paul EggletonRESOLVEDnormalMedium
4774Chen Qi/media diretory cleanup1.5 M2Chen QiRESOLVEDnormalLow
4775Cristiana Voicuqt4-embedded failed to compile with build on autobuilder1.5 M2Hongxu JiaVERIFIEDnormalMedium+
4784Chen QiAllow user to choose boot action in live images1.5 M2Chen QiRESOLVEDnormalLow
4786Alexandru GeorgescuYocto Project Tools menu does not show1.5 M2valentinVERIFIEDmajorMedium+
4787Robert Yangbitbake -e: Failure expanding variable SRCPV1.5 M2Robert YangRESOLVEDnormalUndecided
4802Chen QiBusybox on target upgrade fails if upgrading from 'one-binary' version to 'two-binary' version1.5 M2Chen QiRESOLVEDnormalUndecided
4807Alexandru Georgescu[QA] - Verify HOB cannot run on a remote machine1.5 M2Andreea Brandusa ProcaVERIFIEDenhancementMedium+
4811Alexandru Georgescucross toolchain not compatible with sh in ubuntu 13.041.5 M2Laurentiu PalcuVERIFIEDmajorMedium+
4830Alexandru Georgescucannot use powertop within eclipse1.5 M2JessicaVERIFIEDnormalMedium
4831Alexandru Georgescuerror when running systemtap within eclipse1.5 M2Ioana GrigoropolVERIFIEDnormalMedium
4850John WeberError building libglu1.5 M2Otavio SalvadorRESOLVEDnormalMedium+
2786Yi Zhao[LTP]/opt/ltp/Version file doesn't show the correct version of ltp1.5 M1Cristian IorgaRESOLVEDnormalMedium
3404Marc Ferlandudev mount.sh writes to /tmp before it is symlinked to /var/tmp1.5 M1Chen QiRESOLVEDnormalMediumBlocked, need some further discussion
3423Darren HartDefine KFEATURE_COMPATIBILITY1.5 M1Bruce AshfieldRESOLVEDnormalMedium
3575JessicaImprove hob client communication with bitbake backend via xmlrpc1.5 M1Alexandru DamianVERIFIEDenhancementMedium+
4016Kai KangLSB 4.1 Library Check: symbols are not found in libqt-mt.so.31.5 M1Hongxu JiaRESOLVEDnormalMedium
4045Stoicescu Cornelsstate-cache-management.sh test case needs update1.5 M1Stoicescu CornelVERIFIEDnormalMedium
4111Belen Barros PenaSearch results in recipes and packages tables should be sorted alphabetically1.5 M1Cristiana VoicuVERIFIEDnormalMedium
4178Randy MacLeodAdd FUSE: File system in Userspace1.5 M1Hongxu JiaRESOLVEDenhancementLow
4262Paul EggletonRework implementation of postinst logging1.5 M1Chen QiVERIFIEDenhancementMedium
4276Belen Barros PenaDistinguish between executed, existing, sstate and covered tasks1.5 M1Alexandru DamianVERIFIEDenhancementMedium+
4288Paul EggletonAdd warning if ${PN} is in OVERRIDES1.5 M1Paul EggletonVERIFIEDenhancementMedium+
4292Björn StenbergPackage perl-tests should be converted to perl-ptest1.5 M1Jesse ZhangVERIFIEDenhancementMedium+
4316Alexandru Damianwebhob skeleton code1.5 M1Alexandru DamianVERIFIEDenhancementMedium+
4317Alexandru Damiancreate webhob system launcher1.5 M1Alexandru DamianVERIFIEDenhancementMedium+
4319Alexandru Damiancreate bitbake event logger1.5 M1Alexandru DamianVERIFIEDenhancementMedium+
4320Alexandru Damiancreate users / project / builds data models1.5 M1Alexandru DamianVERIFIEDenhancementMedium+
4332Belen Barros Pena"Brought in by" sorting should take into account the (+#) information1.5 M1Cristiana VoicuVERIFIEDenhancementMedium+
4333Belen Barros PenaClicking the "cancel" button should reset the table sorting to the defaults1.5 M1Cristiana VoicuVERIFIEDenhancementMedium+
4341Laurentiu Palcuudev-hwdb postinstall does not run on host1.5 M1Laurentiu PalcuRESOLVEDenhancementMediumRelease Note 1.4
4342Belen Barros PenaApply a fade out animation when selecting / deselecting from tables when sorted by the "Included" column1.5 M1Cristiana VoicuVERIFIEDenhancementMedium
4354Belen Barros PenaUpdate the "Additional free space" information1.5 M1Andrei DinuVERIFIEDminorMedium
4355Belen Barros PenaUpdate the "Image basic size" information1.5 M1Andrei DinuVERIFIEDminorMedium
4372Robert Yang[Performance] make hardlinks for files in DEPLOY_DIR when possible1.5 M1Robert YangVERIFIEDenhancementMedium+
4375Stoicescu Cornel[sugarbay] Unable to play .mpg files1.5 M1Nitin KambleVERIFIEDnormalMedium
4391Robert YangRemove the obsolote images1.5 M1Robert YangVERIFIEDenhancementMedium
4398Robert Yang"all succeeded" does not look like a reason to fail a build1.5 M1Robert YangRESOLVEDnormalUndecided
4407Paul EggletonCheck if /dev/shm exists to avoid cryptic error1.5 M1Paul EggletonVERIFIEDenhancementMedium
4416Ross BurtonBring touchscreen calibration back using xinput-calibrator1.5 M1Laurentiu PalcuVERIFIEDenhancementMedium
4419Martin Donnellycracklib : default dictionary should be generated for target endianness1.5 M1Hongxu JiaVERIFIEDnormalMedium
4424Robert Yangglib-2.0-native: do_compile failed on opensuse 12.2 64bit1.5 M1Jesse ZhangRESOLVEDnormalMedium
4426Robert Yangghostscript: do_fetch failed due to checksums mismatch1.5 M1Robert YangRESOLVEDnormalMedium
4427Robert Yangpython-native: the assert doesn't work1.5 M1Robert YangVERIFIEDnormalMedium
4428Alexandru GeorgescuCreate a wiki page populated dynamically with the TC's from Testopia1.5 M1Stoicescu CornelVERIFIEDenhancementMedium
4440Tom Zanussiupdate kernel labs1.5 M1Tom ZanussiRESOLVEDnormalMedium
4453Belen Barros PenaTable sorting criteria should not change after deselecting recipes / packages1.5 M1Cristiana VoicuVERIFIEDminorMedium
4454Ioana GrigoropolRefactor remote tools plug-in to prepare using common remote communication plug-in1.5 M1Ioana GrigoropolRESOLVEDnormalMedium
4458Mark Hatleglobal methodpool checks don't work with multithreaded parsing1.5 M1Richard PurdieRESOLVEDnormalMedium
4459Mark Hatlemethodpool does not account for two identically named files (different paths) that provide the different methods1.5 M1Richard PurdieRESOLVEDnormalMedium
4460Mark HatleWhen an error about already declared functions occurs, the build does not stop1.5 M1Richard PurdieRESOLVEDnormalMedium
4461Robert Yangbb.fatal() clean up1.5 M1Robert YangVERIFIEDnormalMedium
4464Stefan StanacarAdd systemd enabled images to Autobuilder nightly target1.5 M1Stefan StanacarVERIFIEDenhancementUndecided
4489Robert Yangcachedpath.py: global name 'error' is not defined1.5 M1Robert YangVERIFIEDnormalUndecided
4502Cristian Iorgapython-pygobject-native fails during build1.5 M1Cristian IorgaVERIFIEDnormalUndecided
4559Alexandru GeorgescuCreate Yocto 1.5 Testing Plan1.5 M1Alexandru GeorgescuVERIFIEDenhancementHigh
4581Bogdan Marinescu[Autobuilder] build failures because of unrecognized '--buildroot' option1.5 M1Ross BurtonVERIFIEDnormalMedium+(autobuilder)
917Darren Hartmediatomb fails to start, can't find libjs.so1.5Ross BurtonRESOLVEDnormalLowDemo layer, needs owner (30-Jun-2011)
1474Mark HatleQEMU won't run on a system that does not support tunctl1.5Andrei DinuRESOLVEDenhancementLow
1612Song LiuBuild statistics reporting1.5Beth FlanaganRESOLVEDenhancementLow
1706Frans Meulenbroeksdisabling package management is not described1.5Scott RifenbarkRESOLVEDnormalMedium8 May 2013
1763Damien Lespiau[USE CASE] More universally bootable live images1.5Darren HartRESOLVEDenhancementMedium(Waiting on EFI/SYSLINUX/HYBRID Patches)
1778Beth FlanaganLicense wrangling, stage 31.5Beth FlanaganRESOLVEDenhancementMedium(1.3)
1881Joshua Lock - Disabled[DEB] Fix Debian package feeds1.5Saul WoldRESOLVEDnormalMedium
1913Dexuan Cuineed to abstract building msdos images into an msdosfs.bbclass to share the code1.5Darren HartRESOLVEDminorLow
1914Liming Wangmodify the tune files of ppc targets1.5Khem RajRESOLVEDnormalLow
2275Bill MillsLicense compliance: failure to detect new license files1.5Beth FlanaganRESOLVEDenhancementLow
2318Jim AWeb is really quite bad1.5Ross BurtonRESOLVEDnormalMedium21 March 2014: Reset documentation flag to "No"
2342Reinette ChatreToolchain archive contains DISTRO_VERSION instead of SDK_VERSION1.5JessicaVERIFIEDenhancementMedium
2524Vladimir Redzhepoffbuilding meta-toolchain for armv7ahf failed1.5Khem RajRESOLVEDnormalMedium
2808Dave StewartAdd an illustration showing "source" and "destination" directories1.5Scott RifenbarkVERIFIEDnormalMedium27 September 2013: RESOLVED
2855Yi Zhao[mpc8315e-rdb] udevadm settle - timeout of 180 seconds reached1.5Bruce AshfieldRESOLVEDnormalMedium
2890Laurentiu Serbanrunqemu: starting an image of a BSP created with yocto-bsp tool fails1.5Mihai PricaVERIFIEDnormalMedium
2894Khem Rajrpm mishandling pkg_postinst1.5Mark HatleRESOLVEDnormalMedium
3197Belen Barros PenaChanges to the 'Image types' tab in the 'Advanced configuration' dialog1.5valentinRESOLVEDnormalMedium+
3222EvadeflowAdd command to create a mirror without building anything1.5Richard PurdieVERIFIEDenhancementMedium
3271EvadeflowBetter error message when bitbake is run from the 'wrong' directory1.5Richard PurdieVERIFIEDenhancementLow
3285EvadeflowBB_FETCH_PREMIRROR_ONLY failure message is confusing1.5Richard PurdieVERIFIEDenhancementLow
3291Belen Barros PenaAll recipes should have a 'appropriate' SUMMARY1.5Saul WoldVERIFIEDenhancementMedium
3294Alexandru Palalau[FRI2] Keyboard not detected1.5Darren HartVERIFIEDnormalLow
3308Paul EggletonValidate IMAGE_FEATURES values1.5Paul EggletonVERIFIEDenhancementMedium
3361Mark HatleBug reporting tool1.5Mihai LindnerVERIFIEDenhancementLow
3393Stefan StanacarBuild fails when using Sourcery CodeBench Lite for ARM toolchain with multiple providers errors1.5Christopher LarsonRESOLVEDnormalMedium
3413Tom Zanussi[Performance] Use the profiling and tracing tools to see where build performance might be improved1.5Tom ZanussiRESOLVEDenhancementMediumInvestigating
3449Christopher Larsonarchiver doesn't interact well with sstate1.5Christopher LarsonRESOLVEDnormalMedium
3559Reinette ChatreAdd documentation for SDK content changes1.5JessicaVERIFIEDenhancementMedium
3566Nitin Kamblelibowl-av should construct video pipelines properly1.5Ross BurtonVERIFIEDnormalMedium
3723Mark Hatlesmart: Performance enhancement for attemptonly and complementary installs1.5Mark HatleRESOLVEDenhancementMedium
3746Stefan Stanacaryocto-kernel tool fails to find layer when using BBLAYERS += in bblayers.conf1.5Tom ZanussiVERIFIEDnormalMedium
3781Tareki.MX6Q: mfw_isink Problem1.5Otavio SalvadorRESOLVEDmajorMedium
3805Yi ZhaoPAM support: missing pam_systemd.so1.5Ross BurtonVERIFIEDnormalMedium
3823Saul Woldgit-native depends on gettext1.5Saul WoldRESOLVEDnormalMedium
3849John "Warthog9" HawleyHob intermediate state not saved when errors occur - Step 2 package building1.5Cristian IorgaVERIFIEDnormalMedium
3947Jack MitchellGCC + eglibc + Texinfo5.0+1.5Khem RajRESOLVEDnormalMedium+
3969Ross BurtonAdd QA warning for shipping /usr/share/info/dir1.5Mihai PricaRESOLVEDnormalMedium
3979SMultiple test plans should be added into a single Test Run.1.5Laurentiu SerbanVERIFIEDenhancementMedium
3982Beth FlanaganAutobuilder Conf version flag1.5Beth FlanaganVERIFIEDenhancementMedium+
4043Viorel Mirea[Usablility] YoctoProjectTools from the eclipse menu should have a keyboard shortcut1.5JessicaVERIFIEDenhancementMedium
4061Saul Woldmatchbox-panel assertion failure1.5Ross BurtonRESOLVEDnormalMedium
4062Saul Woldmatchbox-desktop - Icon warnings during startup1.5Ross BurtonRESOLVEDnormalMedium
4107Yi ZhaoPAM unit test failed: segmentation fault for tst-pam_pwhistory11.5Kai KangVERIFIEDnormalLow
4108Ning Zhangbeagleboard-sato-sdk, video player could not show menu button clearly1.5Ross BurtonRESOLVEDnormalMedium
4118SAttachment option with a Test case in the Test Run should be added.1.5Stoicescu CornelVERIFIEDenhancementLow
4122MarkAdd cryptsetup-luks support1.5Jesse ZhangVERIFIEDenhancementMedium
4141Jason WesselRemove the double exec of bitbake via the bitbake startup shell script1.5Richard PurdieVERIFIEDenhancementMedium+
4149Ning Zhangstart x11vnc on beagleboard, use a host access vncviewer, the keyboard "Caps Lock" could not work1.5Laurentiu PalcuRESOLVEDnormalLow
4154Otavio Salvadorbuildhistory: Log passwd and group files for easy change monitoring1.5Paul EggletonVERIFIEDenhancementMedium
4180Stoicescu Cornelusb devices unpower when inactive1.5Nitin KambleVERIFIEDnormalLow
4184Mark MortonRemoving packages from a build1.5Mark HatleVERIFIEDenhancementHigh
4185Otavio Salvador/unit_tests/akiyo.mp4 is missing1.5DaianeRESOLVEDnormalLow
4208Dave StewartRun Bastille Linux or equivalent on target image1.5Saul WoldVERIFIEDenhancementHigh
4212Dave StewartToolchain armoring1.5Bogdan MarinescuVERIFIEDenhancementHigh
4225Carlos Rafael GianiBuild configuration printed by BitBake does not show correct set of features1.5Richard PurdieVERIFIEDnormalMedium
4228Paul EggletonAllow complementary globs to be extended1.5Paul EggletonVERIFIEDenhancementMedium
4232Ross Burtonopkg doesn't invoke prerm when upgrading1.5Ross BurtonRESOLVEDnormalMedium
4234Wenzong.Fanxcursor-transparent-theme should provide index.theme itself1.5Wenzong.FanVERIFIEDenhancementMedium
4238Alexandru Damianadd klibc recipes support for initramfs components1.5Saul WoldVERIFIEDenhancementMedium
4239Ross Burtonpulseaudio changes directory in do_compile1.5Ross BurtonRESOLVEDnormalMedium
4247Chao Pengdo_rm_work complains that 'pseudo' can not be removed.1.5Richard PurdieVERIFIEDminorLow
4248Jack MitchellHost gcc 4.8 issues (gcc-cross-initial do_compile failure)1.5Bogdan MarinescuRESOLVEDnormalMedium+Release note for 1.4
4252Paul EggletonWiki editing help page seems broken1.5Michael HalsteadRESOLVEDnormalMedium
4270Adrian Dudaustreaming stap scripts freeze Eclipse when ran from the System Tap plugin1.5Ioana GrigoropolVERIFIEDnormalMedium
4271Paul EggletonTest/enable detection of other host distros1.5Paul EggletonVERIFIEDenhancementMedium
4286Mark Hatlerecipes that provide kernel modules need to provide packages that begin with 'kernel-module-'1.5Yang ShiRESOLVEDnormalMedium
4309Paul EggletonUnpackaged file warnings for systemd units when systemd disabled1.5Radu MoisanRESOLVEDminorMedium
4312Alexandru Damiansystemd system freezes on shutdown1.5Radu MoisanRESOLVEDnormalMedium
4313Stoicescu Cornelbuildhistory-diff should give coherent message with bad arguments1.5Paul EggletonVERIFIEDnormalMedium
4325Stefan StanacarChanging DISTRO_FEATURES (remove systemd) causes No keyboard in X when building sysvinit1.5Saul WoldVERIFIEDnormalMedium+Release note for 1.4
4335Ross BurtonDefault FILES_PN shouldn't hard-code udev path1.5Ross BurtonRESOLVEDenhancementMedium
4338Martin Jansabitbake hangs forever before showing any output1.5Richard PurdieRESOLVEDnormalMedium
4340Laurentiu Palcuqemumips: colors in sato image do not look right1.5Laurentiu PalcuRESOLVEDnormalMedium
4343Pbbitbake makes empty promise of "further information" for failed tasks1.5Richard PurdieVERIFIEDminorLow
4345Paul EggletonShutdown icon doesn't work with rootless X1.5Laurentiu PalcuRESOLVEDnormalMedium
4357Stoicescu Cornelrpc.nfsd error in lsb-sdk images1.5Saul WoldVERIFIEDnormalMedium+dylan
4373Stefan Stanacarsystemd do_compile fails with make 3.821.5Ross BurtonVERIFIEDnormalLowRelease Note 1.4
4374John ToomeySERIAL_CONSOLES creates entries in inittab which do not have a unique ID1.5Paul EggletonRESOLVEDnormalMedium
4395Alexandru Palalau[FRI2] ssh keys cannot be loaded1.5Saul WoldVERIFIEDnormalMedium
4409Alexandru Georgescuqemu password is asked in the console when using systemtap plugin1.5Scott RifenbarkRESOLVEDnormalLow14 October 2013: Changed doc requirement to "done"
4410Hongxu Jiasystemd: do_compile failed in parallel builds with system's make 3.281.5Hongxu JiaRESOLVEDnormalMedium
4412Chunrong Guocore-image-lsb-sdk build for powerpc 64bit boards is failing1.5Chunrong GuoRESOLVEDnormalMedium
4413JessicaExtend Yocto ADT Project Template to support CMake type projects1.5Atanas Gegov OssRESOLVEDenhancementMedium
4414Belen Barros PenaLaunching web hob from terminal1.5Alexandru DamianVERIFIEDenhancementMedium30 October 2013 - Updates to the 1.5.1 manual toaster section
4422tfPoky build thyself1.5Cristian IorgaRESOLVEDnormalMedium
4429Stoicescu Cornelchmod: cannot access '/var/run/bind/run': No such file or directory in lsb-sdk images1.5Chen QiVERIFIEDnormalMedium
4430Paul EggletonBring buildhistory-web up-to-date1.5Paul EggletonRESOLVEDenhancementMedium
4435Paul EggletonRework qemuimagetest implementation1.5Stefan StanacarVERIFIEDenhancementMedium+
4439Diegodevshell fails to open a new tmux session1.5Christopher LarsonRESOLVEDnormalMedium
4447Laurentiu PalcuThe cache checksum for the base configuration does not change when the task data variable changes1.5Laurentiu PalcuRESOLVEDnormalMedium
4449Erik BotöGStreamer mp3 playback on Nitrogen6X - seg faults1.5DaianeRESOLVEDnormalMedium
4456Jukka RissanenConnMan recipe has not activated VPN support1.5Jukka RissanenRESOLVEDnormalMedium
4474Jerrod Peachbitbake fails to find patch files moved to a second valid location1.5Paul EggletonRESOLVEDminorMedium
4475Stoicescu Cornelquilt-native fails with "Function failed: patch_do_patch"1.5Richard PurdieVERIFIEDnormalMedium+
4476Stoicescu CornelExecution of event handler 'check_sanity_eventhandler' failed1.5Richard PurdieVERIFIEDnormalMedium+
4477Stoicescu Cornelbitbake -u depexp gives warnings1.5Ross BurtonVERIFIEDnormalMedium
4484Paul EggletonPostinstalls don't run for ipk if package-management is disabled1.5Laurentiu PalcuVERIFIEDmajorMedium+
4486Paul EggletonTraceback when inheriting useradd but not setting USERADD_PARAM or GROUPADD_PARAM1.5Ionut RaduRESOLVEDnormalMedium
4490Jonathan Liurun-postinsts fails on directdisk image1.5Jonathan LiuRESOLVEDnormalMedium
4495Martin Donnellyeglibc causes internal compiler error with GCC4.81.5Khem RajRESOLVEDnormalMedium
4500xiaoutil-linux symbol link libuuid.so should in libuuid's dev rpm1.5xiaoRESOLVEDnormalMedium
4503Andreea Brandusa ProcaFailed to build an non-GPLv3 image.1.5JessicaVERIFIEDnormalMedium
4504Stefan Stanacarbase-files shouldn't be installed in core-image-minimal-initramfs1.5Saul WoldVERIFIEDnormalMedium+
4505Felipe Ferreri Tonellobitbake parses wrong PATH environment variable1.5Richard PurdieRESOLVEDmajorMedium
4506Stefan Stanacarbitbake self-tests for fetcher fail on python 2.61.5Richard PurdieVERIFIEDnormalMedium
4509Gabriel BarbuCreating debug session fails when SDK is not installed in the default location1.5JessicaRESOLVEDnormalMedium
4512Gary Thomasrunqemu messes up terminal settings1.5Andrei DinuRESOLVEDnormalMedium
4513Gary Thomasbitbake-layers show-overlayed broken1.5Paul EggletonVERIFIEDnormalMedium
4519Tudor FloreaHob does not run start on Centos 6.41.5Scott RifenbarkVERIFIEDnormalMedium2 July 2013 - RESOLVED
4524Ross Burtonu-boot fails to compile1.5Zhenhua LuoRESOLVEDnormalMedium+(autobuilder)
4552Saurav Kumar GuptaNetwork is not coming up1.5Saul WoldVERIFIEDmajorMedium
4555Paul EggletonTest case for smart recommends support is not effective1.5Stoicescu CornelRESOLVEDnormalMedium+
4560Alexandru GeorgescuCreate a 1.5 QA history run wiki page1.5Alexandru GeorgescuVERIFIEDenhancementMedium
4561Ioana GrigoropolSystem tap script cannot be canceled1.5JessicaRESOLVEDnormalMedium
4562Hongxu Jiapython-scons-native: invoke scons failed on Fedora-17 while the destro didn't install scons1.5Hongxu JiaRESOLVEDnormalMedium
4567Xufeng Zhangntp display some abnormal behaviors1.5Xufeng ZhangRESOLVEDnormalMedium
  500      
Warnings were generated during the execution of function
  1. Report truncated - count greater than max allowed 501 > 500

1.4 Features that need to have TC's as soon as possible:

IDRequesterSummary (13 tasks) MilestoneAssigneeStatusSeverityPWhiteboard
3406Paul EggletonRead-only rootfs support1.4 M5Chen QiVERIFIEDenhancementMedium+Patch Review
3578JessicaAllow build appliance to share its filesystem with local host1.4 M5Ioana GrigoropolVERIFIEDenhancementMedium
2396Darren HartIntegrate LTSI into linux-yocto-dev1.4 M4Bruce AshfieldVERIFIEDenhancementHigh
3434Saul WoldEnsure that all postinstall scripts are able to run at install time1.4 M4Laurentiu PalcuVERIFIEDenhancementMedium+
3774Ross BurtonEnable systemd booting of core-image-sato1.4 M4Ross BurtonVERIFIEDenhancementMedium
3672JessicaAdopt crosstap script for systemtap1.4 M3Ioana GrigoropolVERIFIEDenhancementMedium+
1625Song LiuSupport use of alternative init systems1.4 M2Radu MoisanVERIFIEDenhancementHighin development
3071Martin Jansasstate-cache cannot be shared between builders with different cache/bb_persist_data.sqlite31.4 M2Constantin MuscaVERIFIEDenhancementHigh59a704679c825d01f417a303a49be7ef34134c4e, d0f35207f9e19b440393a79ebf621649c495738d, 8d6e55bf2192524bda84138b5356a2791adbbe61
3310Richard PurdieSwitch to a PR server model with no more PR bumps1.4 M2Richard PurdieVERIFIEDenhancementHigh
3407Paul EggletonCheck for postinsts in read-only rootfs (in deb/rpm)1.4 M2Paul EggletonVERIFIEDenhancementMedium+
2578Paul EggletonAllow dropbear no-password configuration at image assembly time1.4Paul EggletonVERIFIEDenhancementMedium+
3094Dave StewartAdd a layer generation tool1.4Tom ZanussiVERIFIEDenhancementLowv1 patchset re-submitted to poky list
3328Martin Jansasstate: show some progress when downloading lots of packages from SSTATE_MIRROR1.4Richard PurdieVERIFIEDenhancementMedium
  13      

1.5 Features that need to be verified

IDAssigneeESummary (22 tasks) PWhiteboardMilestoneStatusResolution
1474Andrei Dinu12QEMU won't run on a system that does not support tunctlLow1.5RESOLVEDFIXED
4413Atanas Gegov OssExtend Yocto ADT Project Template to support CMake type projectsMedium1.5RESOLVEDFIXED
1763Darren Hart10[USE CASE] More universally bootable live imagesMedium(Waiting on EFI/SYSLINUX/HYBRID Patches)1.5RESOLVEDFIXED
1612Beth Flanagan1Build statistics reportingLow1.5RESOLVEDOBSOLETE
1778Beth Flanagan2License wrangling, stage 3Medium(1.3)1.5RESOLVEDDUPLICATE
2275Beth Flanagan3License compliance: failure to detect new license filesLow1.5RESOLVEDDUPLICATE
3723Mark Hatle2smart: Performance enhancement for attemptonly and complementary installsMedium1.5RESOLVEDFIXED
4430Paul EggletonBring buildhistory-web up-to-dateMedium1.5RESOLVEDFIXED
4335Ross Burton2Default FILES_PN shouldn't hard-code udev pathMedium1.5RESOLVEDINVALID
5214Scott RifenbarkImprove PACKAGECONFIG explanationMedium07 October 2013: RESOLVED1.5RESOLVEDFIXED
3413Tom Zanussi[Performance] Use the profiling and tracing tools to see where build performance might be improvedMediumInvestigating1.5RESOLVEDFIXED
5271Tom ZanussiEMGD 1.18 kernel components need to be upgraded to the 3.10 kernelLow1.5RESOLVEDFIXED
4178Hongxu Jia14Add FUSE: File system in UserspaceLow1.5 M1RESOLVEDFIXED
4341Laurentiu Palcu3udev-hwdb postinstall does not run on hostMediumRelease Note 1.41.5 M1RESOLVEDFIXED
1633Nitin Kamble4AMT driver integrationMedium1.5 M2RESOLVEDFIXED
4761Chen Qireplace unionfs with aufs in live imageMedium1.5 M2RESOLVEDFIXED
4418Ross Burton5Wayland support in toolkitsMedium1.5 M2RESOLVEDFIXED
4352Robert Yang5prune pn-depends.dot, packages-depends.dot and task-depends.dotLow1.5 M3RESOLVEDFIXED
1487Chen Qiqemu: when booting from live CD, X cannot be started needs unionfsLow1.5 M3RESOLVEDFIXED
4079Mark HatleAbility to ignore a package (don't install a package)High10 Sept 2013: RESOLVED (with doc change)1.5 M4RESOLVEDFIXED
4103Chen QiStop using linux live and replace with read-only rootfsMedium1.5 M4RESOLVEDFIXED
3868Saul Wold20Add gcc security flagsHigh08 April 2014: Setting documentation flag to "Done."1.5 M4RESOLVEDFIXED
   22     

The following 1.4 features ware selected by QA to have test cases made for them:

IDRequesterSummary (33 tasks) MilestoneAssigneeStatusSeverityPWhiteboard
1659Mark Hatle[Usability] Way to determine what is about to happen (similar to a dry-run)1.4 M5Robert YangVERIFIEDenhancementMedium
2393Tom Zanussi[Usablility] Yocto BSP Tools: add support for kernel features1.4 M5Tom ZanussiVERIFIEDenhancementMedium
3406Paul EggletonRead-only rootfs support1.4 M5Chen QiVERIFIEDenhancementMedium+Patch Review
3578JessicaAllow build appliance to share its filesystem with local host1.4 M5Ioana GrigoropolVERIFIEDenhancementMedium
2396Darren HartIntegrate LTSI into linux-yocto-dev1.4 M4Bruce AshfieldVERIFIEDenhancementHigh
2934Trevor Woerner[HOB] Hob should save any customizations into the project's configuration1.4 M4Cristiana VoicuVERIFIEDenhancementMedium+
3387Robert Yangbitbake-layers: figure out the LAYERDEPENDS1.4 M4Robert YangVERIFIEDenhancementMedium
3434Saul WoldEnsure that all postinstall scripts are able to run at install time1.4 M4Laurentiu PalcuVERIFIEDenhancementMedium+
3774Ross BurtonEnable systemd booting of core-image-sato1.4 M4Ross BurtonVERIFIEDenhancementMedium
3824Robert Yangbitbake-layers: let show-cross-depends avoid long path1.4 M4Robert YangVERIFIEDenhancementMedium
2938Ross BurtonEnable Wayland support1.4 M3Alexandru DamianVERIFIEDenhancementHigh
3298Robert YangAdd a 'world native' target1.4 M3Hongxu JiaVERIFIEDenhancementLowDesign
3672JessicaAdopt crosstap script for systemtap1.4 M3Ioana GrigoropolVERIFIEDenhancementMedium+
1621Song Liu[Performance] Running post installs at rootfs gen time1.4 M2Laurentiu PalcuVERIFIEDenhancementHigh
1625Song LiuSupport use of alternative init systems1.4 M2Radu MoisanVERIFIEDenhancementHighin development
3071Martin Jansasstate-cache cannot be shared between builders with different cache/bb_persist_data.sqlite31.4 M2Constantin MuscaVERIFIEDenhancementHigh59a704679c825d01f417a303a49be7ef34134c4e, d0f35207f9e19b440393a79ebf621649c495738d, 8d6e55bf2192524bda84138b5356a2791adbbe61
3309Yi ZhaoAdd non-interactive option for toolchain installation1.4 M2Hongxu JiaVERIFIEDenhancementMedium
3310Richard PurdieSwitch to a PR server model with no more PR bumps1.4 M2Richard PurdieVERIFIEDenhancementHigh
3350Paul EggletonEnsure smart supports hinting for RRECOMMENDS1.4 M2Paul EggletonVERIFIEDenhancementMedium+Patches sent for review (4 Dec)
3407Paul EggletonCheck for postinsts in read-only rootfs (in deb/rpm)1.4 M2Paul EggletonVERIFIEDenhancementMedium+
3372Jessica[HOB] Add a new variable in bblayer.conf file to prevent certain layers to be removed1.4 M1Cristiana VoicuVERIFIEDenhancementMedium+merged
874Yongkang You[AutoBuilder/FEAT] Set Bug to Fixed automatically when building in AutoBuilder1.4Beth FlanaganRESOLVEDenhancementLow
1963Joshua Lock - DisabledConsider adopting systemd interfaces in Poky core OS distro configuration1.4Radu MoisanVERIFIEDenhancementMedium
2346Belen Barros Pena[HOB] Review and refine sorting mechanisms in Hob1.4Cristiana VoicuVERIFIEDnormalMedium
2569Dave Stewart[HOB] When you do a build, you see the config, not the progress1.4Cristiana VoicuVERIFIEDenhancementMediummerged
2578Paul EggletonAllow dropbear no-password configuration at image assembly time1.4Paul EggletonVERIFIEDenhancementMedium+
3094Dave StewartAdd a layer generation tool1.4Tom ZanussiVERIFIEDenhancementLowv1 patchset re-submitted to poky list
3270Belen Barros Pena[HOB] I should be able to reorder the layers in the Hob Layers dialog1.4Cristiana VoicuVERIFIEDenhancementMediummerged
3282Belen Barros Pena[HOB] During recipe parsing, progress bar text should provide details about the process state1.4Cristiana VoicuVERIFIEDenhancementMediummerged
3328Martin Jansasstate: show some progress when downloading lots of packages from SSTATE_MIRROR1.4Richard PurdieVERIFIEDenhancementMedium
3436Saul WoldInvestigate and reduce buildsystem disk footprint1.4Saul WoldVERIFIEDenhancementMedium
3438Saul Woldmultilib: verify full world build and fix issues1.4Constantin MuscaVERIFIEDenhancementMediume5a2702653db082203455e3739d7838863c859ba
3692Alexandru DamianFreeze after after selecting machine and base image1.4Bogdan MarinescuVERIFIEDenhancementLow
  33      


For the folowing 1.4 features QA will not make test cases:

IDRequesterSummary (99 tasks) MilestoneAssigneeStatusSeverityPWhiteboard
3223Ross BurtonSave postinst logs in debug-tweaks mode1.4 M6Kai KangVERIFIEDenhancementMedium(D6)
3467Saul WoldDocument kvm service model1.4 M6Mihai PricaVERIFIEDenhancementMedium+
1622Song Liu[DOC] Document multilib setup and usage1.4 M5Scott RifenbarkVERIFIEDenhancementMedium+1 March 2013: Resolved/Fixed
3352Paul EggletonImprove smart error/status reporting1.4 M5Bogdan MarinescuVERIFIEDenhancementMedium+
3374Paul EggletonMake image devshell environment more like do_rootfs1.4 M5Richard PurdieVERIFIEDenhancementMedium+
3379Paul EggletonAdd config fragment support to busybox1.4 M5Chen QiVERIFIEDenhancementLow
3517Bruce Ashfieldkernel: reduce packaging and build system overhead1.4 M5Bruce AshfieldVERIFIEDenhancementMedium
3569Belen Barros PenaUse a GtkTreeView to present and configure the sstate mirrors1.4 M5Cristiana VoicuVERIFIEDenhancementMedium
3886Laurentiu SerbanScript to automatically run the performance tests and consolidates the data1.4 M5Stefan StanacarVERIFIEDenhancementHigh
3931Nitin Kamblecreate linux-yocto-dev kernel recipes for meta-intel bsps1.4 M5Nitin KambleVERIFIEDenhancementMedium+
3964Phlip Balisterbuildhistory should support the populate_sdk task1.4 M5Paul EggletonVERIFIEDenhancementMedium
1628Song LiuAutobuilder layer support1.4 M4Beth FlanaganVERIFIEDenhancementMedium(No QA Needed)
2180Shane Wang[HOB] Eliminate the by recipe grouping in the packages table1.4 M4Cristiana VoicuVERIFIEDenhancementMedium
2686Bruce Ashfieldlinux-yocto/linux-yocto-custom: support low bandwidth options1.4 M4Bruce AshfieldVERIFIEDenhancementLowIn design (revival of old code). 1.4 M2
2935Trevor Woerner[HOB] Hob "Save As Template" is confusing1.4 M4Cristiana VoicuVERIFIEDenhancementMedium+
3006Saul Woldexternal-python-tarball: Rewrite to use correct package installation1.4 M4Kai KangVERIFIEDenhancementMedium
3007Song Liu[HOB] Improve bblayers-hob.conf1.4 M4Cristiana VoicuVERIFIEDenhancementMedium+
3179Alexandru DamianModification for udev to use /var/run must be removed.1.4 M4Chen QiVERIFIEDenhancementMedium
3181Alexandru Damianruntime directory /run not properly created1.4 M4Chen QiVERIFIEDenhancementMedium
3272Paul EggletonImplement web interface for indexing OpenEmbedded layers1.4 M4Paul EggletonVERIFIEDenhancementMedium
3274Song Liu[DOC] Documenting development best practices using the Yocto Project1.4 M4Scott RifenbarkVERIFIEDenhancementHigh14 Feb 2013
3391Martin Jansabuildhistory.bbclass should track more runtime variables1.4 M4Paul EggletonVERIFIEDenhancementMedium
3414Darren HartTask-based Linux kernel development and configuraiton documentation1.4 M4Darren HartVERIFIEDenhancementMedium+
3416Saul WoldUpdate autobuilder to latest version1.4 M4Beth FlanaganVERIFIEDenhancementMedium
3417Saul WoldRefactor / Re-Structure ABConfig and other autobuilder scripts1.4 M4Beth FlanaganVERIFIEDenhancementMedium
3430Saul WoldDeprecate the demo layer - save any good bits to appropriate layers1.4 M4Paul EggletonVERIFIEDenhancementLow
3519Lisandro Damián Nicanor Pérez MeyerCould enable GPIO_SYSFS1.4 M4Bruce AshfieldVERIFIEDenhancementLow
3599Laurentiu Palcurun liberation-fonts postinstall at do_rootfs time1.4 M4Laurentiu PalcuVERIFIEDenhancementMedium+
3696Belen Barros PenaRemove 'templates' functionality from Hob1.4 M4Cristiana VoicuVERIFIEDenhancementMedium+
3718Nitin Kambleupgrade emgd to 1.161.4 M4Nitin KambleVERIFIEDenhancementMedium
3807Nitin Kamblesugarbay, chiefriver, nuc BSPS: replace the VA_FEATURES method by new HWCODEC method1.4 M4Nitin KambleVERIFIEDenhancementMedium
3809Nitin KambleUpdate fri2 & sys940x BSPs to use emgd-1.161.4 M4Nitin KambleVERIFIEDenhancementMedium
3439Saul WoldInvestigate options for creating a genext4fs to enable a true EXT4 Filesystem1.4 M3Darren HartVERIFIEDenhancementMedium+
3516Darren Hartext2fsprogs: Add initial directory support to mke2fs ext41.4 M3Darren HartVERIFIEDenhancementMedium+
2565Dave Stewart[HOB] Limit the list of build profiles to the ones which are sensible1.4 M2Constantin MuscaVERIFIEDenhancementMediuma0a265e352b074b54928cf50563561c92aa2f814
2683Mark HatleAdd a way to dynamically specify the root user's home directory1.4 M2Kai KangVERIFIEDenhancementLow(D5)(Patch Merged)
3153Alexandru Georgescutoolchain installation should prompt for sudo passwd on permission denied locations1.4 M2Hongxu JiaVERIFIEDenhancementMedium
3155Marc Ferlandinit-live.sh should clean up temporary mounts1.4 M2Chen QiVERIFIEDenhancementMedium
3166Tom Zanussiyocto-bsp: add support for linux-yocto-custom kernels1.4 M2Tom ZanussiVERIFIEDenhancementMedium+Development [90%]
3182Mark HatleReplace Zypper/RPM integration with a smaller/better package resolver/manager - I.E. SMART/RPM1.4 M2Paul EggletonVERIFIEDenhancementHigh
3346Paul EggletonSmart package feed handling1.4 M2Paul EggletonVERIFIEDenhancementMedium+
3349Paul EggletonRemove zypper in favour of smart1.4 M2Paul EggletonVERIFIEDenhancementMedium+
3351Paul EggletonReimplement RPM rootfs generation using smart1.4 M2Paul EggletonVERIFIEDenhancementMedium+Patches sent for review (4 Dec)
3542JessicaMake Bitbake Commander plug-in a separate feature1.4 M2JessicaVERIFIEDenhancementMedium+
1656Mark HatleRecipe creation/import script1.4 M1Kai KangVERIFIEDenhancementLow(P3) (Test Case Ready)(Patch Merged)
3264Khem RajFix the breakage that binutils 2.23 caused to SDK installer1.4 M1Laurentiu PalcuVERIFIEDenhancementMedium+
3296Robert Yang[QA/Test] Add a perl-test recipe to test perl1.4 M1Kai KangVERIFIEDenhancementMedium(D3)(Patch Merged)
3297Robert Yangreplace the virtclass-* with class-* in the metadata1.4 M1Robert YangVERIFIEDenhancementMedium
3323JessicaBuild appliance changes for supporting openssh and sftp by default1.4 M1Saul WoldVERIFIEDenhancementMedium+patch pending
188Jessicacdt.launch.remote issues on a non-canonical terminal1.4Lianhao LuVERIFIEDenhancementLow
635Kevin Tianadd documentation for swabber1.4Scott RifenbarkVERIFIEDenhancementLow24 April 2012: Note added
806Joshua Lock - DisabledConsider using PatchELF rather than chrpath for modifying the RPATH1.4Joshua Lock - DisabledRESOLVEDenhancementLow
821Mark HatleZypper: Package dependency resolution does not know about hinting1.4Mark HatleVERIFIEDenhancementLow
823Joshua Lock - DisabledEnsure Poky can be run on non-Linux Unices1.4Joshua Lock - DisabledRESOLVEDenhancementLow
1548Richard PurdieDocument handling multiple/parallel library versions1.4Scott RifenbarkVERIFIEDenhancementLow22 March 2013 - Resolved
1588Richard PurdieHob v2 - Interface updates?1.4JessicaVERIFIEDenhancementLowUmbrella Bug For Tracking Only
1594Richard PurdieAdd a test framework1.4Song LiuVERIFIEDenhancementLow
1597Richard PurdieSecurity Layer1.4Song LiuVERIFIEDenhancementLow
1613Song LiuEmbedded java environment or even JDK support1.4Song LiuRESOLVEDenhancementLow
1618Song LiuMeeGo / Tizen GPLv2 Sync1.4Saul WoldRESOLVEDenhancementLow
1632Song LiuEval Patch management tools1.4Saul WoldRESOLVEDenhancementLow
1640Song Liu[DOC] Tracing/profiling HOWTOs1.4Tom ZanussiVERIFIEDenhancementMedium+(10D+5D)
1650Mark HatleNeed documentation on contributing patches and code1.4Scott RifenbarkRESOLVEDenhancementLow17-Nov-2011: Resolved Fixed with 3.8 of dev manual.
1941Scott RifenbarkUpdate BSP example appendix to use a more recent BSP suited for cheaper available hw1.4Scott RifenbarkVERIFIEDenhancementLow11 Feb 2013: resolved/obsolete
2170Joshua Lock - Disabled[HOB2]Switch to flexible gtk layout1.4JessicaVERIFIEDenhancementLow
2248Giulia[HOB] Replace persistent tooltips with property windows and information alerts1.4Andrei DinuVERIFIEDenhancementMedium
2392Tom ZanussiYocto BSP Tools: template enhancements1.4Tom ZanussiVERIFIEDenhancementMedium
2645Mark Hatle[DOC] The ADT documentation should be improved to include additional command line instructions1.4Scott RifenbarkRESOLVEDenhancementMedium1 March 2013: In Progress Review
2801Richard Purdie[Performance] do_package should be PACKAGE_ARCH specific, not MACHINE1.4Richard PurdieVERIFIEDenhancementHigh
2871Paul Eggleton[Performance] Improve RPM rootfs generation performance1.4Paul EggletonVERIFIEDenhancementMedium
2923Ross BurtonCreate font class1.4Laurentiu PalcuVERIFIEDenhancementLow
2997Belen Barros Pena[HOB] We need some progress indicator when you select 'view log'1.4Cristiana VoicuVERIFIEDenhancementMedium
3041Jerrod PeachLog all real SRCREVs, including deferencing AUTOREVs1.4Paul EggletonVERIFIEDenhancementLowAdditional patch posted for review
3120Matthew McClintockadd multiarch to DISTRO_FEATURES1.4Richard PurdieVERIFIEDenhancementMedium
3192Ross BurtonXorg server and drivers should declare ABI dependencies1.4Ross BurtonVERIFIEDenhancementMedium
3221Martin JansaSave more space in WORKDIR with rm_work1.4Saul WoldVERIFIEDenhancementLow
3275Martin Jansainefficient PACKAGES_DYNAMIC expressions1.4Martin JansaVERIFIEDenhancementMedium+
3327Ross Burton[DOC] No documentation for PACKAGECONFIG1.4Ross BurtonVERIFIEDenhancementMedium+03 Dec 2012 - Review edits applied
3363Paul Eggleton[DOC] Document buildhistory feature1.4Scott RifenbarkVERIFIEDenhancementMedium15 Nov 2012 - RESOLVED
3364Paul Eggleton[DOC] Document disk space monitoring1.4Scott RifenbarkVERIFIEDenhancementMedium14 Nov 2012 - Resolved
3366Paul Eggleton[DOC] Document optional module packaging1.4Scott RifenbarkVERIFIEDenhancementMedium12 Nov 2012 - Resolved
3380venkata ramana g[QA/Test] Integrated Automation framework catering to All automation needs1.4Stefan StanacarVERIFIEDenhancementMedium
3385Ross Burtonmesa-dri: rename to just 'mesa'1.4Laurentiu PalcuVERIFIEDenhancementMedium
3431Saul Woldmeta-web-kiosk - create layer and document usage1.4Emilia CiobanuVERIFIEDenhancementMedium
3435Saul WoldInvestigate fast boot optimization options for non-SystemD init system.1.4Radu MoisanRESOLVEDenhancementLow
3541Nitin Kamblecreate a new BSP for NUC1.4Nitin KambleVERIFIEDenhancementLow
3576Jessicaclean up hob and bitbake interaction via well-defined APIs/abstractions1.4Bogdan MarinescuVERIFIEDenhancementMedium+
3598Laurentiu Palcurun update-modules postinstall at do_rootfs time1.4Laurentiu PalcuVERIFIEDenhancementMedium+
3600Laurentiu Palcurun pango postinstalls at do_rootfs time1.4Laurentiu PalcuVERIFIEDenhancementMedium+
3602Laurentiu Palcurun matchbox-keyboard postinstalls at do_rootfs time1.4Laurentiu PalcuVERIFIEDenhancementMedium+
3603Laurentiu Palcurun matchbox-session-sato postinstalls at do_rootfs time1.4Laurentiu PalcuVERIFIEDenhancementMedium+
3621Ross BurtonSource in -dbg packages is wasteful and not massively useful1.4Ross BurtonRESOLVEDenhancementLow
3675Frans Meulenbroeksinhibit rm_work per recipe1.4Chen QiVERIFIEDenhancementLow
3712Stoicescu CornelTestopia mediawiki extension1.4Michael HalsteadVERIFIEDenhancementMedium
3716Laurentiu Palcurun busybox-syslog postinstall at do_rootfs time1.4Laurentiu PalcuVERIFIEDenhancementMedium
3744Ross BurtonPR Server variables could be more concise1.4Constantin MuscaVERIFIEDenhancementLow2f1aba504c592b5983d09e84cba71f86e8cea02a
3890Martin Jansa@contains does not create vardep automatically1.4Richard PurdieVERIFIEDenhancementMedium
3925Belen Barros PenaAdd file information to package information window1.4Andrei DinuVERIFIEDenhancementMedium
4008Alexandru GeorgescuError text should be changed when creating projects with invalid titles1.4Ioana GrigoropolVERIFIEDenhancementMedium
  99      


1.4 New Bugs:

IDRequesterAssigneeESummary (461 tasks) PWhiteboardMilestoneStatus
3540Wolfgang DenkScott Rifenbarkremote target debugging brokenMedium+10 April 2013 - IN PROGRESS REVIEW1.1.2RESOLVED
3659Scott GarmanDarren Hartsys940x do_rootfs failure due to missing libva - denzilMedium1.2.2RESOLVED
3693Alexandru GeorgescuIoana GrigoropolBUILDDIR error - when selecting kernel version in yocto bsp tool for denzilMedium1.2.2VERIFIED
3695Stoicescu CornelRobert Yang3incorrect message when using ABORT in disk space monitoringLow1.2.2RESOLVED
3535Scott GarmanMatthew McClintockmeta-fsl-ppc build error with libxml bbappendMedium+1.2.2VERIFIED
3618Stoicescu CornelScott Garmanregression: syslog.conf should not have tabs within the selector fieldLow1.2.2RESOLVED
3690Alexandru GeorgescuScott GarmanClutter - Unable to find suitable fbconfig for the GLX contextMedium1.2.2VERIFIED
3595Alexandru GeorgescuTom Zanussierror when selecting kernel version 3.0 in yocto bsp toolMedium1.2.2VERIFIED
3691chnariusMark Hatlesmart: meta-toolchain fail on do_populate_sdkMedium+1.3 M3VERIFIED
3466Alexandru Georgescunot beth flanaganeclipse-plugin 1.3 cannot be installed in IndigoMedium1.3.1VERIFIED
3860Ross BurtonBeth Flanaganfsl-* needs custom tweaking for DannyMedium1.3.1RESOLVED
3968Alexandru GeorgescuIoana Grigoropolan error appear when selecting kernel for yocto-bsp 1.3.1Medium1.3.1VERIFIED
3991Alexandru GeorgescuIoana Grigoropoleclipse-plugin 1.3 cannot reconfigure and build a clutter project for 1.3.1Medium1.3.1VERIFIED
3504scanliKevin Strassermeta-baryon:proftpd-1.3.4b can't passed in meta-baryon layer.Medium1.3.1RESOLVED
3608JsshetlerkishoreDanny binary minimal BSP causes kernal panicHigh1.3.1RESOLVED
3607JsshetlerRahul SaxenaX-window works on Denzil, fails on Danny binary BSP (Cedartrail)Medium+1.3.1RESOLVED
3634Andre SchrammRoss BurtonUdev broken in Danny branch (0140519ba15bfb27ccbfb3d41c7e678a1118fc5c)Medium+1.3.1RESOLVED
3833MihaiAlexandru Georgescubuild core-image-lsb-sdkMedium1.3.2VERIFIED
3966Yi ZhaoBruce Ashfield[danny 1.3.1] beagleboard/routerstation/mpc8315e: abnormal filesystem-related messages in dmesg when plugging a usb stickLow1.3.2RESOLVED
3706Nitin KambleDarren Hartsys940x: support v3.4 linux yocto kernelMedium1.3.2RESOLVED
3984Alexandru GeorgescuHongxu Jiaiptables-1.4.15: autoreconf run fails on 1.3.1Medium1.3.2RESOLVED
3983Yi ZhaoLaurentiu Palcu[danny 1.3.1] Invalid symbolic link file in adt_installer.tar.bz2Medium1.3.2RESOLVED
4020Marc FerlandNitin KambleEMGD - Backport missing symlinks patch to 1.3Medium1.3.2RESOLVED
3778JsshetlerRahul SaxenaCedarview - Danny NO PROMPT on the monitorMedium1.3.2RESOLVED
4010Stoicescu CornelRichard Purdiebitbake ignores PRservice errorMedium1.3.2VERIFIED
3537KartikmohtaRoss BurtonBackport adding ${PN}-staticdev to PACKAGES in distutils-common-base.bbclassMedium1.3.2RESOLVED
3636David NyströmRoss Burtonbitbake error message not helpfulMedium1.3.2RESOLVED
3669Stoicescu CornelRoss Burton[Regression] mDNS resolving is very slowMedium1.3.2RESOLVED
3836Daniel MorganRoss Burtonmenuconfig fails using SSTATE_MIRRORS and SOURCE_MIRROR_URLMedium1.3.2RESOLVED
3889GokulRoss Burton[meta-fsl-arm / HOB]Core-image-minimal failedMedium1.3.2RESOLVED
3949JessicaRoss Burton[sugarbay] lttng build failureMedium1.3.2RESOLVED
3977Stoicescu CornelRoss Burton[Test Case 169] Bitbake remake/remake-native checkMedium1.3.2RESOLVED
3831Andy DaltonAndy Daltonmeta/recipes-bsp/v86d/v86d_0.1.10.bb SRC_URI outdatedMedium1.4RESOLVED
3959Stoicescu CornelAlexandru Damiannon-GPLv3 grep command segfaults - causing system initialization failureHigh1.4VERIFIED
3528veeraAndrei Dinu[qemuarm] runqemu qemuarm throwing few errors on consoleMedium1.4RESOLVED
4067Belen Barros PenaAndrei DinuThe 'Open my images' dialog should be modalMedium1.4RESOLVED
4070Belen Barros PenaAndrei DinuAdjust spacing on information windowsMedium1.4VERIFIED
3460Jackie HuangBogdan Marinescupython-pygtk: do_compile failed when parallel buildingMedium1.4RESOLVED
3597Saul WoldBogdan Marinescusat-solver failes to build for arm worldMedium1.4RESOLVED
3643Yi ZhaoBogdan Marinescusmart config --help error: Invalid command 'config'Medium1.4VERIFIED
3681chnariusBogdan Marinescusmart: Can't install multilib gcc into rootfsMedium1.4RESOLVED
3835Khem RajBogdan Marinescumeta-toolchain is failing to buildMedium1.4RESOLVED
3859Nitin KambleBogdan Marinescuvalgrind configuration isn't deterministicMedium1.4RESOLVED
3873Jack MitchellBogdan Marinescudev-dbg doesn't pick up some packagesMedium1.4VERIFIED
3878Simon VanveerdeghemBogdan Marinescuarm-oe-linux-gnueabi-ld: unrecognized option '-Wl,-O1'Medium1.4RESOLVED
3881Mark HatleBogdan MarinescuWhen smart is installed on the host system, failures can occur when using smart-native to construct filesystemsMedium1.4RESOLVED
3422Darren HartBruce AshfieldCorrect commentary and possibly code assumptions about the existence of KMETAMedium1.4RESOLVED
3377Belen Barros PenaConstantin MuscaSelecting 'Build a new image' in the 'Image details' screen re-runs the sanity checksMedium8a3dd9e9081d09f9c38c98b34f14bbd2a9b824a51.4VERIFIED
3440Stoicescu CornelConstantin Musca2Multilib build triggers warningsMedium83e81485aa1a8454fdf78c624f61e75abca4067a, 5be92d4f0677c9191159fee541990e1bf77823f9, a1a48b839cb6b41c0873e38183b7a6038623fcb4, 2c57f28eda433e4f3e639023a6d244554c3ccdad1.4VERIFIED
3497Stoicescu CornelConstantin Muscaipk + multilib "bitbake cairo" fails at do_compileMedium1.4VERIFIED
3565Paul EggletonConstantin Musca[multilib] avoid creating multilib variants for allarch recipesMedium1674541ed83fa4645f2e078f65fe0f878527ee6e1.4RESOLVED
3568Saul WoldConstantin Muscakernel-dev should be excluded for multilib and possibly x32Medium1674541ed83fa4645f2e078f65fe0f878527ee6e1.4RESOLVED
3676Slawomir GonetConstantin MuscaPulseAudio build problemsMedium1.4RESOLVED
3741Felipe Ferreri TonelloConstantin Muscadeb packages problem on arm (gnueabi) architectureMedium9d076dcba1531686241dab62ff0f973537d40ca61.4RESOLVED
3531Stefan StanacarCristian IorgaHob remains at checking for correct build system startup with build appliance 1.4.M1.rc1MediumCommit: d4a4d00fb6961d3db8db6e8794066fdc29a79c461.4VERIFIED
3376Belen Barros PenaCristiana VoicuAny warnings during the build should display in the Issues tab of the Build screenMediummerged1.4VERIFIED
3529Alexandru DamianCristiana VoicuPackage selection search is counter-intuitiveLow1.4VERIFIED
3670Belen Barros PenaCristiana VoicuUnable to select poky-bleeding as my distroMedium1.4VERIFIED
3671Belen Barros PenaCristiana VoicuThe 'select a base image' option should not show once an image is selectedMedium1.4VERIFIED
3830Belen Barros PenaCristiana VoicuRecipe parsing warnings should go whenever the machine that generated them is no longer selectedMedium1.4VERIFIED
3957Andreea Brandusa ProcaCristiana VoicuHob does not retain all the changes made in Advanced Configuration from a previous use.Medium1.4VERIFIED
3814Nitin KambleDarren HartFRI2 audio playback is brokenLow1.4RESOLVED
3480liang liBeth Flanaganadt_installer.tar.bz2 missed with nightly build 20121121-3Low1.4VERIFIED
3750Ross BurtonBeth Flanaganharfbuzz: license warningsLow1.4RESOLVED
3794Nitin KambleBeth Flanaganadd more BSPs to meta-intel targetMedium1.4RESOLVED
3857Nitin KambleBeth FlanaganERROR: Package version for package matchbox-wm-staticdev went backwards which would break package feedsMediumautobuilder1.4RESOLVED
3464Hongxu JiaHongxu Jiabinutils-native-2.22-r17: do_compile failed on ubuntu 12.10Medium1.4RESOLVED
3547Hongxu JiaHongxu Jia3mkelfimage-native: do_compile failed if host does not install libzMedium1.4VERIFIED
3633Stoicescu CornelHongxu Jia5Incremental RPM generation fails when removing features from core-image-sato.bbMedium1.4VERIFIED
4050Hongxu JiaHongxu Jiabuild multilib core-image-sato failed when PR Server is enabledMedium1.4VERIFIED
3477Alexandru GeorgescuIoana GrigoropolWarning ClutterInitError appears when building Clutter project in EclipseLow1.4VERIFIED
3747Alexandru GeorgescuIoana Grigoropolan error appear when selecting kernel for yocto-bsp 1.4Medium1.4VERIFIED
3928Stoicescu CornelIoana Grigoropolstopping tcf-agent: FAILEDMedium1.4VERIFIED
3944Jason WesselJason Wesselsyslinux.bbclass needs some work to add serial support and a real menuMedium1.4RESOLVED
3378Belen Barros PenaJessicaWhat does the running task apply to: recipes or packages?Medium1.4VERIFIED
3637Biao.ZhangJessicaFails to launch hob on ubun10.04-64-bit hostMedium1.4VERIFIED
3891Beth FlanaganJessicaadt-installer fails to build due to failed kconfig-frontends-native configureMedium1.4RESOLVED
3941Alexandru GeorgescuJessicacannot configure and build Clutter project - glib-2.0 clutter-1.0Medium1.4VERIFIED
4042Viorel MireaJessicaThe Qemu Kernel path from Preferences is marked as changed while typing only if there was a wrong path beforeLow1.4RESOLVED
3594Eren TürkayChristopher LarsonAdd tmux support in devshellLow1.4RESOLVED
3926Ross BurtonChristopher LarsonParse error isn't handled correctlyMedium+1.4RESOLVED
4032Alexandru PalalauKevin Strasserbinutils-cross_2.23.1.bb do_package_write_rpm failsMedium1.4VERIFIED
3530scanliKevin Strassermeta-baryon:Can't create baryon-image.Medium1.4RESOLVED
3401Alexandru GeorgescuLaurentiu Palcustandalone toolchain should notify the user if the target install dir of SDK is one already usedMedium1.4VERIFIED
3409Eric BénardLaurentiu Palcumeta-toolchain-qte fails to find c++ headers when relocatedMedium1.4RESOLVED
3500Alexandru GeorgescuLaurentiu PalcuHost user not recognized when building meta-toolchain-sdkMedium1.4RESOLVED
3538Alexandru GeorgescuLaurentiu Palcuaclocal is incorrectly configured when using non default path for adt-installerMedium1.4VERIFIED
3596Saul WoldLaurentiu Palcucogl fails to build on arm - world buildsMedium1.4RESOLVED
3655Yi ZhaoLaurentiu Palcurunqemu-extract-sdk is unable to extract rootfs if meta-toolchain isn't installed in the default directoryMedium1.4VERIFIED
3770Wolfgang DenkLaurentiu Palcupopulate_sdk_base.bbclass: cannot install 32 bit SDK on 64 bit hostMedium1.4RESOLVED
3903Stoicescu CornelLaurentiu Palcu[Test Case 269] Graphics - ABATMedium1.4VERIFIED
3911Stefan StanacarLaurentiu Palcucairo do_compile fails when building a multilib imageMedium1.4VERIFIED
3918Stefan StanacarLaurentiu Palcucore-image-sato -c rootfs fails on executing update_icon_cacheMedium1.4VERIFIED
4023Yi ZhaoLaurentiu PalcuMissing g77 and gfortran in toolchain sdkMedium1.4RESOLVED
4066Alexandru GeorgescuLaurentiu Palcuiptables: autoconf warningsMedium1.4RESOLVED
3632Andrei DinuMichael Halstead8[Autobuilder] fri2-noemgd build failed on autobuilder due to stale NFS HandleMedium1.4RESOLVED
3514Lisandro Damián Nicanor Pérez MeyerMichel ThebeauDoesn't checks if the kernel fits in the memoryMedium1.4RESOLVED
3945Stoicescu CornelMihai Pricaconnman-properties gives segfaultMedium1.4RESOLVED
3482Ming LiuMing Liu1A lot of -dbg packages don't get installed on beagleboard platformMedium1.4RESOLVED
3518Ming LiuMing Liu1/etc/init.d/urandom service fails to start and stopMedium1.4VERIFIED
3815Ming LiuMing Liuconnman-gnome: fails to configure due to missing dependency to intltool-nativeMedium1.4RESOLVED
3717Bogdan MarinescuMatthew McClintockoprofile on PPC needs libpfmHigh1.4RESOLVED
3525Stoicescu CornelNitin Kamble1bitbake emgd-driver-bin produces QA warningMediumreview1.4VERIFIED
3730Nicholas HaunschildNitin Kamble0.25Compliance link in meta-bsp_name README is broken.Low1.4RESOLVED
3394Martin JansaPaul EggletonDifferent all architecture for some packagegroup recipes when building for e.g. arm and x86Medium1.4RESOLVED
3412Paul EggletonPaul EggletonBuildhistory web interface must be installed into "warningmanager" directoryMedium1.4VERIFIED
3551Mark HatlePaul Eggletonbitbake -c populate_sdk core-image-minimal fails due to missing dependency of bashMedium1.4RESOLVED
3822Saul WoldPaul Eggletonqmmp compile failureMedium+1.4RESOLVED
4136Phlip BalisterPaul Eggletonlibudev-dev not installed in sdkMedium1.4RESOLVED
3682Chen QiChen Qi1INSTALL_PLATFORM_EXTRA_RPM not exportedMedium1.4VERIFIED
3683Chen QiChen Qi1qemu: booting a ramfs based image may enter an endless loop if root.img is not foundMedium1.4VERIFIED
3708Saul WoldChen Qi7initscripts and sysvinit should use the update_rc.d bbclassMedium1.4VERIFIED
3710Chen QiChen Qi2Runqemu scripts should support booting an ISO imageMedium1.4VERIFIED
3970Saul WoldChen QiRuntime initialization error: Cannot create link over existing -/tmp-.Medium1.4RESOLVED
4038Chen QiChen Qi2util-linux: systemd unit files installed but not shippedMedium1.4RESOLVED
3399leokuRahul Saxena[cedartrail] unable enter UI Interface, have x-server init errorMedium+1.4RESOLVED
3943Jack MitchellKhem RajBinutils compile failureMedium1.4RESOLVED
3390Martin JansaRichard PurdieDifferent PACKAGE_ARCH in recipe only for some package or MACHINE causes missing ipk files in deployMedium1.4RESOLVED
3453Stoicescu CornelRichard Purdie7Build fails when building multilib with ipk packagingMediumRelease note1.4VERIFIED
3456Darren HartRichard PurdieProvide Build/Host information to "Build configuration" summaryLow1.4RESOLVED
3484Martin JansaRichard Purdiedo_package_write_* reexecuted on checksum change even with OEBasicMedium1.4RESOLVED
3521Martin JansaRichard PurdieWarnings from sstate overwriting files in sysrootMedium1.4RESOLVED
3561Christopher LarsonRichard Purdiebitbake: vardeps aren't obeyed for functions run from non-task-contextMedium1.4RESOLVED
3570Phlip BalisterRichard PurdieBitbake should probably not assume that '\' at the end of line means treat the next line as a comment silentllyMedium1.4VERIFIED
3640Martin JansaRichard Purdiesanity.bbclass sometimes failing to find saved_tmpdir when tmp-eglibc was deletedMedium1.4RESOLVED
3645Martin JansaRichard PurdieUsing wrong data when 2 recipes provide same runtime packageMedium1.4RESOLVED
3742Martin JansaRichard Purdiebitbake hangs forever when PR serv is enabledMedium1.4VERIFIED
3749JessicaRichard Purdiepopulate_sdk keeps pulling in ssh_dropbearMedium1.4RESOLVED
3827Wenzong.FanRichard Purdiesstate: some native sstate files can't be re-used between mips and other archsMedium1.4RESOLVED
3834BlloydRichard Purdiebitbake requires whitespace before +=MediumA candidate for 1.3.31.4RESOLVED
4049Scott RifenbarkRichard PurdieThe man page for bitbake does not include the -u optionLow21 March 2013 - reviewed1.4RESOLVED
3458Chen QiRoss BurtonGStreamer X11 packages missing in sato imageMedium1.4VERIFIED
3461Ross BurtonRoss BurtonFLAC text relocation warningsMedium(Patch Review)1.4RESOLVED
3469Otavio SalvadorRoss Burton1mesa-demos fail to build if using other GL libraryMedium1.4RESOLVED
3644Hongxu JiaRoss Burton[Matchbox]Click multiple times on the “stroke recogniser” icon lead to process waste and memory leakMedium1.4RESOLVED
3395Martin JansaSaul WoldWrong paths in eglibc-initial sstate manifestMedium1.4RESOLVED
3492Andreea Brandusa ProcaSaul WoldError when building core-image-sato.Medium1.4VERIFIED
3499Vitaly PerovSaul Woldneon-native package build hangs at do_configureMedium1.4RESOLVED
3745Stoicescu CornelSaul Wold[Test Case 169] Bitbake remake/remake-native checkMedium1.4VERIFIED
4051Ning ZhangSaul Woldbitbake world has error on qemumips. alsa/alsa-tools_1.0.26.1.bb compile failed.Medium1.4RESOLVED
3396Alexandru GeorgescuScott RifenbarkDirectory names can not contain spaces in itsMedium15 Nov 2012 - Provided documentation. Need approval.1.4VERIFIED
3445Mikhail LodiginScott Rifenbarkdevelopment manual lacks mentioning that eclipse need pde plugin installed.Medium28 Nov 2012 - RESOLVED1.4RESOLVED
3552Scott RifenbarkScott RifenbarkThe FILESEXTRAPATHS variable needs a more accurate description.Medium11 Feb 2013: Resolved1.4RESOLVED
3661Robert P. J. DayScott RifenbarkIn variable glossary, definition of FILESPATH is incorrectMedium29 Jan 2013: Resolved1.4RESOLVED
3662Robert P. J. DayScott RifenbarkSome layer-related variables need adding/editing in the variable glossaryMedium11 April 20131.4RESOLVED
3663Robert P. J. DayScott RifenbarkCh 4 refers to meta-intel layer as if it's essential for the upcoming workMedium29 Jan 2013: In progress review1.4RESOLVED
3664Robert P. J. DayScott RifenbarkIf bbappend file is not adding any files, point out no need to prepend to FILESEXTRAPATHSMedium1 Feb 2013: needs review1.4RESOLVED
3684Chen QiScott RifenbarkThe default signature handler is not correct in ref manualMedium12 Feb 2013: Needinfo1.4RESOLVED
3728Peter GsellmannScott Rifenbarkpage numbers not visible in printed manualsLow11 Feb 2013: Resolved1.4RESOLVED
3838Radu MoisanScott RifenbarkAlternatives Section 7.3 obsoleteMedium6 Feb 2013: resolved1.4RESOLVED
3754Wenzong.FanWenzong.Fanbind: nslookup is not shipped, its man page should not be shipped as wellLow1.4RESOLVED
3452Yi ZhaoZhenhua Luo[p1022ds] udev error: can not mount harddisk and usb stickMedium1.4VERIFIED
3410Bruce AshfieldBruce Ashfield2guilt: upstream source has movedMedium+1.4 M1VERIFIED
3446Saul WoldConstantin MuscaCreate blacklist for distro's to prevent images or packages from being selectableMedium+1.4 M1VERIFIED
3398Andreea Brandusa ProcaCristiana VoicuCan not build any image. Hob freezes after selecting an base image.Medium+merged1.4 M1VERIFIED
3405Jackie HuangJackie Huangeglibc: do_compile failed with #error "glibc cannot be compiled without optimization"Medium1.4 M1VERIFIED
3549Jackie HuangJackie Huangrt-tests: do_compile failed with "ld: cannot find -lrttest"Medium1.4 M1VERIFIED
3384Peter KjellerstedtJessicaThe first line of adt_installer is wrongMedium1.4 M1VERIFIED
3457JessicaRoss Burtonqt4-x11 build failureMedium+1.4 M1VERIFIED
3382Benjamin CavileerSaul Woldbug in hob or bitbake - bb.utils.mkdirhier?Medium+1.4 M1VERIFIED
3545Ioana GrigoropolBogdan MarinescuAutobuilder fail for python-smartpm under qemux86Medium+(autobuilder)1.4 M2RESOLVED
3558Saul WoldBogdan Marinescuguile fails to compile in world build - maybe parallelism issueMedium+1.4 M2RESOLVED
3478Stefan StanacarBruce Ashfieldlinux-yocto do_patch fails for a custom qemu bsp created with yocto-bspMedium1.4 M2VERIFIED
3587DaianeDaianeupgrade linux-mainline from 3.6 to 3.7Medium1.4 M2VERIFIED
3571Daiane Home Smart icon does not workMedium+1.4 M2RESOLVED
3572Daiane QT/Phonon integration on imx.6Medium+1.4 M2RESOLVED
3624Andrei DinuBeth Flanagan[Autobuilder] nightly-fsl-arm failed to build on autobuilderMedium1.4 M2RESOLVED
3562Hongxu JiaHongxu Jia5ghostscript-native: do_compile failed if host does not install libjpegMedium1.4 M2VERIFIED
3532Marco CavalliniLaurentiu PalcuYocto meta-toolchain script doesn't workMedium+1.4 M2VERIFIED
3392Robert YangRobert Yang2bitbake -e ASSUME_PROVIDED failed with unclear errorsMediumDesign1.4 M2VERIFIED
3476Ross BurtonMatthew McClintockAutobuilder failing on fsl-ppcMedium+(autobuilder)1.4 M2RESOLVED
3501Nitin KambleNitin Kamble3emenlow: X fails to come upMedium1.4 M2VERIFIED
3507Ross BurtonNitin Kamble3core-image-lsb doesn't buildMedium+(autobuilder) patch review1.4 M2VERIFIED
3606Otavio SalvadorOtavio Salvador[meta-fsl-demos] Drop 'netperf' as the license doesn't allow commercial useUndecided1.4 M2VERIFIED
3629Andrei DinuOtavio Salvador[Autobuilder] xf86-video-imxfb fail on nightly-fsl-arm and nightly-fsl-arm-lsbHigh1.4 M2VERIFIED
3557Saul WoldChen QiICU causes webkit-gtk to fail during world buildsHigh(autobuilder) Breaks world build1.4 M2VERIFIED
3503Trevor WoernerRichard Purdieadditions to IMAGE_INSTALL_append go unnoticedMedium+1.4 M2RESOLVED
3495Ross BurtonRoss Burton[romley] xf86-video-mga fails to configureMedium(autobuilder)1.4 M2RESOLVED
3522Yi ZhaoRoss Burton[beagleboard] X can not startup with 1.4 M1 RC1 20121128 buildMedium+1.4 M2VERIFIED
3408Paul EggletonSaul WoldTMPDIR cannot contain ../Medium1.4 M2RESOLVED
3546Ioana GrigoropolSaul WoldAutobuilder fails for util-linux under qemux86Medium+(autobuilder)1.4 M2RESOLVED
3584Wolfgang DenkSaul Woldlsbinitscripts build breaks due to referencing build host filesMedium1.4 M2RESOLVED
3625Andrei DinuSaul Wold[Autobuilder] fail for qt-x11-free-3.3.5 on nightly-mips-lsbMedium+1.4 M2RESOLVED
3589Cristian IorgaTom Zanussilttng-modules crashes while doing do_make_scripts taskMedium+1.4 M2RESOLVED
3418Darren HartBruce Ashfield2Update meta-data to use explicit scc references onlyLow1.4 M3RESOLVED
3679Cristian IorgaCristian Iorgalibtelepathy is not using python-native while buildingMedium0624d147f2a0edc5cab39278972db66e48db95f01.4 M3RESOLVED
3615Daiane /unit_tests/mxc_epdc_x11_fb_test.out will not work for imx6Low1.4 M3RESOLVED
3888Jeremy Stashluk gst-fsl-plugin: mfw_v4lsrc undefined symbol shm_openMedium+1.4 M3VERIFIED
3713Alexandru GeorgescuJessicacannot build eclipse-plugin on master 1.4Medium+1.4 M3VERIFIED
3533Nitin KambleNitin Kamble5create emenlow-noemgd BSPMedium1.4 M3VERIFIED
3722Nitin KambleNitin Kamble1gstreamer-vaapi build fails for sugarbay, chiefriver & NUC BSPsUndecided1.4 M3VERIFIED
3667Cristiana VoicuOtavio Salvador[Autobuilder] avahi fail on nightly-fsl-armMediumautobuilder1.4 M3RESOLVED
3411Paul EggletonPaul EggletonPreserve siginfo filesMedium+1.4 M3RESOLVED
3699Radu MoisanPaul Eggleton[Autobuilder] cedartrail: no package provides perl(IPC::Open2)MediumPatch sent for review1.4 M3RESOLVED
3646Yi ZhaoSaul Woldnon GPLv3 build failure with core-image-basicMedium+1.4 M3VERIFIED
3753Nitin KambleSaul Woldrpm2cpio fails to unpack emgd 1.16 binary rpmsMedium+1.4 M3RESOLVED
3403Hongxu JiaScott Rifenbark5bitbake parse does not handle } in the beginning of a function line correctlyMedium1 March 2013: In Progress Review1.4 M3VERIFIED
3415Darren HartBruce Ashfield1Only print kernel_configcheck warnings with a verbose settingMedium1.4 M4RESOLVED
3421Darren HartBruce Ashfield3Cleanup standard-nocfg.sccMedium1.4 M4RESOLVED
3725Stefan HerbrechtsmeierBruce Ashfieldguilt: unsupported version of git (1.8.0.2)Medium1.4 M4RESOLVED
3832Khem RajConstantin MuscaSDK is broken now after enabling multilib for gcc on targetMedium898a8094b1dcffc5ee54dbb612477c9bb3b8fd4b1.4 M4RESOLVED
3804Yi ZhaoCristian Iorga3connman offline mode doesn't work on qemu imagesMedium+1.4 M4VERIFIED
3843Stefan StanacarCristian Iorga1Build Appliance has no network - connman doesn't manage eth interfaces on qemu machinesMedium+1.4 M4VERIFIED
3829Belen Barros PenaCristiana VoicuWhen you click 'Build new image' in image details screen, Hob reruns sanity checks and hangsMedium+1.4 M4VERIFIED
3787Khem RajDarren Hartunable to build external kernel modules with linux-yocto 3.4Medium+1.4 M4RESOLVED
3799Bogdan MarinescuDarren Hart[Autobuilder] nightly-x86-64 dmesg sanity failed (modprobe gpf)Medium+1.4 M4RESOLVED
3806Mihai LindnerDarren Hart[Autobuilder] qemux86-64 "general protection fault" after system haltMedium+1.4 M4RESOLVED
3870Alexandru GeorgescuDarren Hartatom-pc - cannot boot image on netbook after installHigh1.4 M4VERIFIED
3563Hongxu JiaHongxu Jiaglib-2.0-native:do_configure failed with gcc version 4.3.4 on x86Medium1.4 M4RESOLVED
3677Hongxu JiaHongxu Jia5apt-native: apt.conf.sample cannot be created correctlyMedium1.4 M4VERIFIED
3720Hongxu JiaHongxu Jia5package_deb:meta-toolchain-sdk fail on do_populate_sdkMedium1.4 M4VERIFIED
3721Hongxu JiaHongxu Jia5package_deb.bbclass: change the arch's "_" to "-" in deb controlMedium1.4 M4VERIFIED
3817Hongxu JiaHongxu Jia5dpkg-native:fix dpkg-scanpackages error at deb image creation time on Fedora 17Medium1.4 M4VERIFIED
3784Patrick TurleyLaurentiu PalcuInconsistency in the SDK produced by OE/YoctoMedium1.4 M4RESOLVED
3788liang liLaurentiu Palcudesktop on qemuppc displayed abnormal (nigthly build 20130122-2)High1.4 M4VERIFIED
3839Alexandru GeorgescuLaurentiu Palcu[Test Case 378] Relocatable SDK - C - build Hello World GTK C Autotols ProjectMedium+1.4 M4RESOLVED
3840Laurentiu PalcuLaurentiu Palcuhave pulseaudio-server postinstall run on hostMedium1.4 M4RESOLVED
3855Nitin KambleLaurentiu PalcuAutobuilder: build-appliance-image-1.0-r19: task do_rootfs: FailedHighautobuilder1.4 M4RESOLVED
3893Saul WoldLaurentiu Palcugconftool fails due to invalid character '+' during populate-sdkMedium+1.4 M4RESOLVED
3428Robert YangRobert Yang3bitbake-layers print duplicated help infoLowDesign1.4 M4VERIFIED
3523Stoicescu CornelRobert Yang3Disk space monitoring gives error: Unknown eventMedium1.4 M4VERIFIED
3795Robert YangRobert Yang1cache.py: remove the duplicated self.file_dependsUndecided1.4 M4VERIFIED
3764Constantin MuscaNitin Kamble2[Autobuilder] Missing provider for libva-intel-driverMedium1.4 M4RESOLVED
3775Beth FlanaganNitin Kamble0.25Kernel recipe fails for sys940x on the autobuilderUndecided1.4 M4RESOLVED
3776Nitin KambleNitin Kamble2core-image-lsb-sdk image build for crownbay BSP fails on emgd installMedium+1.4 M4RESOLVED
3810Nitin KambleNitin KambleFRI2 BSP hits kernel BUG while bootingMedium1.4 M4RESOLVED
3846Nitin KambleNitin Kamble1X fails to start for fri2-noemgd BSPMedium1.4 M4RESOLVED
3819Laurentiu PalcuOtavio Salvador[autobuilder] nightly-fsl-arm: xf86-video-imxfb fails to compileHigh1.4 M4VERIFIED
3726Constantin MuscaPaul Eggleton[Autobuilder] valgrind: Can't install valgrind-3.7.0-r8@x86_64: no package provides libmpi.so.1MediumPatch sent for review1.4 M4RESOLVED
3768Yi ZhaoPaul Eggleton0.5smart: --yaml option doesn't workMedium1.4 M4RESOLVED
3792Abdellah Kouadri ExtPaul EggletonMissed development packages using IMAGE_FEATURES+="dev-pkgs"Medium1.4 M4RESOLVED
3697Chen QiChen Qi2'/etc/default/rcS' missing on targets with 'poky-tiny' distro featureMedium1.4 M4VERIFIED
3767Chen QiChen Qi1ERROR: postinst /etc/rpm-postinsts/* failedMedium+1.4 M4VERIFIED
3785Nitin KambleRahul Saxenakernel build for cedar-trail bsp is failingMedium+1.4 M4RESOLVED
3874Mark HatleRichard PurdieOverrides are evaluated for primary and multilib configuration, causing potential conflictsMedium+1.4 M4RESOLVED
3803Bogdan MarinescuSaul Wold[AUtobuilder] multiple build failures due to errors in kernel-side packagingMedium1.4 M4RESOLVED
3872FcooperSaul WoldMultiple scripts directories causes infinite oe-core/scripts/bitbake loopMedium1.4 M4RESOLVED
3447Tom ZanussiTom Zanussi3Configure oprofile to use 'operf' perf_events mode rather than legacy modeMedium+patchset posted to oe-core maling list1.4 M4RESOLVED
3731BlloydTom Zanussi2yocto-bsp creates kernel bbappend files that override settings even when other machines are activeMedium1.4 M4RESOLVED
3756Stefan StanacarTom Zanussi2crosstap and stap fail in core-image-sato-sdk (pre 1.4M3)Medium1.4 M4RESOLVED
3864Stoicescu CornelBogdan Marinescusmart installer prefers i586 over core2 in repositoryMedium+1.4 M5VERIFIED
3948Nitin KambleBruce Ashfieldlinux-yocto-dev: do_patch fails with: base.scc: line 5: force: command not foundMedium1.4 M5RESOLVED
3826Zhu YanjunCristian Iorgapulseaudio_2.1 do_compile failed with the error "modules/module-equalizer-sink.c:46:19: fatal error: fftw3.h: No such file or directory"Medium1.4 M5VERIFIED
3998Cristian IorgaCristian IorgaUsing the default settings of BA VM, network proxies cannot be used.Medium1.4 M5RESOLVED
4003Cristian IorgaCristian IorgaBuild Appliance loses connectivity after restart.Medium1.4 M5RESOLVED
3635Stoicescu CornelHongxu Jia3sstate-cache-management script does not remove anythingMedium1.4 M5VERIFIED
3674Hongxu JiaHongxu Jia5rebuild core-image-sato failed: not specify the order of do_populate_lic and do_rootfsMedium1.4 M5VERIFIED
3917Hongxu JiaHongxu Jia5base-passwd.preinst:bitbake core-image-minimal failedMedium1.4 M5VERIFIED
3927Stoicescu CornelKai Kanglsb images starts with runlevel 5 even though it has no GUIMedium1.4 M5RESOLVED
3996Yi ZhaoKai KangMissing SDK_VERSION section in external-python-tarball file nameUndecided1.4 M5VERIFIED
3932Nitin KambleLaurentiu Palcuupdate libva to at least version 1.1.0Medium1.4 M5RESOLVED
3933Nitin KambleLaurentiu Palcuupdate libva-intel-driver recipe to at least version 1.0.19Medium1.4 M5RESOLVED
3609Otavio SalvadorRobert Yang3Space monitoring isn't accurate when using btrfsMedium1.4 M5RESOLVED
3619Levi PearsonRobert Yang3Perforce fetch is brokenMedium+1.4 M5VERIFIED
3934Robert YangRobert Yang2lttng-ust: do_compile failed: cannot find -llttng-ust-tracepointUndecided1.4 M5VERIFIED
3939Robert YangRobert Yang2avahi: /usr/share/dbus-1 is installed but not shippedMedium1.4 M5VERIFIED
3526Nitin KambleNitin KambleUtilize Intel 2012Q4 graphics package in Yocto-ProjectMedium1.4 M5RESOLVED
3981Nitin KambleNitin Kamble3create v3.8 kernel recipe extension for meta intel BSPsMedium1.4 M5RESOLVED
3871Michael HalsteadOtavio Salvadorimx28evk machines odd permission and broken symlinkHigh1.4 M5VERIFIED
4012Paul EggletonPaul EggletonHost distro identification not possible without lsb_releaseUndecided1.4 M5RESOLVED
3940Chen QiChen Qi1matchbox-session-sato rdepends on initscriptsMedium1.4 M5VERIFIED
3973Richard PurdieRichard PurdieLibraries aren't gettings strippedMedium+1.4 M5RESOLVED
3980Ross BurtonRichard PurdieStamp doesn't update if referenced function changesMedium+1.4 M5RESOLVED
3915Mark HatleSaul WoldWhen building a multilib image, the results may not be consistenMedium1.4 M5RESOLVED
3921Stefan StanacarSaul WoldHob in Build Appliance doesn't startMedium+1.4 M5VERIFIED
3960Alexandru GeorgescuSaul WoldX fails to start on atom-pc imageMedium1.4 M5VERIFIED
4014Gaurang ShastriSaul WoldRegarding Licensing of "mbsalign.c" available in util-linux-2.21.2 version (Yocto-1.3-Danny)Medium1.4 M5RESOLVED
3992Phlip BalisterScott RifenbarkADT Manual needs to be clear about OpenEmbedded and PokyMedium+11 March 2013: needs review1.4 M5RESOLVED
3448Tom ZanussiTom Zanussi2Upgrade sysprof to new 'perf_events'-based version (1.20)Medium1.4 M5RESOLVED
3454Stoicescu CornelTom Zanussi2some builds invoke this warning: " /kernel/COPYING could not be copied "Medium1.4 M5VERIFIED
3951Tom ZanussiTom Zanussiperf doesn't build with core-image-minimalMedium1.4 M5RESOLVED
4006Stoicescu CornelAlexandru GeorgescuAdd test cases for appropriate 1.4 M1 featuresMedium1.4 M6VERIFIED
4007Stoicescu CornelAlexandru GeorgescuAdd test cases for appropriate 1.4 M2 featuresMedium1.4 M6VERIFIED
4026Stoicescu CornelAlexandru GeorgescuAdd test cases for appropriate 1.4 M3 featuresMedium1.4 M6VERIFIED
4027Stoicescu CornelAlexandru GeorgescuAdd test cases for appropriate 1.4 M4 featuresMedium1.4 M6VERIFIED
4028Stoicescu CornelAlexandru GeorgescuAdd test cases for appropriate 1.4 M5 featuresMedium1.4 M6VERIFIED
4029Stoicescu CornelAlexandru GeorgescuAdd test cases for appropriate 1.4 M6 featuresMedium1.4 M6VERIFIED
4030Stoicescu CornelAlexandru GeorgescuAdd test cases for appropriate 1.4 featuresMedium+1.4 M6VERIFIED
3828Emilia CiobanuAlexandru DamianChanging the display resolution turns the screen greenHigh1.4 M6VERIFIED
4069Björn StenbergBjörn Stenbergptest files are packaged into core packageMedium+1.4 M6RESOLVED
4080Alexander GerasiovBogdan Marinescubitbake meta-toolchain failure with deb packageMedium+1.4 M6VERIFIED
3419Darren HartBruce Ashfield1Wrap git merge commandLow1.4 M6RESOLVED
4052Yi ZhaoBruce AshfieldX can not startup on qemumipsMedium+1.4 M6RESOLVED
4129Khem RajBruce Ashfield3.8 Kernel crashes on qemumipsMedium+1.4 M6VERIFIED
3994SStoicescu CornelComponent and Default tester fields are linked together.Medium1.4 M6VERIFIED
4041Andreas OberritterCristian Iorgano connectivity with qemu, connman and systemdMedium+1.4 M6RESOLVED
4071Stefan StanacarCristian IorgaBuilding an image fails at quilt-native using BA for 1.4M5.rc1Medium+1.4 M6VERIFIED
4065Cristiana VoicuCristiana VoicuHob custom image build errorMedium1.4 M6VERIFIED
4113Belen Barros PenaCristiana VoicuGiving focus to the search text field loses my selected table sortingMedium1.4 M6VERIFIED
4116Belen Barros PenaCristiana VoicuThe "Clear search" button needs a tooltipLow28 Mar 2013 - Suggested wording1.4 M6VERIFIED
3935Yi ZhaoDonn Seeleybeagleboard/routerstation/mpc8315e: abnormal filesystem-related messages in dmesg when plugging a usb stickMedium1.4 M6VERIFIED
4035Koen KooiDarren Hartscripts/contrib/mkefidisk.sh forgets to add root= parameterMedium+1.4 M6RESOLVED
4036Koen KooiDarren Hartscripts/contrib/mkefidisk.sh hardcodes 'rw' as root mount optionMedium+1.4 M6RESOLVED
4094Alexandru GeorgescuBeth FlanaganADT-installer and toolchain builds are missing from the new AB builds.Medium+1.4 M6VERIFIED
4095Cristiana VoicuBeth Flanaganno recipe available for udev_173.bbappendMedium1.4 M6RESOLVED
4060Saul WoldEmilia Ciobanuconnman-applet spews warningsMedium1.4 M6RESOLVED
3490Ross BurtonHongxu Jiaatom-pc kernel warningsLow1.4 M6RESOLVED
4001Hongxu JiaHongxu Jia4qemu-native:do_configure failed with gcc version 4.3.4 on x86Undecided1.4 M6RESOLVED
4015Kai KangKai KangLSB 4.1 Library Check: some libraries are missing on x86(emenlow)Medium1.4 M6RESOLVED
4126kishorekishoreCrystal Forest build failing for openssl-qat-moduleMedium+1.4 M6RESOLVED
4131Alexandru GeorgescuLaurentiu Palcuerror when installing the cross toolchainMedium+1.4 M6VERIFIED
3995Yi ZhaoRobert Yang5Disk space monitor setting in local.conf.sample is incorrectMedium1.4 M6VERIFIED
4031Robert YangRobert Yang3utils.py: BB_ENV_WHITELIST doesn't work wellMedium1.4 M6VERIFIED
4064Robert YangRobert Yang1meta: remove several duplicated linesMedium1.4 M6VERIFIED
4089Richard PurdieMark HatleSegfault in debugeditMedium+1.4 M6RESOLVED
3515Lisandro Damián Nicanor Pérez MeyerMichel ThebeauThe size of the kernel image is too bigMedium+1.4 M6RESOLVED
4040Andrei DinuOtavio Salvadorxf86-video-imxfb and xf86-video-imxfb-vivante failed to compile on nightly-fsl-arm-lsbMedium+1.4 M6RESOLVED
4068Cristiana VoicuOtavio Salvadormesa-dri failed to configure on nightly-fsl-arm and nightly-fsl-arm-lsbMedium+1.4 M6RESOLVED
4048Khem RajPaul Eggletonsmart update of perl-modules failMedium+1.4 M6RESOLVED
4056Paul EggletonPaul Eggletondo_populate_sysroot fails with traceback if do_install doesn't install anythingMedium+1.4 M6RESOLVED
3904Stoicescu CornelChen Qipsplash: splash screen does not go away when booting into runlevel 3Medium1.4 M6VERIFIED
3924Darren HartChen Qiudevd: failed to execute 'etc/udev/scripts/mount.sh'Medium1.4 M6RESOLVED
4055Yi ZhaoChen Qi1Parse error when add meta-skeleton layerMedium1.4 M6VERIFIED
4034Chen QiRadu Moisansystemd: mounting temporary directory failedMedium+1.4 M6RESOLVED
4046Andre SchrammRadu MoisanUdev broken in initrdscriptsMedium+1.4 M6RESOLVED
4081Saul WoldRichard PurdieFix warning uid greater than 99Medium1.4 M6RESOLVED
4058Beth FlanaganSaul Woldrunning multiple sanity tests via bitbake fails oddlyMedium+1.4 M6RESOLVED
4076Saul WoldSaul WoldCairo has dependency on lzoMedium1.4 M6RESOLVED
4097Stoicescu CornelSaul Wold"login[423]: segfault" for minimal imageMedium+1.4 M6VERIFIED
4125Wayne WarrenSaul Woldudev_182 recipe's init allows use of tmpfs but udev-182 only works with devtmpfsMedium1.4 M6RESOLVED
3993Jack MitchellTom Zanussiperf using host includesMedium+1.4 M6RESOLVED
4099Stoicescu CornelTom ZanussiCrosstap script check failsMedium1.4 M6VERIFIED
4019Otto LinnemannBogdan MarinescuThe guile scheme interpreter does not start up and throws various errorsMedium1.4.1RESOLVED
3900Ross BurtonRadu Moisansystemd fails to start .sh init scriptsMedium1.4.1RESOLVED
3882Alexandru GeorgescuScott Rifenbarkwayland feature should be well documentedMedium28 June 2013: VERIFIED AND FIXED1.4.1VERIFIED
3496Belen Barros Penavalentin3The Issues tab displays a badge, but no information on the issuesMedium1.4.2VERIFIED
4107Yi ZhaoKai KangPAM unit test failed: segmentation fault for tst-pam_pwhistory1Low1.5VERIFIED
3393Stefan StanacarChristopher LarsonBuild fails when using Sourcery CodeBench Lite for ARM toolchain with multiple providers errorsMedium1.5RESOLVED
3449Christopher LarsonChristopher Larsonarchiver doesn't interact well with sstateMedium1.5RESOLVED
3969Ross BurtonMihai PricaAdd QA warning for shipping /usr/share/info/dirMedium1.5RESOLVED
3781TarekOtavio Salvadori.MX6Q: mfw_isink ProblemMedium1.5RESOLVED
3947Jack MitchellKhem RajGCC + eglibc + Texinfo5.0+Medium+1.5RESOLVED
3805Yi ZhaoRoss BurtonPAM support: missing pam_systemd.soMedium1.5VERIFIED
4061Saul WoldRoss Burtonmatchbox-panel assertion failureMedium1.5RESOLVED
4062Saul WoldRoss Burtonmatchbox-desktop - Icon warnings during startupMedium1.5RESOLVED
4108Ning ZhangRoss Burtonbeagleboard-sato-sdk, video player could not show menu button clearlyMedium1.5RESOLVED
3823Saul WoldSaul Woldgit-native depends on gettextMedium1.5RESOLVED
3746Stefan StanacarTom Zanussi1yocto-kernel tool fails to find layer when using BBLAYERS += in bblayers.confMedium1.5VERIFIED
3423Darren HartBruce Ashfield2Define KFEATURE_COMPATIBILITYMedium1.5 M1RESOLVED
4045Stoicescu CornelStoicescu Cornelsstate-cache-management.sh test case needs updateMedium1.5 M1VERIFIED
4111Belen Barros PenaCristiana VoicuSearch results in recipes and packages tables should be sorted alphabeticallyMedium1.5 M1VERIFIED
4016Kai KangHongxu Jia5LSB 4.1 Library Check: symbols are not found in libqt-mt.so.3Medium1.5 M1RESOLVED
3404Marc FerlandChen Qi5udev mount.sh writes to /tmp before it is symlinked to /var/tmpMediumBlocked, need some further discussion1.5 M1RESOLVED
3705Maksym ZhelieznyiHongxu JiaExisting filesystems aren't cleanly unmounted after booting from USB-driveLow1.5 M2RESOLVED
3908Stefan StanacarRichard Purdie5Kernel panic on qemux86-64 when using runqemu kvm and cpu hostMedium+release note for 1.41.5 M2VERIFIED
4004Alexandru GeorgescuHongxu Jia5cannot write to usb using File Manager on Atom-pcMedium1.5 M3VERIFIED
3938Yi ZhaoMihai Pricarouterstation/mpc8315e: connman startup unused ethernet port when using nfsMedium+1.5 M5RESOLVED
3573DaianeDaianeLVDS Touch Screen is missing on imx6qsabreautoMedium1.5.1RESOLVED
3539Alexandru GeorgescuJessica1Unwanted errors appear if the Yocto Project ADT isn’t configured in PreferencesMedium1.5.4RESOLVED
4009Alexandru GeorgescuJessica2Java error when creating a project with invalid titleMedium1.5.4RESOLVED
3862Darren HartJoão HenriqueNew makecfgfrag bitbake task to create configuration fragmentsLow1.6RESOLVED
3946Alexandru PalalauNitin Kamble2[NUC] dmesg MUX INFO call failed errorMedium1.6RESOLVED
3816Radu MoisanChen Qi2systemd: investigate mechanism to change default.targetMedium1.6VERIFIED
3989Andreas OberritterRichard Purdie5chrpath fails with short build prefixMedium1.6VERIFIED
3771Wolfgang DenkBeth FlanaganQA and release process not reproducableHigh24 March 2014: Set Documentation flag to "Done".1.6 M1VERIFIED
3901Ross BurtonRadu Moisan2systemd shouldn't replace busybox syslog by defaultMedium1.6 M2VERIFIED
3593Dave StewartIonut ChisanoviciFish River Island 2 - should support 3G / 4GMedium1.7RESOLVED
3780Wenzong.FanPeter A. Bigotgit: WARNING: perl-native files were installed but not shippedMedium1.7RESOLVED
3783Belen Barros PenavalentinWarnings arising from the recipe parsing process should always displayMedium1.7RESOLVED
3909Belen Barros PenavalentinHob fails to launch if an error occurs before sanity checksMedium1.7RESOLVED
3937Yi ZhaoKevin Hao[beagleboard xM] Watchdog doesn't workMedium1.7 M3RESOLVED
3729Darren HartScott RifenbarkAdd a section on how to build out-of-tree modules on the target.Low17 June 2014: RESOLVED1.7 M3RESOLVED
3383Darren HartBruce Ashfield5Provide clear warnings when a default scc is usedMedium1.8RESOLVED
4024Ning ZhangLucian Musatstart qemuarm with "core-image-sato", use "dmesg | grep -i error" shows 2 errorsLow1.8 M2RESOLVED
3782Andre SchrammLeonardo Sandoval Gonzalez3mklibs fails when building optimized imageMedium1.9 M2VERIFIED
4018Nitin KambleRoss Burton1webkit-gtk should recommend video codecsMedium2.1RESOLVED
4102Martin JansaRichard Purdie5Incremental builds do not work well when renaming recipes or changing architecture.Medium+2.1 M1VERIFIED
4047Darren HartBruce Ashfield1Document recipe-space kernel featuresMedium+25 February 2015: Poking for solution2.1 M4VERIFIED
3898Trevor WoernerJuro Bystrickykernel menuconfig unusableMedium2.2RESOLVED
3388Tom Zanussidengke2perf: enable man pages for basic 'help' functionalityMedium2.2 M3RESOLVED
3786Phlip BalisterAlexander Kanavin1RPM packaging fails for pkgconfig files with '-' in version fieldLow2.4 M3RESOLVED
3657Robert P. J. DayBelen Barros PenaA number of fixes/suggestions for Hob manual web pageMedium5 Feb 2013: Some information suggested.FutureRESOLVED
4059OpensourceCalifornia Sullivaninit-install.sh assumes boot device is the same as the one selected when it is runMediumFutureRESOLVED
3527Joshua Lock - DisabledJeff Osier-MixonDrop down arrow drawn outside of drop down box on Firefox 17 (Fedora 17)MediumFutureRESOLVED
3641Robert P. J. DayJeff Osier-MixonNumerous possible web site tweaks under "About" pageMediumFutureRESOLVED
3660Robert P. J. DayJeff Osier-MixonMain page: superfluous references to OE and bitbake mailing lists already on ML pageMediumFutureRESOLVED
3665Bill TraynorJeff Osier-MixonFRI2 page with broken html.MediumFutureRESOLVED
3687ronanJeff Osier-MixonBroken link to mailing-listsMedium+FutureRESOLVED
3733Jeff Osier-MixonJeff Osier-MixonAdd content to the FAQ systemMediumFutureRESOLVED
3737Jeff Osier-MixonJeff Osier-Mixonadd more content to the websiteMediumFutureRESOLVED
3738Jeff Osier-MixonJeff Osier-Mixonfix website page styling on Firefox and IELowFutureRESOLVED
3766Jeff Osier-MixonJeff Osier-Mixon1Need better taxonomy for project categoriesLowFutureRESOLVED
3952Jeff Osier-MixonJeff Osier-Mixonadjust formatting of compliance program emailsMediumFutureRESOLVED
3953Jeff Osier-MixonJeff Osier-Mixon1update compliance program formsMediumFutureRESOLVED
3971Jeff Osier-MixonJeff Osier-Mixonfeature blogs on front pageMediumFutureRESOLVED
3987Jeff Osier-MixonJeff Osier-Mixondefine what a yp.org account doesLowFutureRESOLVED
3936Yi ZhaoKevin Hao[beagleboard xM] Some error message with usbhs_omap in dmesgMediumFutureRESOLVED
3579Li WangLi WangSecurity Advisory - cups - CVE-2012-5519MediumP3FutureRESOLVED
3580Li WangLi WangSecurity Advisory - libxml2 - CVE-2012-2871Medium+P3FutureRESOLVED
3581Li WangLi WangSecurity Advisory - librsvg - CVE-2011-3146Medium+P3FutureRESOLVED
3582Li WangLi WangSecurity Advisory - cups - CVE-2011-2896MediumP3FutureRESOLVED
3583Li WangLi WangSecurity Advisory - cups - CVE-2011-3170MediumP3FutureRESOLVED
4002Robert YangRobert Yang3cairo: cannot find the library `/path/to/sysroots/x86_64-linux/usr/lib/libpng15.la'MediumFutureRESOLVED
4021Ning ZhangRobert Yang10no recipe changed, script "bitbake-whatchanged" could also list some tasks need to be updatedMediumFutureRESOLVED
3656Yi ZhaoMark Hatlerpm2cpio: Segmentation faultLowFutureRESOLVED
3509Scott RifenbarkMichael HalsteadNeed better Yocto Project Documentation ComponentsMedium17 June 2014: IN PROGRESS REVIEWFutureRESOLVED
3560Saul WoldMichael HalsteadDefault Search should now include all IN_PROGRESS* statesMediumFutureRESOLVED
3736Jeff Osier-MixonMichael Halstead1fix the disappearing/appearing sub-menus on the websiteLowFutureRESOLVED
3950Tracey ErwayNicolas DechesnePlease add a reference to SMC Licensing Compliance presentation on YP's capabilitiesMediumFutureACCEPTED
3845Marc FerlandNitin Kamble3meta-crownbay: No splash screen on shutdownLowFutureRESOLVED
3702Frans MeulenbroeksRichard PurdieFEATURE: in images allow easy selection of files within packagesMediumFutureRESOLVED
3381Tom ZanussiSaul Wold3crownbay: s3 problems when booting off of live image on usb flash driveLowFutureRESOLVED
3639Bill TraynorScott RifenbarkDuplicate Build Appliance text on Projects page.MediumFutureRESOLVED
3494Scott GarmanUnassigned10Development of a metadata layer for testing boardsMedium+FutureRESOLVED
3638Biao.ZhangJeff Osier-MixonSeveral "&nbsp" are displayed in the hob-manual.Medium28 Dec 2012 - re-assigned to JefroQ1RESOLVED
3752Jeff Osier-MixonJeff Osier-Mixonadd a Google+ social media link at bottom leftMedium+Q1RESOLVED
3761Jeff Osier-MixonJeff Osier-Mixonyocto logo on main site has no blue dotUndecidedQ1RESOLVED
3869Dave StewartJeff Osier-Mixon"documentation" page "entire set of manuals" is incorrect linkMedium+Q1RESOLVED
3734Jeff Osier-MixonJeff Osier-Mixon3fix the downloads page on the websiteMedium+Q2RESOLVED
3777Jeff Osier-MixonJeff Osier-Mixonsupporting organizations page needs complete logosMedium+Q2RESOLVED
4057Paul EggletonJeff Osier-Mixontlk page is missingMedium+Q2RESOLVED
3755Jeff Osier-MixonMelissa Andersonadd section for trainingMedium+Q2RESOLVED
3801Jeff Osier-MixonMelissa Anderson2Represent YP Compatible products better in EcosystemMedium+Q2RESOLVED
3876Jeff Osier-MixonMelissa Anderson3Articles pageMediumQ2RESOLVED
3954Jeff Osier-MixonMelissa Anderson0.5build out a "related materials" sectionMediumQ2RESOLVED
3842Michael HalsteadJeff Osier-MixonRemove older documentation from major search indexesMediumQ3RESOLVED
3473Ross BurtonBruce Ashfieldatom-pc kernel fails to buildUndecided---RESOLVED
4037John WeberCristian Iorganeard 0.9 build fails during package_write_rpmUndecided---RESOLVED
4112Belen Barros PenaCristiana VoicuSearch strings and results should be persistentUndecided---VERIFIED
4117Belen Barros PenaCristiana VoicuThe "Clear search" button should bring focus to the search text fieldUndecided---VERIFIED
3590Alexandru PalalauDarren Hart[Atom-PC]Return from standby failsUndecided---RESOLVED
3591Alexandru GeorgescuDarren Hart[ATOM-PC] cannot boot after install - stops at grubUndecided---VERIFIED
3865Nitin KambleBeth Flanaganqemuimagetest needs a X desktop to start qemuUndecidedautobuilder---RESOLVED
3972JessicaBeth Flanagan[AB Build failure] kernel module package version went backward errorsUndecided---RESOLVED
4093Cristiana VoicuBeth Flanagan[Autobuilder] Failed publishing artifactsUndecided---RESOLVED
4025Hongxu JiaHongxu Jiapackage.bbclass: build lib32neard failedUndecided---VERIFIED
3402venkata ramana gJeff Osier-MixonNew website not not proper on IEMedium9 Nov 2012 - reassigned to Jefro---RESOLVED
3688ronanJeff Osier-MixonBroken link to "Yocto Project Application Development Toolkit (ADT)"Undecided---RESOLVED
3689ronanJeff Osier-MixonBroken link to " Download into Eclipse"Undecided---RESOLVED
3762Jeff Osier-MixonJeff Osier-Mixonfix this and other presentation stuff on the websiteUndecided---RESOLVED
3923Jeff Osier-MixonJeff Osier-Mixonremove obsolete compliance registrar pageUndecided---RESOLVED
3985Ross BurtonKai Kangslang: QA warning due to badly packaged .debug filesUndecided(autobuilder)---RESOLVED
3852Laurentiu PalcuLaurentiu Palculibrsvg postinstall should run on hostUndecided---RESOLVED
3853Laurentiu PalcuLaurentiu Palcugtk+ immodules packages should have the postinstalls run on hostUndecided---RESOLVED
3854Laurentiu PalcuLaurentiu Palcugnome-keyring postinstall must run on hostUndecided---RESOLVED
3866Nitin KambleLaurentiu Palcudirectfb recipe compilation failsUndecidedautobuilder---VERIFIED
4087Richard PurdieLaurentiu Palcuxf86-input-evdev has dependency issues with mtdevUndecided---RESOLVED
4124Cristian IorgaLaurentiu PalcuX does not start on qemu x86/x86-64 machinesUndecided---VERIFIED
4135Andy DaltonLaurentiu PalcuGenerated SDK installer script requires a modern version of 'tar'Undecided---RESOLVED
3962Mark HatleMark HatleKernel module packages have a hard coded path to STAGING_KERNEL_DIR in the package install scriptsUndecided---RESOLVED
3963Mark HatleMark HatleKernel module packages call to depmod generates a warning about missing modules.* filesUndecided---RESOLVED
3703Radu MoisanOtavio SalvadorAutobuilder failing on fsl-armUndecided---RESOLVED
3727Constantin MuscaOtavio Salvador[Autobuilder] virtual/libgl: mesa-dri/gpu-viv-bin-mx6q error: multiple .bb files are due to be builtUndecided---RESOLVED
3773Constantin MuscaOtavio Salvador[Autobuilder] linux-linaro: confusing multiline, partially commented expressionUndecided---RESOLVED
4092Cristiana VoicuOtavio Salvadormesa-dri: rename to just 'mesa' in meta-fslUndecided---RESOLVED
4098Cristiana VoicuOtavio Salvadorfailed to install mxsldrUndecided---RESOLVED
3919Paul EggletonPaul EggletonForced rebuilds are ignored for subsequent buildsUndecided---RESOLVED
3389Stoicescu CornelRichard Purdiebitbake lib64-core-image-sato fails due to "nothing PROVIDES" errorsUndecided---VERIFIED
3475Martin JansaRichard Purdiesstate-cache-management.sh doesn't work with new stamps layoutUndecided[patch out for review]---VERIFIED
3485Cristiana VoicuRichard Purdieenable by default BB_DISKMON_DIRS and/or BB_DISKMON_WARNINTERVAL varsUndecided---RESOLVED
3486Alexandru GeorgescuRichard Purdie"/scripts/cleanup-workdir" needs reviewUndecided[patch out for review]---VERIFIED
3974Yi ZhaoRichard Purdie[danny 1.3.1] Disk space monitor gives unexpected error: Unknown eventUndecided---RESOLVED
3978Jason WesselRichard PurdieInfinite hang in bitbake parse if you have certain types of parse errorsUndecided---RESOLVED
4022Andrei DinuRichard Purdie[autobuilder] lib32-neard failed on nightly-multilibUndecided---RESOLVED
4090Jochen TrumpfRichard PurdieMACHINEOVERRIDES still inconsistentUndecided---RESOLVED
3472Ross BurtonRoss BurtonBroken libgl depends at image timeUndecided(autobuilder)---RESOLVED
3471Ross BurtonSaul WoldMissing dependencies in libcheckUndecided(autobuilder)---RESOLVED
3483Yi ZhaoSaul Wold[beagleboard] xf86-video-omap: do_configure failed with 20121121 build on autobuilderUndecided---RESOLVED
3491Andreea Brandusa ProcaSaul WoldError when building core-image-basic.Undecided---VERIFIED
4039Andrei DinuSaul Woldneard failed to compile on autobuilderUndecided---RESOLVED
3567Jeff Osier-MixonScott RifenbarkManual is now called the "Yocto Project Reference Manual"Undecided11 Dec 2012 - Fixed---RESOLVED
    461    

1.4 OPS Bugs:

IDRequesterAssigneeESummary (66 tasks) PWhiteboardMilestoneStatus
3693Alexandru GeorgescuIoana GrigoropolBUILDDIR error - when selecting kernel version in yocto bsp tool for denzilMedium1.2.2VERIFIED
3695Stoicescu CornelRobert Yang3incorrect message when using ABORT in disk space monitoringLow1.2.2RESOLVED
3690Alexandru GeorgescuScott GarmanClutter - Unable to find suitable fbconfig for the GLX contextMedium1.2.2VERIFIED
3618Stoicescu CornelScott Garmanregression: syslog.conf should not have tabs within the selector fieldLow1.2.2RESOLVED
3595Alexandru GeorgescuTom Zanussierror when selecting kernel version 3.0 in yocto bsp toolMedium1.2.2VERIFIED
3466Alexandru Georgescunot beth flanaganeclipse-plugin 1.3 cannot be installed in IndigoMedium1.3.1VERIFIED
3968Alexandru GeorgescuIoana Grigoropolan error appear when selecting kernel for yocto-bsp 1.3.1Medium1.3.1VERIFIED
3991Alexandru GeorgescuIoana Grigoropoleclipse-plugin 1.3 cannot reconfigure and build a clutter project for 1.3.1Medium1.3.1VERIFIED
3984Alexandru GeorgescuHongxu Jiaiptables-1.4.15: autoreconf run fails on 1.3.1Medium1.3.2RESOLVED
4010Stoicescu CornelRichard Purdiebitbake ignores PRservice errorMedium1.3.2VERIFIED
3669Stoicescu CornelRoss Burton[Regression] mDNS resolving is very slowMedium1.3.2RESOLVED
3977Stoicescu CornelRoss Burton[Test Case 169] Bitbake remake/remake-native checkMedium1.3.2RESOLVED
3959Stoicescu CornelAlexandru Damiannon-GPLv3 grep command segfaults - causing system initialization failureHigh1.4VERIFIED
3440Stoicescu CornelConstantin Musca2Multilib build triggers warningsMedium83e81485aa1a8454fdf78c624f61e75abca4067a, 5be92d4f0677c9191159fee541990e1bf77823f9, a1a48b839cb6b41c0873e38183b7a6038623fcb4, 2c57f28eda433e4f3e639023a6d244554c3ccdad1.4VERIFIED
3497Stoicescu CornelConstantin Muscaipk + multilib "bitbake cairo" fails at do_compileMedium1.4VERIFIED
3957Andreea Brandusa ProcaCristiana VoicuHob does not retain all the changes made in Advanced Configuration from a previous use.Medium1.4VERIFIED
3633Stoicescu CornelHongxu Jia5Incremental RPM generation fails when removing features from core-image-sato.bbMedium1.4VERIFIED
3477Alexandru GeorgescuIoana GrigoropolWarning ClutterInitError appears when building Clutter project in EclipseLow1.4VERIFIED
3747Alexandru GeorgescuIoana Grigoropolan error appear when selecting kernel for yocto-bsp 1.4Medium1.4VERIFIED
3928Stoicescu CornelIoana Grigoropolstopping tcf-agent: FAILEDMedium1.4VERIFIED
3941Alexandru GeorgescuJessicacannot configure and build Clutter project - glib-2.0 clutter-1.0Medium1.4VERIFIED
4032Alexandru PalalauKevin Strasserbinutils-cross_2.23.1.bb do_package_write_rpm failsMedium1.4VERIFIED
3401Alexandru GeorgescuLaurentiu Palcustandalone toolchain should notify the user if the target install dir of SDK is one already usedMedium1.4VERIFIED
3500Alexandru GeorgescuLaurentiu PalcuHost user not recognized when building meta-toolchain-sdkMedium1.4RESOLVED
3538Alexandru GeorgescuLaurentiu Palcuaclocal is incorrectly configured when using non default path for adt-installerMedium1.4VERIFIED
4066Alexandru GeorgescuLaurentiu Palcuiptables: autoconf warningsMedium1.4RESOLVED
3903Stoicescu CornelLaurentiu Palcu[Test Case 269] Graphics - ABATMedium1.4VERIFIED
3945Stoicescu CornelMihai Pricaconnman-properties gives segfaultMedium1.4RESOLVED
3525Stoicescu CornelNitin Kamble1bitbake emgd-driver-bin produces QA warningMediumreview1.4VERIFIED
3453Stoicescu CornelRichard Purdie7Build fails when building multilib with ipk packagingMediumRelease note1.4VERIFIED
3492Andreea Brandusa ProcaSaul WoldError when building core-image-sato.Medium1.4VERIFIED
3745Stoicescu CornelSaul Wold[Test Case 169] Bitbake remake/remake-native checkMedium1.4VERIFIED
3396Alexandru GeorgescuScott RifenbarkDirectory names can not contain spaces in itsMedium15 Nov 2012 - Provided documentation. Need approval.1.4VERIFIED
3398Andreea Brandusa ProcaCristiana VoicuCan not build any image. Hob freezes after selecting an base image.Medium+merged1.4 M1VERIFIED
3713Alexandru GeorgescuJessicacannot build eclipse-plugin on master 1.4Medium+1.4 M3VERIFIED
3870Alexandru GeorgescuDarren Hartatom-pc - cannot boot image on netbook after installHigh1.4 M4VERIFIED
3839Alexandru GeorgescuLaurentiu Palcu[Test Case 378] Relocatable SDK - C - build Hello World GTK C Autotols ProjectMedium+1.4 M4RESOLVED
3523Stoicescu CornelRobert Yang3Disk space monitoring gives error: Unknown eventMedium1.4 M4VERIFIED
3864Stoicescu CornelBogdan Marinescusmart installer prefers i586 over core2 in repositoryMedium+1.4 M5VERIFIED
3635Stoicescu CornelHongxu Jia3sstate-cache-management script does not remove anythingMedium1.4 M5VERIFIED
3927Stoicescu CornelKai Kanglsb images starts with runlevel 5 even though it has no GUIMedium1.4 M5RESOLVED
3960Alexandru GeorgescuSaul WoldX fails to start on atom-pc imageMedium1.4 M5VERIFIED
3454Stoicescu CornelTom Zanussi2some builds invoke this warning: " /kernel/COPYING could not be copied "Medium1.4 M5VERIFIED
4006Stoicescu CornelAlexandru GeorgescuAdd test cases for appropriate 1.4 M1 featuresMedium1.4 M6VERIFIED
4007Stoicescu CornelAlexandru GeorgescuAdd test cases for appropriate 1.4 M2 featuresMedium1.4 M6VERIFIED
4026Stoicescu CornelAlexandru GeorgescuAdd test cases for appropriate 1.4 M3 featuresMedium1.4 M6VERIFIED
4027Stoicescu CornelAlexandru GeorgescuAdd test cases for appropriate 1.4 M4 featuresMedium1.4 M6VERIFIED
4028Stoicescu CornelAlexandru GeorgescuAdd test cases for appropriate 1.4 M5 featuresMedium1.4 M6VERIFIED
4029Stoicescu CornelAlexandru GeorgescuAdd test cases for appropriate 1.4 M6 featuresMedium1.4 M6VERIFIED
4030Stoicescu CornelAlexandru GeorgescuAdd test cases for appropriate 1.4 featuresMedium+1.4 M6VERIFIED
4094Alexandru GeorgescuBeth FlanaganADT-installer and toolchain builds are missing from the new AB builds.Medium+1.4 M6VERIFIED
4131Alexandru GeorgescuLaurentiu Palcuerror when installing the cross toolchainMedium+1.4 M6VERIFIED
3904Stoicescu CornelChen Qipsplash: splash screen does not go away when booting into runlevel 3Medium1.4 M6VERIFIED
4097Stoicescu CornelSaul Wold"login[423]: segfault" for minimal imageMedium+1.4 M6VERIFIED
4099Stoicescu CornelTom ZanussiCrosstap script check failsMedium1.4 M6VERIFIED
3882Alexandru GeorgescuScott Rifenbarkwayland feature should be well documentedMedium28 June 2013: VERIFIED AND FIXED1.4.1VERIFIED
4045Stoicescu CornelStoicescu Cornelsstate-cache-management.sh test case needs updateMedium1.5 M1VERIFIED
4004Alexandru GeorgescuHongxu Jia5cannot write to usb using File Manager on Atom-pcMedium1.5 M3VERIFIED
3539Alexandru GeorgescuJessica1Unwanted errors appear if the Yocto Project ADT isn’t configured in PreferencesMedium1.5.4RESOLVED
4009Alexandru GeorgescuJessica2Java error when creating a project with invalid titleMedium1.5.4RESOLVED
3946Alexandru PalalauNitin Kamble2[NUC] dmesg MUX INFO call failed errorMedium1.6RESOLVED
3591Alexandru GeorgescuDarren Hart[ATOM-PC] cannot boot after install - stops at grubUndecided---VERIFIED
3590Alexandru PalalauDarren Hart[Atom-PC]Return from standby failsUndecided---RESOLVED
3486Alexandru GeorgescuRichard Purdie"/scripts/cleanup-workdir" needs reviewUndecided[patch out for review]---VERIFIED
3389Stoicescu CornelRichard Purdiebitbake lib64-core-image-sato fails due to "nothing PROVIDES" errorsUndecided---VERIFIED
3491Andreea Brandusa ProcaSaul WoldError when building core-image-basic.Undecided---VERIFIED
    66    
Personal tools