Bug Triage

From Yocto Project
(Difference between revisions)
Jump to: navigation, search
(Old Milestone)
(Old Milestone)
Line 169: Line 169:
 
   |severity=!janitors
 
   |severity=!janitors
 
   |priority= !Undecided
 
   |priority= !Undecided
   |columns=id,summary,to,status,severity,priority,milestone, whiteboard
+
   |columns=id,summary,to,status,severity,priority,milestone,whiteboard
 
   |sort=milestone
 
   |sort=milestone
 
   |noresultsmessage="No matching bugs found."
 
   |noresultsmessage="No matching bugs found."

Revision as of 08:35, 28 July 2014

Contents

Goal

The output of the bug triage meeting should be that all bugs have an owner, a target milestone, and a priority.

Prior to the meeting, each Product Owner should review their Weekly New and High Bugs and be ready with any opens. An example open would be a bug that may need to change Products.

Roles

  • Call facilitator: Stephen K. Jolley
    • Ensure we keep to the agenda, don't rathole on bug resolution, and stay within our time block.

Agenda

  • Opens
    • Collect opens
    • Discuss opens
  • Review Queries
    • State number and owner
    • Owner makes any modifications
    • Assign owner, target milestone, and priority.

Note: for Minnowboard or MinnowBoard-MAX bugs go to: Minnow Bug Triage

Bug Criteria

  • Priority-Severity
    • High-Critical: Two Week
    • High: Milestone
    • Medium: Nice to have for milestone, must have for release

Bug Status Dashboards

Weekly - https://wiki.yoctoproject.org/charts/combo.html

Daily - https://wiki.yoctoproject.org/charts/daily/combo.html

Yocto Bug Triage Searches

Non-Prioritized Bugs

IDSummary (51 tasks) SeverityPMilestoneAssigneeStatusWhiteboardE
8336[internalsolv] Problem when upgrading a package which depends on a new package (old issue #32)minorUndecided1.0Alejandro del CastilloNEW
8337Make opkg translatable (old issue #42)enhancementUndecided---Alejandro del CastilloNEW
8338ManpagesenhancementUndecided---Alejandro del CastilloNEW
8339Manpages (old issue #56)enhancementUndecided1.0Alejandro del CastilloNEW
8340libopkg needs a better error reporting mechanism (old issue #63)enhancementUndecided0.4Alejandro del CastilloNEW
8342[internalsolv] Opkg fails to attempt all satisfying dependencies after installing the first one fails (old issue #85)minorUndecided0.4Alejandro del CastilloNEW
8343Downgrade to Prefer (old issue #111)enhancementUndecided0.4Alejandro del CastilloNEW
8344update-alternatives: Support change of link path during upgrade (old issue #113)normalUndecided0.4Alejandro del CastilloNEW
8345Install package(s) only after download of all needed packages. (old issue #116)enhancementUndecided0.4Alejandro del CastilloNEW
8346Check for package list update before downloading (old issue #117)enhancementUndecided1.0Alejandro del CastilloNEW
8347Review performance of algorithms using pkg_vec (old issue #120)enhancementUndecided1.0Alejandro del CastilloNEW
8349dist-upgrade feature (old issue #126)enhancementUndecided1.0Alejandro del CastilloNEW
8350Customisable uid/gid translation during installation (old issue #129)enhancementUndecided0.4Alejandro del CastilloNEW
8351double entries in the info file (old issue #142)normalUndecided0.4Alejandro del CastilloNEW
8352Needs a more detailed error message if an upgarde is not possible (old issue #143)normalUndecided0.4Alejandro del CastilloNEW
8353Add multiple compression algorithms support (old issue #148)enhancementUndecided0.4Alejandro del CastilloNEW
8355Not possible to build static opkg 0.3 (old issue #158)normalUndecided0.4Alejandro del CastilloNEW
8356Opkg flag always returns successminorUndecided0.4Alejandro del CastilloNEW
8357Add comman line option to skip package signature check (old issue #161)normalUndecided0.4Alejandro del CastilloNEW
8359[internalsolv] --force-removal-of-dependent-packages does not remove packages depending on the removed package (old issue #163)normalUndecided0.4Alejandro del CastilloNEW
8360[internalsolv] Packages fail to install when Recommends can't be installed (old issue #165)normalUndecided0.4Alejandro del CastilloNEW
8537Feature request: new libopkg APIenhancementUndecided0.4Alejandro del CastilloNEW
8564Deprecated OpenSSL signing supportnormalUndecided---Alejandro del CastilloNEW
8565Add global preinst/postinst hooks to opkgenhancementUndecided---Alejandro del CastilloNEW
8599when i use force downgrade option i have to give full ipk pathnormalUndecided---Alejandro del CastilloNEW
8912[internalsolv] opkg remove --autoremove' does not fully uninstall product.normalUndecided---Alejandro del CastilloNEW
8946opkg install does not appear to fail on file overwritemajorUndecided0.4Alejandro del CastilloNEW
8947opkg conffile resolution cannot detect unmodified conffiles modified in upgraded packagemajorUndecided---Alejandro del CastilloNEW
8948Implement *.md5sums (or equivalent)enhancementUndecided---Alejandro del CastilloNEW
9060If an install succeeds despite broken deps due to --force-depends, it still outputs a diagnostic that makes it look like it failednormalUndecided---Alejandro del CastilloNEW
9348Opkg requires root privileges for all operationsmajorUndecided---Alejandro del CastilloNEW
9658Detect postinst failing verses asking to be delayed?normalUndecided---Alejandro del CastilloNEW
9792[libsolv] globs don't work on opkg commandsnormalUndecided0.3.4Alejandro del CastilloNEW
9830Opkg's pre-depends not being honored appropriatelynormalUndecided---Alejandro del CastilloNEW
9920opkg-utils: disallow package names that are not all lower casenormalUndecided---Alejandro del CastilloNEW
9938[internalsolv] Upgrade of package with versioned Depends failsnormalUndecided---Alejandro del CastilloNEW
9939[libsolv] Recommends dependencies should upgrade during a package upgradenormalUndecided---Alejandro del CastilloNEW
9973When relative paths are not allowed in options show an appropriate error messagenormalUndecided---Alejandro del CastilloNEW
10243Opkg outputs misleading information when using --download-only optionminorUndecided---Alejandro del CastilloNEW
10277[internalsolv] Package install upgrades provider of virtual dependency incorrectlynormalUndecided---Alejandro del CastilloNEW
10407opkg sometimes returns non-zero exit code but prints nothing to stderrnormalUndecided0.3.4Alejandro del CastilloNEW
10461Uninstall leaks common directories if packages removed out-of-ordernormalUndecided---Alejandro del CastilloNEW
10648opkg status doesn't return additional package metadata like description or XB attributes for installed packagesnormalUndecided---Alejandro del CastilloNEW
10733image license not copied to rootfsnormalUndecided---Mark HatleNEW
10755AUTOREV: morty definition results in a RecursionError when setting PV=SRCPV as documentednormalUndecided2.3 M3Scott RifenbarkNEEDINFO02 Dec 2016: NEEDINFO1
10756patchwork: New patch revision messages should be processed even if they have a duplicated message-idnormalUndecided2.3 M3Jose LamegoNEW1
10757multiconfig MACHINE ignoredmajorUndecided---Richard PurdieNEW
10758rm_work causes subsequent image builds to failnormalUndecided---Ross BurtonNEW
10760devtool: fails to build project 'npm://registry.npmjs.org;name=statsd;version=0.8.0'normalUndecided---Paul EggletonNEW
10761Building Debugfs with nfs-utils-client and ipkgnormalUndecided---Ross BurtonNEW
10762patchwork: Enable automatic status update when patches are merged for all projectsnormalUndecided2.3 M1Jose LamegoACCEPTED1
 51       

Non-Targeted Bugs

Low bugs not included.

IDSummary (25 tasks) SeverityPMilestoneAssigneeStatusWhiteboardE
8337Make opkg translatable (old issue #42)enhancementUndecided---Alejandro del CastilloNEW
8338ManpagesenhancementUndecided---Alejandro del CastilloNEW
8564Deprecated OpenSSL signing supportnormalUndecided---Alejandro del CastilloNEW
8565Add global preinst/postinst hooks to opkgenhancementUndecided---Alejandro del CastilloNEW
8599when i use force downgrade option i have to give full ipk pathnormalUndecided---Alejandro del CastilloNEW
8912[internalsolv] opkg remove --autoremove' does not fully uninstall product.normalUndecided---Alejandro del CastilloNEW
8947opkg conffile resolution cannot detect unmodified conffiles modified in upgraded packagemajorUndecided---Alejandro del CastilloNEW
8948Implement *.md5sums (or equivalent)enhancementUndecided---Alejandro del CastilloNEW
9060If an install succeeds despite broken deps due to --force-depends, it still outputs a diagnostic that makes it look like it failednormalUndecided---Alejandro del CastilloNEW
9348Opkg requires root privileges for all operationsmajorUndecided---Alejandro del CastilloNEW
9658Detect postinst failing verses asking to be delayed?normalUndecided---Alejandro del CastilloNEW
9830Opkg's pre-depends not being honored appropriatelynormalUndecided---Alejandro del CastilloNEW
9920opkg-utils: disallow package names that are not all lower casenormalUndecided---Alejandro del CastilloNEW
9938[internalsolv] Upgrade of package with versioned Depends failsnormalUndecided---Alejandro del CastilloNEW
9939[libsolv] Recommends dependencies should upgrade during a package upgradenormalUndecided---Alejandro del CastilloNEW
9973When relative paths are not allowed in options show an appropriate error messagenormalUndecided---Alejandro del CastilloNEW
10243Opkg outputs misleading information when using --download-only optionminorUndecided---Alejandro del CastilloNEW
10277[internalsolv] Package install upgrades provider of virtual dependency incorrectlynormalUndecided---Alejandro del CastilloNEW
10461Uninstall leaks common directories if packages removed out-of-ordernormalUndecided---Alejandro del CastilloNEW
10648opkg status doesn't return additional package metadata like description or XB attributes for installed packagesnormalUndecided---Alejandro del CastilloNEW
10733image license not copied to rootfsnormalUndecided---Mark HatleNEW
10757multiconfig MACHINE ignoredmajorUndecided---Richard PurdieNEW
10758rm_work causes subsequent image builds to failnormalUndecided---Ross BurtonNEW
10760devtool: fails to build project 'npm://registry.npmjs.org;name=statsd;version=0.8.0'normalUndecided---Paul EggletonNEW
10761Building Debugfs with nfs-utils-client and ipkgnormalUndecided---Ross BurtonNEW
 25       

Unassigned Bugs

IDSummary (133 tasks) SeverityPMilestoneAssigneeStatusWhiteboardE
139Set default gcc instruction generation to TARGET_ARCH on targetenhancementMediumFutureUnassignedNEW5
256Sync up RPM version policy with rest of system (including support '~' in version strings)enhancementMediumFutureUnassignedNEWMoved from Laurentiu to Unassigned10
760[script] no options to use kernel nfs server as nfsrootenhancementLowFutureUnassignedNEWMoved from Laurentiu to Unassigned7
1550Enhance TARGET_VENDOR field supportenhancementLowFutureUnassignedNEWP33
1658depexp like features without XenhancementLowFutureUnassignedNEW
1789[Autobuilder] Optionally generate a HTML logenhancementMediumFutureUnassignedNEW2
1893Incremental deb image generationenhancementLowFutureUnassignedACCEPTED(pending)10
2025runqemu scripts should attempt sane defaults for unkown machinesminorLowFutureUnassignedNEW3
2086Rewrite bbvars.py to use bitbake to find variablesminorLowFutureUnassignedNEW
2087Address LTP and POSIX compliance testsminorLowFutureUnassignedNEW
2273Evaluate current image space settingsenhancementLowFutureUnassignedNEWMoved from Laurentiu to Unassigned4
2348Cleanup package.bbclass - runstrip and split_and_strip_files checksminorLowFutureUnassignedNEW
2413fri2: enable user input buttonminorLowFutureUnassignedNEWMoved from Kevin to Unassigned10
2421[Performance] Further improvements for turning off doc generation for -native (and similar) packagesenhancementLowFutureUnassignedNEW
2782screen hangs with ttyS0normalLowFutureUnassignedNEW
2951Review and remove unnecessary uses of _prepend/_appendminorLowFutureUnassignedNEW
3256Debugging tools and binaries need to be attached to target run timeminorLowFutureUnassignedNEW
3463Define PREEMPT_RT validation suiteenhancementMediumFutureUnassignedACCEPTED3
3763generate error if file in FILES is not foundenhancementLowFutureUnassignedNEW
3887Merge buildstats into build history and have one data collection mechanismenhancementMediumFutureUnassignedIN PROGRESS DESIGN
3976Support ~ in package versionsenhancementMediumFutureUnassignedNEWMoved from Laurentiu to Unassigned
4059init-install.sh assumes boot device is the same as the one selected when it is runnormalMediumFutureUnassignedNEW
4120rootfs_deb doesn't support BAD_RECOMMENDATIONSenhancementLowFutureUnassignedNEWIMAGEGEN10
4285tasks: Visualising relationships between tasksenhancementMediumFutureUnassignedACCEPTED10
4301recipes: Visualising brought in by relationships between recipesenhancementMediumFutureUnassignedACCEPTED5
4329Visualising dependency and recommends relationships between packagesenhancementMediumFutureUnassignedACCEPTED3
4330Visualising overall package sizeenhancementMediumFutureUnassignedACCEPTED3
4331Visualising single package sizeenhancementMediumFutureUnassignedACCEPTED5
4376Visualising directory structure of built imagesenhancementMediumFutureUnassignedACCEPTED5
4384Visualising build time informationenhancementMediumFutureUnassignedACCEPTED5
4399recipes: Visualising dependency relationships between recipesenhancementMediumFutureUnassignedACCEPTED5
4400Visualising brought in by relationships between packagesenhancementMediumFutureUnassignedACCEPTED5
4402Customise the summary of all the information available for one build + image recipe combinationenhancementMediumFutureUnassignedNEW10
4436Add ptest for glibcenhancementMediumFutureUnassignedNEWMoved from Laurentiu to Unassigned5
4437Add ptest for gccenhancementMediumFutureUnassignedNEWMoved from Laurentiu to Unassigned5
4479Easy way to see all individual builds for a buildenhancementMediumFutureUnassignedNEWWas Bill Randle
4516SPDX License Manifests for ImagesenhancementMediumFutureUnassignedACCEPTEDWas Bill Randle3
4517SPDX swabber.enhancementMediumFutureUnassignedACCEPTEDWas Bill Randle10
4525Use buildhistory to log key values and track regressionenhancementMediumFutureUnassignedNEW
4526Record image size from buildhistory to track regressionenhancementMediumFutureUnassignedNEW1.5
4578x32 ABI performance comparisonenhancementMediumFutureUnassignedNEW
4929Add support for pacman as package_pacman/xy.bbclassenhancementLowFutureUnassignedNEW
4976Add flag for package to signal reboot is required after installationenhancementLowFutureUnassignedACCEPTED
5005Ability to use rpmbuild to build packages (via the SDK)enhancementLowFutureUnassignedNEWMoved from Laurentiu to Unassigned
5033Way to audit all optional dependenciesenhancementLowFutureUnassignedACCEPTED10
5140list-packageconfig-flags.py: could not list skipped recipesnormalLowFutureUnassignedACCEPTED
5430Notification systemenhancementLowFutureUnassignedNEW
5483Extend Image creation to include workflow for security checkingenhancementMediumFutureUnassignedACCEPTED
5538Implement Backend API controller for buildbotenhancementMediumFutureUnassignedNEW
5605Add ptest for libavenhancementLowFutureUnassignedNEW
5695python: ptest cases failednormalLowFutureUnassignedNEWMoved from Laurentiu to Unassigned
5782Do not configure sftp for the ssh daemon by defaultminorLowFutureUnassignedIN PROGRESS DESIGNRoxanna is no longer at Intel
5785Make it possible to sync up configurations with defconfigenhancementLowFutureUnassignedNEW
5822No link from /builders to in-progress buildsnormalLowFutureUnassignedNEWWas Bill Randle1
5955Enhance PATCHTOOL = "git" to be able to pop off patch seriesenhancementMediumFutureUnassignedNEW
6234Implement model for project owner / userenhancementMediumFutureUnassignedNEW2
6282Use glob patterns/better builder namesenhancementMediumFutureUnassignedNEWWas Bill Randle7
6284Random package/image builder (fuzzy build)enhancementMediumFutureUnassignedNEW4
6370QA/oe-selftest: add test suite for recipe testingenhancementMediumFutureUnassignedNEW
6469Host system profiler tool.enhancementMediumFutureUnassignedNEWWas Bill Randle10
6498Latencytop -d does not work for qemuppc and qemuarmnormalLowFutureUnassignedWaitForUpstreamRoxanna is no longer at Intel
6541Enhancements to searchenhancementLowFutureUnassignedNEWGUI design pending
6573meta-toolchain-qte: Cannot be used to produce "Debug" and "Release" builds of Qt application outside Yocto buildsystemnormalLowFutureUnassignedNEW
6603Export / Import Toaster projectsenhancementMediumFutureUnassignedNEWGUI design pending
6604Clone a Toaster projectenhancementLowFutureUnassignedNEWGUI design pending
6640Customise BitBake and layer versions in a projectenhancementMediumFutureUnassignedNEWGUI design pending7
6649Ability to report locked sigs deltaenhancementMediumFutureUnassignedNEW5
6670all compatible recipes page should link to layer source recipe with the layer nameenhancementMediumFutureUnassignedNEW
6701Provide an option to select layers from different branches within a Toaster projectenhancementMediumFutureUnassignedNEWGUI design pending7
6706Include maintainers list for layersenhancementMediumFutureUnassignedNEW
6764License whitelistingenhancementMediumFutureUnassignedNEWWas Bill Randle3
6778Add "import layer" to layer suggestions drop downenhancementMediumFutureUnassignedNEWproject configuration page
6840Seeing builds delta in ToasterenhancementMediumFutureUnassignedNEWGUI design pending
6897Customise the Django admin interfaceenhancementMediumFutureUnassignedNEWGUI design pending
6898Design Toaster configuration interfaceenhancementMediumFutureUnassignedNEWGUI design pending
6900Toaster should tell you when one of your local.conf variables has been overridenenhancementMediumFutureUnassignedNEWGUI design pending
6915Toaster should handle ASSUME_PROVIDEDenhancementMediumFutureUnassignedNEWGUI design pending
6916Toaster should turn QA check names in warnings / errors into linksenhancementMediumFutureUnassignedNEWGUI design pending
6950bitbake errors must have unique ids to make them easily greppable in the sourceenhancementLowFutureUnassignedNEW
6953Branding SupportenhancementMediumFutureUnassignedNEW
6954Toaster Kernel Configuration ToolenhancementMediumFutureUnassignedNEW
6978For the local release in Toaster, show local path to layer directory instead of Git URLenhancementMediumFutureUnassignedNEWproject configuration page
6980Add support for generate Package Stagger ChartenhancementMediumFutureUnassignedNEWGUI design pending
7038For cached tasks, indicate in which URL the sstate object was foundenhancementMediumFutureUnassignedNEW
7110Builds of "world" are pretty ugly in toaster UIenhancementMediumFutureUnassignedNEWGUI design pending
7219Show the file size of the license manifest when available for download in the build dashboardenhancementLowFutureUnassignedNEWbuild dashboard page
7234warn the user if the project configuration settings aren't reflected in the buildenhancementMediumFutureUnassignedACCEPTEDGUI design pending10
7235warn the user about unexpected configuration changes in variable historyenhancementMediumFutureUnassignedNEWGUI design pending
7294For QA Issues errors and warnings, toaster should recognize the error and provide suggestions to the user on how the error can be repairedenhancementLowFutureUnassignedNEWGUI design pending
7355Strange outcome in Toaster 'covered' tasks queriesnormalMediumFutureUnassignedNEW
7457Split "Previous Build" tasksenhancementMediumFutureUnassignedNEW
7503Add support for MultiPath TCP for YP Linux images/specific imageenhancementMediumFutureUnassignedNEW
7521Redesign our filters mechanismenhancementMediumFutureUnassignedNEWGUI design pending
7527Integrate Toaster with JenkinsenhancementMediumFutureUnassignedNEW10
7693Convert Autobuilder docs to docbookenhancementMediumFutureUnassignedNEWWas Bill Randle5
7695Automated QA tests for the autobuilderenhancementMediumFutureUnassignedNEWWas Bill Randle5
7696Recipe GitPollerenhancementMediumFutureUnassignedNEWWas Bill Randle4
7698Update to next version of buildbotenhancementLowFutureUnassignedNEWWas Bill Randle6
7727toaster: show bbappend information for recipesenhancementMediumFutureUnassignedNEWGUI design pending4
7742Remove constraints when setting the layers checkout directoryenhancementMediumFutureUnassignedNEW
7748Provide a way to do a Toaster cleanup and start again if you get the initial set up wrongenhancementMediumFutureUnassignedNEW
7954pigz has resource race issuesnormalMediumFutureUnassignedNEW
7968empty page states for no information in the databasenormalLowFutureUnassignedNEWGUI design pending5
8008Expose branch mapping through the layer index UIenhancementMediumFutureUnassignedNEW
8036Request to allow people to set pagination to allenhancementLowFutureUnassignedNEW4.5
8123the aarch64 toolchain can not build iptables on i686 hostnormalLowFutureUnassignedNEW
8426Improve how we display layer dependenciesenhancementMediumFutureUnassignedNEWGUI design pending6
8482Support multi-nodes interoperability testingenhancementMediumFutureUnassignedNEW
8577Add a global UI widget to show progress of buildsenhancementLowFutureUnassignedNEWGUI design pending
8841COPY_LIC_DIRS should use beginline and endline from LIC_FILES_CHKSUMenhancementMediumFutureUnassignedNEWWas Bill Randle1
9018Extend existing AutoBuilder script to schedule buildsenhancementMediumFutureUnassignedACCEPTEDWas Bill Randle3
9153Enhance build performance dataenhancementMediumFutureUnassignedACCEPTEDGUI design pending4
9335[Autobuilder] Add support for display bitbake log errors in buildbot pageenhancementMediumFutureUnassignedIN PROGRESS DESIGNWas Bill Randle4
9532useradd / extrausers chain pseudo, causing stack overflows (segfaults) [s390]normalMediumFutureUnassignedNEW
9692QA check for #! interpreter should handle '/usr/bin/env something'normalMediumFutureUnassignedIN PROGRESS DESIGN5
9779remote profilingenhancementMediumFutureUnassignedNEW
9839The "clear search" button on the – "Add | Remove packages table" - does not clearnormalLowFutureUnassignedNEW
9891nasm should be a cross recipeenhancementLowFutureUnassignedNEW
9892v86d fails to build on arm64 hostenhancementLowFutureUnassignedIN PROGRESS REVIEW
9956report tool: create a DB layout for storing the resultsenhancementMediumFutureUnassignedNEW
9957report tool: create an input service that feed results to the DBenhancementMediumFutureUnassignedNEW
9958report tool: a web interface for viewing test resultsenhancementMediumFutureUnassignedNEWGUI design pending TRT
10034oe-selftest: Field to select a subset of tests in the autobuildersenhancementMediumFutureUnassignedNEW
10104Visual clue you've changed something for toastertablesenhancementLowFutureUnassignedIN PROGRESS REVIEWGUI design pending1
10253Better user display/access of PACKAGECONFIG options for recipesenhancementMediumFutureUnassignedNEW
10526Toaster: Add support for feed publishingenhancementMediumFutureUnassignedNEW
10570Create Automated Device Test ServiceenhancementLowFutureUnassignedNEW
10571create a Service Interface for the Automated Device Test ControllerenhancementLowFutureUnassignedNEW
10572create a DUT Management module for the Automated Device Test ControllerenhancementLowFutureUnassignedNEW
10573create a reporting module for the automated device test controllerenhancementLowFutureUnassignedNEW
10574create a task monitoring module for the automated device test controllerenhancementLowFutureUnassignedNEW
10575create a test queuing component for the automated device test controllerenhancementLowFutureUnassignedNEW
10576create a task scheduling module for the automated device test controllerenhancementLowFutureUnassignedNEW
 133       

New This Week

IDSummary (34 tasks) SeverityPMilestoneAssigneeStatusWhiteboardE
10762patchwork: Enable automatic status update when patches are merged for all projectsnormalUndecided2.3 M1Jose LamegoACCEPTED1
10742Update GStreamer to 1.10.1normalMedium+2.3 M1Jussi KukkonenIN PROGRESS REVIEW
10755AUTOREV: morty definition results in a RecursionError when setting PV=SRCPV as documentednormalUndecided2.3 M3Scott RifenbarkNEEDINFO02 Dec 2016: NEEDINFO1
10730bitbake -e shows no history with memresnormalMedium+2.3 M2Paul EggletonNEW
10731bitbake --observe-only doesn't work with memresnormalMedium+2.3 M2Paul EggletonNEW
10732File checksum changes do not trigger task re-execution with memresnormalMedium+2.3 M2Paul EggletonNEW
10733image license not copied to rootfsnormalUndecided---Mark HatleNEW
10734patchwork: fail tests should send email to submitter and mailing listnormalMedium+2.3 M2Jose LamegoNEW1
10735patchwork: patchtest email should reply to the original patchesnormalMedium+2.3 M2Jose LamegoNEW2
10736Clean up categoriesnormalMediumQ4Michael HalsteadNEW
10737binconfig-disabled should install non-broken files to packagesnormalMedium2.3Ross BurtonNEW
10738patchtest: Patches not sent as reply to their respective series/root message should trigger a warning messagenormalMedium2.3 M3Leonardo Sandoval GonzalezNEW1
10739patchwork: pw should not create new revisions from comments/replies containing patch-like contentnormalMedium2.3 M3Jose LamegoNEW2
10740Handle exceptions while populating data to transmit using xmlrpcnormalMedium+2.3 M1Sujith HNEW
10741memres: heartbeat and disk monitoring needs further testingnormalMedium+2.3 M3Richard PurdieNEW
10744Update test case of smartpm/createrepo under meta/lib/oeqa/runtimeenhancementMedium+2.3 M3Jose Perez CNEW
10745Add tests to verify the integrity of the compressed imagesenhancementMedium+2.3 M2Francisco PedrazaNEW
10746selftest: Create a build-set to give automated coverage report of oe-selftest suiteenhancementMediumFutureMonserratNEW
10747Add support for testing wic images on non x86 platformsenhancementMedium+2.3 M2Yi ZhaoNEW
10748Means of querying history for a single variableenhancementMedium+2.3 M2Richard PurdieNEW
10749Add a class to update package index automaticallyenhancementMedium+2.3 M2Ross BurtonNEW
10750add some useful host tools to crops/pokyenhancementMedium2.3Todor MinchevNEW
10751Add help on all oe scripts exported to the path and display it when no required arguments are specifiedenhancementMedium2.3 M2Ed BartoshNEW
10752Add test to verify help option in oe scripts and ensure it's displayed when no required arguments are specifiedenhancementMedium2.3 M3Jose Perez CNEW
10753QA Kernel-dev test cases basic functionalityenhancementMedium+2.3 M1Francisco PedrazaNEW5
10754QA Kernel-dev test cases for changing configurationenhancementMedium+2.3 M2Francisco PedrazaNEW5
10756patchwork: New patch revision messages should be processed even if they have a duplicated message-idnormalUndecided2.3 M3Jose LamegoNEW1
10757multiconfig MACHINE ignoredmajorUndecided---Richard PurdieNEW
10758rm_work causes subsequent image builds to failnormalUndecided---Ross BurtonNEW
10760devtool: fails to build project 'npm://registry.npmjs.org;name=statsd;version=0.8.0'normalUndecided---Paul EggletonNEW
10761Building Debugfs with nfs-utils-client and ipkgnormalUndecided---Ross BurtonNEW
10729devshell: Exception: TypeError: Can't convert 'bytes' object to str implicitlynormalMedium+2.3 M1Ross BurtonRESOLVED
10743build-perf-test: Add test to verify if parsing time is improved with a hot codeparser cacheenhancementMedium2.3Markus LehtonenRESOLVED
10759patchwork: post-receive git hook is not functionalnormalUndecided2.3 M1Jose LamegoRESOLVED1
 34      20

High Bugs

IDSummary (17 tasks) SeverityPMilestoneAssigneeStatusWhiteboardE
10706meta-gnome: epiphany: build failure, libwnck is too old (2.31), epiphany requires >= 3.0majorHigh2.1.3Armin KusterIN PROGRESS IMPLEMENTATION
9592Add a mechanism for creating build appliance as a container imageenhancementHigh2.3 M1brian averyNEW4
10394Creation of component to emulate keyboard with USB-KM232enhancementHigh2.3 M1Plauchu EdwinIN PROGRESS IMPLEMENTATION7
10352Performance of bitbake -S is horribleenhancementHigh2.3 M1Jianxun ZhangACCEPTED15
9727Add autobuilder support to publish sstate objects for releasesenhancementHigh2.3 M1Joshua LockIN PROGRESS IMPLEMENTATION3
10655Add support for ZephyrenhancementHigh2.3 M1Juro BystrickyACCEPTED3
5546Optimise away meta-oe X init mechanismenhancementHigh2.3 M1Jussi KukkonenIN PROGRESS IMPLEMENTATION2
9954report tool: a communication mechanism for sending resultsenhancementHigh2.3 M1Mariano LopezIN PROGRESS REVIEW4
9502Add a way to build container images using oe-coreenhancementHigh2.3 M1Randy WittIN PROGRESS DESIGN5
1560Enable recipe specific sysrootsenhancementHigh2.3 M1Richard PurdieIN PROGRESS IMPLEMENTATION5
10229New cluster publishes artefacts regardless of whether deploy_artifacts ChoiceString is setnormalHigh2.3 M1Stephano CetolaIN PROGRESS IMPLEMENTATION3
10612Don't perform git clone on shared volumenormalHigh2.3 M1Stephano CetolaIN PROGRESS IMPLEMENTATION2
10532Create Target file definition for Eclipse CROPS PluginenhancementHigh2.3 M1Tim OrlingIN PROGRESS REVIEW2
5470+bitbake-layers cannot be used with memory resident bitbake runningnormalHigh2.3 M2Aníbal LimónIN PROGRESS IMPLEMENTATION5
10596Enable tests of layers for compatibility (YP Compatible v2)enhancementHigh2.3 M2Aníbal LimónNEW
5866Reproducible builds: identical binariesenhancementHigh2.3 M2Juro BystrickyNEW5
10558Create Nexus instance (a java repository manager)enhancementHigh2.3 M2Michael HalsteadNEW
 17       

Medium+ Bugs !(Future,1.7)

IDSummary (98 tasks) SeverityPMilestoneAssigneeStatusWhiteboardE
10675Failed to build cvs and iptables with extensible sdk on Fedora 24 i686 in Yocto 2.1.2normalMedium+2.1.3Armin KusterIN PROGRESS DESIGN COMPLETE
10719Newly created recipe from the yocto-layer script fails to buildnormalMedium+2.3 M1Alejandro HernandezIN PROGRESS REVIEW
10338perl-native embeds host-dependent variables in sysrootnormalMedium+2.3 M1Aníbal LimónIN PROGRESS REVIEW0.3
10687oeqa: migrate sdk to use the new frameworknormalMedium+2.3 M1Aníbal LimónIN PROGRESS IMPLEMENTATION5
10426Kernel config warnings while building linux-yocto-4.8 for intel-corei7-64normalMedium+2.3 M1California SullivanIN PROGRESS REVIEW1
10611[Test Case 1059] Parselogs is failing on corei7-64 in Joule giving several error messages.normalMedium+2.3 M1California SullivanNEW1
10614[Test Case 204] intel-corei7-64 sato, lsb and wic images doesn't boot on Cherry Hill platformmajorMedium+2.3 M1California SullivanNEW1.5
10411Provide a working python-pylint recipemajorMedium+2.3 M1Daniela PlascenciaIN PROGRESS IMPLEMENTATION5
10721patchtest-oe: improve issue and fix strings for test_mbox_format testminorMedium+2.3 M1Daniela PlascenciaACCEPTED2
10488Changing Git revision in Toaster has no effectnormalMedium+2.3 M1David ReynaNEW3
10630Toaster: protect against circular Layer dependenciesnormalMedium+2.3 M1David ReynaIN PROGRESS REVIEW1
10631Fix missing close bracketnormalMedium+2.3 M1David ReynaIN PROGRESS REVIEW1
10441source-highlight-native world build failuresmajorMedium+2.3 M1Ed BartoshIN PROGRESS REVIEW3
10101When power cycling in masterimage.py, 'shutdown -h now' can return a non-zero exit status because the ssh connection is cutnormalMedium+2.3 M1Plauchu EdwinACCEPTED2
10670AUH: Upgrade status email should indicate the URL of the log folder instead of the tar's URLnormalMedium+2.3 M1Plauchu EdwinIN PROGRESS REVIEW
5319Need a test to verify firstboot postinst script ordernormalMedium+2.3 M1Francisco PedrazaIN PROGRESS REVIEW3
10594Ensure all options of WIC script are testednormalMedium+2.3 M1Jair GonzalezACCEPTED2
10671RMC: Compiling error with musl C librarynormalMedium+2.3 M1Jianxun ZhangIN PROGRESS REVIEW2
9942patchwork: ensure patches are not marked as Accepted when a newer Series revision is modifiednormalMedium+2.3 M1Jose LamegoACCEPTED2
10506Patchwork: Create new Build-test wizardnormalMedium+2.3 M1Jose LamegoIN PROGRESS DESIGN3
10718send-pull-request: Avoid creating duplicated email reference headersnormalMedium+2.3 M1Jose LamegoIN PROGRESS REVIEW0.5
10448Package files already existed at Publishing Artifacts stepmajorMedium+2.3 M1Joshua LockNEW2
10478run-postinsts doesn't update package manager database on target devicenormalMedium+2.3 M1Jussi KukkonenIN PROGRESS REVIEWBackport to YP 2.2.1 and 2.1.21
10635matchbox-window-manager: _NET_CURRENT_DESKTOP is not implemented correctlynormalMedium+2.3 M1Jussi KukkonenNEW0.5
10742Update GStreamer to 1.10.1normalMedium+2.3 M1Jussi KukkonenIN PROGRESS REVIEW
8525selftest needs to control distro configurationnormalMedium+2.3 M1Leonardo Sandoval GonzalezIN PROGRESS REVIEW1
10428*.qemuboot.conf files are left in DEPLOY_DIR after other image artifacts are removednormalMedium+2.3 M1Robert YangIN PROGRESS REVIEW2
10647core-image-minimal: do_testsdkext failedmajorMedium+2.3 M1Robert YangIN PROGRESS REVIEW2
10686oeqa: migrate runtime to use the new frameworknormalMedium+2.3 M1Mariano LopezIN PROGRESS DESIGN8
10433syslog-ng rc5.d symlinks missing after install, broken postinstnormalMedium+2.3 M1Markus LehtonenIN PROGRESS REVIEWNeed backport to 2.2.12
10508bitbake fetcher does not always check for trusted_networkmajorMedium+2.3 M1Markus LehtonenIN PROGRESS REVIEW3
8078useradd.bbclass: useradd_preinst not run when rebuilding on second MACHINEmajorMedium+2.3 M1Maxin B. JohnACCEPTED3
9620Update layer index to django 1.8 ltsnormalMedium+2.3 M1Michael HalsteadIN PROGRESS IMPLEMENTATION2
10376patchtest: deploy patchtest on servernormalMedium+2.3 M1Michael HalsteadNEW
10304QEMU doesnot support e6500 emulation for gobject-introspectionmajorMedium+2.3 M1Otavio SalvadorNEW
10668shell parser fails when using & for background processesnormalMedium+2.3 M1Patrick OhlyIN PROGRESS REVIEW2
9038extensible sdk - generates empty manifests/needs file with what is installednormalMedium+2.3 M1Paul EggletonNEW2
10369Performance degradation on eSDK, install time is twice on 2.1normalMedium+2.3 M1Paul EggletonIN PROGRESS IMPLEMENTATION1
10447eSDK: runqemu fails unless unless DEPLOY_DIR_IMAGE is setnormalMedium+2.3 M1Paul EggletonACCEPTED1
10168On-target binutils produces non-running code when linking with "-Wl,-z,nocopyreloc" on ARM or PPCnormalMedium+2.3 M1Khem RajNEW
10713Allow testimage to work with slirp in addition to working with tun/tapnormalMedium+2.3 M1Randy WittACCEPTED3
10651bitbake -g world is brokenmajorMedium+2.3 M1Richard PurdieIN PROGRESS REVIEW1
10676cooker: event queue overflowednormalMedium+2.3 M1Richard PurdieNEW
10047Piglit isn't in images (removed from tools-testapps)normalMedium+2.3 M1Ross BurtonIN PROGRESS REVIEW1
10271KeyError exception when pushing buildhistory failsnormalMedium+2.3 M1Ross BurtonNEW3
10423PKGSIZE double counts hard linked filesnormalMedium+2.3 M1Ross BurtonNEW1
10498adwaita install failed on autobuildernormalMedium+2.3 M1Ross BurtonNEW2
10597license_create_manifest fails when linux-dummy is used to create own kernelnormalMedium+2.3 M1Ross BurtonNEW2
9660Create a YP-2.3 test plan for SWUpdnormalMedium+2.3 M1Sonia DelgadoNEW3
10654Investigate binary component functionalitynormalMedium+2.3 M1Stephano CetolaIN PROGRESS IMPLEMENTATION5
10740Handle exceptions while populating data to transmit using xmlrpcnormalMedium+2.3 M1Sujith HNEW
10450Reduce fuzz factor when patching filesnormalMedium+2.3 M2Alexander KanavinIN PROGRESS DESIGNLET20
10491sysv init 'respawing too fast' on system startupnormalMedium+2.3 M2Aníbal LimónIN PROGRESS DESIGN1
10695sqlite: upstream performance problemnormalMedium+2.3 M2Jianxun ZhangNEW
10507Patchwork: Create Patchtest results viewnormalMedium+2.3 M2Jose LamegoACCEPTED3
10734patchwork: fail tests should send email to submitter and mailing listnormalMedium+2.3 M2Jose LamegoNEW1
10735patchwork: patchtest email should reply to the original patchesnormalMedium+2.3 M2Jose LamegoNEW2
10412Specifying milestone with a DISTRO_VERSION in format of MM.mm.pp will cause build to fail on GetDistroVersionnormalMedium+2.3 M2Joshua LockNEW1
10524Command line build monitoring broken when using custom builddir and config filemajorMedium+2.3 M2Joshua LockACCEPTED2
9867yocto-bsp: listing values for some properties throws exceptionnormalMedium+2.3 M2Leonardo Sandoval GonzalezACCEPTED2
10362yocto-bsp: several config fragments yield multiple warnings when building virtual/kernel'snormalMedium+2.3 M2Leonardo Sandoval GonzalezNEW1
10473Fail to launch custom qemu image with runqemunormalMedium+2.3 M2Leonardo Sandoval GonzalezNEW1
8570problems with gdk-pixbuf and pango loading on multilibnormalMedium+2.3 M2Robert YangNEW2
8879opkg-utils is built when build lib32-imagemajorMedium+2.3 M2Robert YangIN PROGRESS IMPLEMENTATION5
10519Can not run multiple QEMU machines under UNFSnormalMedium+2.3 M2Robert YangIN PROGRESS IMPLEMENTATION2
10694rpm does not detect file clashes on do_rootfsnormalMedium+2.3 M2Robert YangNEW
5049Create a WDD like charts for the Performance Test script that we are running regularlynormalMedium+2.3 M2Markus LehtonenIN PROGRESS DESIGNTRT5
10490Error on oeqa.runtime.rpm.RpmInstallRemoveTest when running testimagenormalMedium+2.3 M2Markus LehtonenACCEPTED2
10582Automated Git storage of build perf test resultsnormalMedium+2.3 M2Markus LehtonenACCEPTED3
10520[meta-swupd] unnecessary changes during updatesnormalMedium+2.3 M2Patrick OhlyACCEPTED2
10730bitbake -e shows no history with memresnormalMedium+2.3 M2Paul EggletonNEW
10731bitbake --observe-only doesn't work with memresnormalMedium+2.3 M2Paul EggletonNEW
10732File checksum changes do not trigger task re-execution with memresnormalMedium+2.3 M2Paul EggletonNEW
10113native reicpes does not include runtime dependencies when populating sysrootmajorMedium+2.3 M2Richard PurdieNEW3
10344multiconfig: TMPDIR not handled properlynormalMedium+2.3 M2Richard PurdieNEW5
10357multiconfig: error building meta-toolchainsnormalMedium+2.3 M2Richard PurdieNEW5
9104ffmpeg libraries are missing -dbg packagingnormalMedium+2.3 M2Ross BurtonNEW5
10165bitbake fails with "Please use a locale setting which supports utf-8"normalMedium+2.3 M2Ross BurtonNEW1
10449tar-native - task do_populate_sysroot_setscene fails - likely racemajorMedium+2.3 M2Ross BurtonNEW3
10629package brought in by runtime dependency of a complementary package does not have its own complementary package installednormalMedium+2.3 M2Ross BurtonNEW5
10700buildtools + deb packaging: Package nativesdk-buildtools-perl-dummy not foundnormalMedium+2.3 M2Ross BurtonNEW
10697x32 world build fails badlynormalMedium+2.3 M2Saul WoldNEW
10623removing hardlink removes xattrsnormalMedium+2.3 M2SeebsNEW
10402ACPI: No IRQ available for PCI Interrupt Link [LNKD]. Try pci=noacpi or acpi=offnormalMedium+2.3 M3Bruce AshfieldIN PROGRESS DESIGN COMPLETE
10716Patchwork must handle older release patch submissionsnormalMedium+2.3 M3Jose LamegoNEW2
10677\n in DESCRIPTION creates invalid (ipk) packagesnormalMedium+2.3 M3Leonardo Sandoval GonzalezNEW1
10456X can not launch on qemumips64normalMedium+2.3 M3Robert YangNEWNeed backport to 2.2.13
10471runqemu handling of machine not specified needs improvementminorMedium+2.3 M3Robert YangNEW3
10350devtool: deploy-target: deploy run time dependenciesnormalMedium+2.3 M3Paul EggletonNEWnodejs4
10741memres: heartbeat and disk monitoring needs further testingnormalMedium+2.3 M3Richard PurdieNEW
10698meta-intel doesn't support x32normalMedium+2.3 M3Saul WoldNEWNeed to further evaluate and possibly file more bugs5
9566devtool documentation is duplicated in dev and sdk manualsnormalMedium+2.3 M3Scott RifenbarkIN PROGRESS DESIGN4
10653Improve Node.js developer workflow.normalMedium+2.3 M3Stephen K JolleyNEW
10287gst-play is brokennormalMedium+2.3 M4Jussi KukkonenNEW
8578opkg-make-index skips some packages so the package index is not up to date during rootfs generationnormalMedium+2.3 M4Robert YangNEW5
9522Documentation isn't cachablenormalMedium+Q3Michael HalsteadACCEPTED
10643https://www.yoctoproject.org/tools-resources has wrong link for submitting patchesnormalMedium+Q4Jeff Osier-MixonACCEPTED
10495Broken images on mailman pagesnormalMedium+Q4Michael HalsteadNEW
 98       

Medium+ Enhancements by Owner !(Future,1.7)

IDSummary (155 tasks) SeverityPMilestoneAssigneeStatusWhiteboardE
 0       
Alexander Kanavin
9675Replacing/updating smartpm/createrepoenhancementMedium+2.3 M2Alexander KanavinNEW
 1       
Aníbal Limón
10231oeqa: Refactor code to avoid dependencies on bitbake datastoreenhancementMedium+2.3 M1Aníbal LimónIN PROGRESS IMPLEMENTATION4
10234oeqa: Implement QemuTestRunnerenhancementMedium+2.3 M1Aníbal LimónNEW5
10263oeqa: Refactor oetest moduleenhancementMedium+2.3 M1Aníbal LimónIN PROGRESS IMPLEMENTATION4
9678Include automated test execution and reporting in AutobuilderenhancementMedium+2.3 M2Aníbal LimónACCEPTED6
10232oeqa.utils: Audit/merge modules to avoid code duplicity and dependencies on bitbakeenhancementMedium+2.3 M2Aníbal LimónNEW4
10598AUH: make use of devtool upgrade (or at least share code)enhancementMedium+2.3 M3Aníbal LimónNEW
 6       
Benjamin Esquivel
9689Create a python library for automatic device testingenhancementMedium+2.3 M1Benjamin EsquivelIN PROGRESS IMPLEMENTATION
10569Integrate DevAuto USB multiplexer module to AFTenhancementMedium+2.3 M1Benjamin EsquivelIN PROGRESS IMPLEMENTATION4
10579create the devauto command line interfaceenhancementMedium+2.3 M1Benjamin EsquivelACCEPTED2
 3       
brian avery
10556Docker tooling support to manipulate CROPS containers from the Eclipse CROPS pluginenhancementMedium+2.3 M1brian averyNEW5
9588Create a method for describing builds and desired output. aka a build descriptorenhancementMedium+2.3 M2brian averyNEW5
9589Create a script for consuming a "build descriptor"enhancementMedium+2.3 M2brian averyNEW5
10541Use "new project template" framework to create sample Devtool projectenhancementMedium+2.3 M2brian averyNEW5
10543use CDT "new build system" to enable building for Make projectenhancementMedium+2.3 M2brian averyNEW2
10544use CDT "new build system" to enable building for CMake projectenhancementMedium+2.3 M2brian averyNEW2
10545use CDT "new build system" to enable building for Automake projectenhancementMedium+2.3 M2brian averyNEW5
10546use CDT "new build system" to enable building for Devtool projectenhancementMedium+2.3 M2brian averyNEW5
10548Eclipse CROPS plugin support for debugging via gdb to QEMUenhancementMedium+2.3 M3brian averyNEW4
10549Eclipse CROPS plugin support for debugging via gdb to hardware targetenhancementMedium+2.3 M3brian averyNEW3
 10       
California Sullivan
9878feature request: secure boot layerenhancementMedium+2.3 M2California SullivanNEW5
4389kernel: Remove "make scripts" requirement for module building from SDK/on targetenhancementMedium+2.3 M3California SullivanACCEPTED5
 2       
Daniela Plascencia
10112Patchtest-oe: tests summary must provide patch nameenhancementMedium+2.3 M1Daniela PlascenciaNEW5
 1       
David Reyna
9924Prevent users from using HEAD as Git revision when importing layersenhancementMedium+2.3 M1David ReynaNEW2
 1       
Ed Bartosh
10621make bmaptool a recommended tool for flashing imagesenhancementMedium+2.3 M2Ed BartoshACCEPTED5
10691buildhistory-diff should detect directory renamesenhancementMedium+2.3 M2Ed BartoshIN PROGRESS REVIEW2
 2       
Plauchu Edwin
10415devtool: add: override preferred kernel when a new one is addedenhancementMedium+2.3 M2Plauchu EdwinNEW1
10510devtool: add ability to export / import work in progressenhancementMedium+2.3 M2Plauchu EdwinNEW
10604Add an autobuilder worker capable of HW image testingenhancementMedium+2.3 M2Plauchu EdwinNEW
9732Send email notifications for automated testing result eventsenhancementMedium+2.3 M3Plauchu EdwinNEW5
 4       
Francisco Pedraza
10753QA Kernel-dev test cases basic functionalityenhancementMedium+2.3 M1Francisco PedrazaNEW5
6359Include QA tests for kernel-dev manual tasksenhancementMedium+2.3 M2Francisco PedrazaIN PROGRESS DESIGN5
9090extensible sdk test compatibility with sdkenhancementMedium+2.3 M2Francisco PedrazaIN PROGRESS IMPLEMENTATION5
10693Add a testcase for multilib eSDK on the autobuilderenhancementMedium+2.3 M2Francisco PedrazaNEW
10745Add tests to verify the integrity of the compressed imagesenhancementMedium+2.3 M2Francisco PedrazaNEW
10754QA Kernel-dev test cases for changing configurationenhancementMedium+2.3 M2Francisco PedrazaNEW5
 6       
Humberto Ibarra
4527create a Runtime performance test layer to enable runtime performance testsenhancementMedium+2.3 M1Humberto IbarraACCEPTED3
4528boot time should be tracked for systemd and SysVinitenhancementMedium+2.3 M1Humberto IbarraACCEPTED2
5369Create test plan to do performance analysis of x32 runtimeenhancementMedium+2.3 M1Humberto IbarraACCEPTED3
6296Add support for runtime performance tests to image_testsenhancementMedium+2.3 M1Humberto IbarraACCEPTED2
4144Runtime performance testingenhancementMedium+2.3 M2Humberto IbarraACCEPTED2
5477Check for any performance degradations with gcc security flags enabledenhancementMedium+2.3 M2Humberto IbarraACCEPTED2
5478test build time performance degradations with gcc security flags enabledenhancementMedium+2.3 M2Humberto IbarraACCEPTED2
 7       
Jair Gonzalez
10368bitbake event don't have unittestsenhancementMedium+2.3 M1Jair GonzalezIN PROGRESS DESIGN5
10618Increase oe-selftest coverage of wic codebaseenhancementMedium+2.3 M2Jair GonzalezACCEPTED3
10727selftest: create unit test for buildhistory_analysis.pyenhancementMedium+2.3 M3Jair GonzalezACCEPTED4
 3       
Jianxun Zhang
10086RMC: RMC Project - single library, single APIenhancementMedium+2.3 M1Jianxun ZhangIN PROGRESS REVIEW3
 1       
Jose Lamego
10625Don't show "Series without cover letter" for series without cover letterenhancementMedium+2.3 M1Jose LamegoIN PROGRESS REVIEW2
10627Way to navigate through patches in a seriesenhancementMedium+2.3 M1Jose LamegoACCEPTED3
8673distutils3 packages installed via an egg file cannot be imported by the python3 interpreterenhancementMedium+2.3 M2Jose LamegoACCEPTED2
8714Patchwork frontend page for incoming patch testingenhancementMedium+2.3 M2Jose LamegoIN PROGRESS DESIGN1
8715Update patchwork / build status page on patch test build completionenhancementMedium+2.3 M2Jose LamegoACCEPTED2
8716Build summary page for incoming patch testingenhancementMedium+2.3 M2Jose LamegoNEWGUI design pending4
10624Ability to set patch metadata from a mailenhancementMedium+2.3 M2Jose LamegoNEW
8717patchwork: keep build page up-to-date with important patch status changesenhancementMedium+2.3 M3Jose LamegoNEW2
10715Patchwork should change status when patches are pushed into mut (master under test) and again when they goto masterenhancementMedium+2.3 M3Jose LamegoNEW2
 9       
Jose Perez C
7376oe-selftest doesn't run lib/oe/tests/*enhancementMedium+2.3 M1Jose Perez CIN PROGRESS REVIEW3
8433Add test for package postinstsenhancementMedium+2.3 M1Jose Perez CIN PROGRESS IMPLEMENTATION4
10200Create Test Plan for Tinfoil verificationenhancementMedium+2.3 M2Jose Perez CACCEPTED10
10593Add support for testing wic images on all reference hardwareenhancementMedium+2.3 M2Jose Perez CIN PROGRESS REVIEW1
10724extend bitbake testing for YP-2.3enhancementMedium+2.3 M2Jose Perez CNEW3
10744Update test case of smartpm/createrepo under meta/lib/oeqa/runtimeenhancementMedium+2.3 M3Jose Perez CNEW
6862input subsystem testingenhancementMedium+2.4Jose Perez CNEW5
 7       
Joshua Lock
9596Build "minimal" extensible SDK installers instead of "full" onesenhancementMedium+2.3 M1Joshua LockIN PROGRESS IMPLEMENTATION0.5
10437Improve PublishArtifacts (remove hard-coded paths & assumptions)enhancementMedium+2.3 M1Joshua LockNEW2
10466Update BuildLog with build progressenhancementMedium+2.3 M1Joshua LockIN PROGRESS IMPLEMENTATION3
10467Link to BuildLog entries from autobuilder UIenhancementMedium+2.3 M1Joshua LockNEW2
10502Ensure BuildLogger doesn't try and update whilst the target wiki page is being editedenhancementMedium+2.3 M1Joshua LockIN PROGRESS DESIGN1
10678Drop usage/support of bb.data.expand() and replace with d.expand()enhancementMedium+2.3 M1Joshua LockNEW0.5
10679Drop unneeded expansion parameter to getVar and getVarFlagenhancementMedium+2.3 M1Joshua LockIN PROGRESS REVIEW0.5
8699offer a way to use sstate-object hashes as dependencies of builds/packagesenhancementMedium+2.3 M2Joshua LockACCEPTED4
9460Provide a way to automate testing of meta-mingw and meta-darwin layers.enhancementMedium+2.3 M2Joshua LockNEW5
9783Implement automated testing for meta-swupdenhancementMedium+2.3 M2Joshua LockNEW5
8548Document best practises/style guide for selftest tests and update testsenhancementMedium+2.3 M4Joshua LockNEW2
 11       
Juro Bystricky
10680multiconfig globbing supportenhancementMedium+2.3 M1Juro BystrickyIN PROGRESS DESIGN COMPLETE1
10646Support for Altera/Nios2enhancementMedium+2.3 M2Juro BystrickyACCEPTED5
10656Support for out-of-tree development of Zephyr imagesenhancementMedium+2.3 M2Juro BystrickyNEW1.5
10657Provide support for menuconfigenhancementMedium+2.3 M2Juro BystrickyNEW1.5
10658Support for IAMCU baremetal toolchain for Zephyr imagesenhancementMedium+2.3 M2Juro BystrickyACCEPTED1
10659Support for ARC baremetal toolchain for Zephyr imagesenhancementMedium+2.3 M2Juro BystrickyNEW1.5
10660Support for Nios2 baremetal toolchain for Zephyr imagesenhancementMedium+2.3 M2Juro BystrickyACCEPTED
10661Provide support to run Zephyr images in QEMUenhancementMedium+2.3 M2Juro BystrickyACCEPTED2
10662Provide "newlib" for Zephyr imagesenhancementMedium+2.3 M2Juro BystrickyNEW3
10681Support inter-multi-configuration dependenciesenhancementMedium+2.3 M2Juro BystrickyNEW5
 10       
Jussi Kukkonen
6707Add ptest for curlenhancementMedium+2.3 M3Jussi KukkonenNEW3
10636Improved image testingenhancementMedium+2.3 M3Jussi KukkonenNEW3
10690Improve wayland supportenhancementMedium+2.3 M3Jussi KukkonenNEW10
 3       
Leonardo Sandoval Gonzalez
10035oe-selftest: Use SSTATES without corrupting them.enhancementMedium+2.3 M1Leonardo Sandoval GonzalezNEW5
10059patchtest-oe: check bitbake datastore variables on classes or includesenhancementMedium+2.3 M1Leonardo Sandoval GonzalezACCEPTED2
8493Automate manual BSP test casesenhancementMedium+2.3 M2Leonardo Sandoval GonzalezNEW5
8962AUH: Add support for meta-intelenhancementMedium+2.3 M2Leonardo Sandoval GonzalezACCEPTED5
9708oe-selftest --list-tests with options to control fields shownenhancementMedium+2.3 M2Leonardo Sandoval GonzalezACCEPTED2
10477yocto-bsp: tool should output a conf file to be consume by the qemu runnerenhancementMedium+2.3 M2Leonardo Sandoval GonzalezNEW2
10626git-pw needs bundle supportenhancementMedium+2.3 M2Leonardo Sandoval GonzalezNEW3
8505Add Bluetooth testing suiteenhancementMedium+2.3 M3Leonardo Sandoval GonzalezNEW5
8506Add WiFi testing suiteenhancementMedium+2.3 M3Leonardo Sandoval GonzalezNEW5
8507Add NFC testing suiteenhancementMedium+2.3 M3Leonardo Sandoval GonzalezNEW5
10641Python manifest script should also generate native RPROVIDESenhancementMedium+2.3 M3Leonardo Sandoval GonzalezNEW2
10688Add a test looking for common paths that indicate patch is for the wrong layerenhancementMedium+2.3 M3Leonardo Sandoval GonzalezNEW2
10720patchtest: Create a script for OE-Core to fetch and set up environment for patchtestenhancementMedium+2.3 M3Leonardo Sandoval GonzalezNEW1
 13       
Robert Yang
7314Audit all recipes for proper CONFFILES assignmentenhancementMedium+2.3 M2Robert YangNEW5
9391refactor syslinux.bbclass, grub-efi.bbclass and gummiboot.bbclassenhancementMedium+2.3 M2Robert YangNEW5
10249runqemu: add test casesenhancementMedium+2.3 M2Robert YangNEW5
7600syslinux: port extX support patches to syslinux communityenhancementMedium+2.3 M4Robert YangIN PROGRESS IMPLEMENTATION5
 4       
Mariano Lopez
10235oeqa: Implement OETiemout decoratorenhancementMedium+2.3 M1Mariano LopezIN PROGRESS IMPLEMENTATION2
10236oeqa: Implement OETag decorator.enhancementMedium+2.3 M1Mariano LopezIN PROGRESS IMPLEMENTATION2
10317oeqa tests are incompatible with python's unittest runnerenhancementMedium+2.3 M1Mariano LopezIN PROGRESS DESIGN2
10353oeqa allow to filter tests based on different criteriaenhancementMedium+2.3 M1Mariano LopezIN PROGRESS IMPLEMENTATION3
8938oe-selftest: refactor command line arguments so usage is simplerenhancementMedium+2.3 M2Mariano LopezIN PROGRESS REVIEW3
10233oeqa: Runner add the ability to output XML test resultsenhancementMedium+2.3 M2Mariano LopezACCEPTED2
10599oeqa: migrate selftest's test to use the new frameworkenhancementMedium+2.3 M2Mariano LopezACCEPTED10
10689oeqa: migrate selftest old framework to new frameworkenhancementMedium+2.3 M2Mariano LopezNEW4
10033oe-selftest: parallelize runsenhancementMedium+2.3 M3Mariano LopezNEW10
10639report tool: cli script/tool for interacting with test dataenhancementMedium+2.3 M3Mariano LopezNEW4
 10       
Mark Hatle
9481Add example to "5.23. Debugging With the GNU Project Debugger (GDB) Remotely"enhancementMedium+2.3 M1Mark HatleIN PROGRESS REVIEW11 Oct 2016: IN PROGRESS REVIEW2
 1       
Markus Lehtonen
9338Support building optimised Python (with profile-opt make target)enhancementMedium+2.3 M1Markus LehtonenIN PROGRESS IMPLEMENTATION5
6319Automated storage and graphing of build performance metricsenhancementMedium+2.3 M2Markus LehtonenNEWTRT5
10590build-perf-test: suitable test report formatenhancementMedium+2.3 M2Markus LehtonenACCEPTED3
 3       
Michael Wood
9387Extensible SDK: add image customisation functionalityenhancementMedium+2.3 M1Michael WoodNEW5
 1       
Monserrat
9377Enable automated build performance testing in AutobuilderenhancementMedium+2.3 M1MonserratIN PROGRESS IMPLEMENTATION1
 1       
Patrick Ohly
10583buildstats.bbclass + pybootchart: record and render system utilization statisticsenhancementMedium+2.3 M1Patrick OhlyIN PROGRESS IMPLEMENTATION3
10701create overview of update mechanismsenhancementMedium+2.3 M1Patrick OhlyIN PROGRESS DESIGN COMPLETE0.5
9449[meta-swupd] Reduce runtime of do_swupd_updateenhancementMedium+2.3 M2Patrick OhlyACCEPTED5
 3       
Paul Eggleton
10505Extensible SDK: make it easier to track changes to the metadataenhancementMedium+2.3 M1Paul EggletonNEW2
10600Extensible SDK: add a more practical means of adding components at build timeenhancementMedium+2.3 M1Paul EggletonNEW1
6432Document an example SDK usage workflowenhancementMedium+2.3 M2Paul EggletonACCEPTED10 Oct 2016: Some thoughts about the solution2
6437Document how to set up the Yocto Project for production workenhancementMedium+2.3 M2Paul EggletonACCEPTED2
7683Provide means of turning a recipe change into a bbappendenhancementMedium+2.3 M2Paul EggletonNEW4
7555make oe-init-build-env-memres default instead of oe-init-build-envenhancementMedium+2.3 M3Paul EggletonNEW3
10513Show Yocto Project compatible status in the layer indexenhancementMedium+2.3 M3Paul EggletonNEW
 7       
Chen Qi
9894Investigate porting smartpm, createrepo to python3enhancementMedium+2.3 M2Chen QiACCEPTED1
 1       
Randy Witt
10454support the multiple containers working off 1 volume modelenhancementMedium+2.3 M1Randy WittNEW4
 1       
Randy MacLeod
10707Fix CVE defects in openssl by upgrading bugfix/letter releaseenhancementMedium+2.3 M2Randy MacLeodNEW
 1       
Richard Purdie
9037Consider alternate methods for maintain Yocto releases after 1yrenhancementMedium+2.3 M1Richard PurdieNEW1
10359Improve taskhash mismatch diagnosticsenhancementMedium+2.3 M1Richard PurdieNEW
6428Improve the ability to isolate changes that have caused a rebuildenhancementMedium+2.3 M2Richard PurdieNEW5
10429Add runtime dependencies for native "packages"enhancementMedium+2.3 M2Richard PurdieNEW5
10748Means of querying history for a single variableenhancementMedium+2.3 M2Richard PurdieNEW
9738[PATCH] fetcher: allow git+<protocol>: syntaxenhancementMedium+2.3 M3Richard PurdieNEW1
 6       
Ross Burton
6803Comprehensive large file supportenhancementMedium+2.3 M2Ross BurtonNEW5
9261Can't distinguish between delayed and failed postinstenhancementMedium+2.3 M2Ross BurtonNEW3
10215Add a class which allows buiding git upstream versions of code using BBCLASSEXTENDenhancementMedium+2.3 M2Ross BurtonIN PROGRESS IMPLEMENTATION4
10749Add a class to update package index automaticallyenhancementMedium+2.3 M2Ross BurtonNEW
 4       
Sonia Delgado
9132Toaster automated testing inclusion at the AutobuilderenhancementMedium+2.3 M2Sonia DelgadoACCEPTED5
 1       
Stephano Cetola
9342Vet subprocess callsenhancementMedium+2.3 M1Stephano CetolaIN PROGRESS REVIEW2
10663Create BSP binary package classenhancementMedium+2.3 M2Stephano CetolaNEW5
10664Test BSP binary package classenhancementMedium+2.3 M2Stephano CetolaNEW5
 3       
Stephen K Jolley
10230oeqa refactor and improvements (master bug)enhancementMedium+2.3 M2Stephen K JolleyNEW
10603Integrate the automated device testing to the AutobuilderenhancementMedium+2.3 M2Stephen K JolleyNEW
 2       
Tim Orling
10531Oomph installer script for Developer environment setupenhancementMedium+2.3 M1Tim OrlingIN PROGRESS DESIGN2
10533Enable Maven/Tycho Command line build for Eclipse CROPS pluginenhancementMedium+2.3 M1Tim OrlingIN PROGRESS IMPLEMENTATION1
10534Create docker container to run RCPTT for Eclipse CROPS pluginenhancementMedium+2.3 M1Tim OrlingIN PROGRESS IMPLEMENTATION5
 3       
Todor Minchev
8724Automate information collection for runtime errorsenhancementMedium+2.3 M2Todor MinchevNEW4
10092RMC: RMC Project - Provide dumpers for fingerprint and database fileenhancementMedium+2.3 M3Todor MinchevNEW5
 2       
Yi Zhao
10747Add support for testing wic images on non x86 platformsenhancementMedium+2.3 M2Yi ZhaoNEW
 1       

Medium Bugs by Owner !(Future,1.7)

IDSummary (392 tasks) SeverityPMilestoneAssigneeStatusWhiteboardE
 0       
Armin Kuster
9601meta-qt5 Krogoth Branch Building Error During 'do_qa_staging'normalMedium2.1.3Armin KusterNEW
10103systemd-reboot: systemd 2.29 takes 90s longer than it should on shutdown if a corefile is creatednormalMedium2.2Armin KusterNEW
 2       
Alejandro del Castillo
8165[libsolv] opkg_list_upgradable_cmd() does not work with an external solver enabled.normalMedium0.3.4Alejandro del CastilloNEW
8163opkg don't resume big upgrades (old issue #17)normalMedium1.0Alejandro del CastilloNEW
 2       
Alejandro Hernandez
8613udev-extraconf: automount does not work with systemd >= 219normalMedium1.8.3Alejandro HernandezIN PROGRESS REVIEWCheck 2.0 also
9759python-2.7.9-r1 do_install failing (meta-intel [minnowboard])criticalMedium1.8.3Alejandro HernandezNEW
5520poky-tiny enhancementsenhancementMedium2.3 M1Alejandro HernandezACCEPTEDOn Track for Initial Impl40
10332gummiboot: purge all gummiboot features and support from OEnormalMedium2.3 M2Alejandro HernandezIN PROGRESS REVIEW3
10425poky-tiny distro shows Kernel config warnings during qemux86 buildnormalMedium2.3 M2Alejandro HernandezACCEPTEDAdd release notes for 2.23
10314Installing Yocto on EFI systemsminorMedium2.3 M4Alejandro HernandezNEW3
 6       
Aníbal Limón
8667populate_sdk task fails when Debian packaging used in FIDOnormalMedium1.8.3Aníbal LimónACCEPTED3
9349Jethro build fails for core-image-x11 with package_debnormalMedium2.0.3Aníbal LimónIN PROGRESS DESIGN2
9700Add layer and bitbake information to error reportsenhancementMedium2.3Aníbal LimónNEWGUI design pending5
10672AUH log's tarball should have relative path starting at the timestampminorMedium2.3Aníbal LimónNEW
10683perl packages should be allarch in many casesenhancementMedium2.3Aníbal LimónACCEPTED2
10503Enable the capability to check the details of an image when is already bootedenhancementMedium2.3 M1Aníbal LimónNEW1
7557distrodata/distro_check should use BPNenhancementMedium2.3 M2Aníbal LimónNEW2
9080Autobuilder/oe-selftest: Have a way to specify a which oe-self tests get run on a forced AB jobnormalMedium2.3 M2Aníbal LimónNEW2
7494AUH: Parallelize running bitbake inside AUH scriptenhancementMedium2.3 M3Aníbal LimónNEW5
8735AUH: Use tinfoil instead of parse the recipe itselfenhancementMedium2.3 M3Aníbal LimónNEW5
9602AUH: Run automated tests on alternative C librariesenhancementMedium2.3 M3Aníbal LimónNEW2
 11       
Benjamin Esquivel
9921oe-selftest naming test guidelinesnormalMedium2.3Benjamin EsquivelNEW3
10512Create an automation module for a 2 to 1 USB MultiplexerenhancementMedium2.3 M2Benjamin EsquivelNEW3
 2       
Brendan Le Foll
9982npm.bbclass install function will package patches directorynormalMedium2.2Brendan Le FollNEW
10098npm fetcher is not documented in bitbake manualnormalMedium2.3 M4Brendan Le FollIN PROGRESS DESIGN29 Nov 2016: IN PROGRESS DESIGN3
 2       
brian avery
9617Create Toaster Docker production containernormalMedium2.3 M1brian averyIN PROGRESS DESIGN3
9992If we run oe-init-build-env with an argument for builddir, toaster start failsnormalMedium2.3 M1brian averyIN PROGRESS DESIGN1
10537Use "new project template" framework to create sample Make projectenhancementMedium2.3 M1brian averyNEW2
10538Use "new project template" framework to create sample Automake projectenhancementMedium2.3 M1brian averyNEW4
10540Use "new project template" framework to create sample CMake projectenhancementMedium2.3 M1brian averyNEW2
10609The TestLandingPage browser test is failing.normalMedium2.3 M1brian averyNEW
10536Use "new project template" framework to create sample projectsenhancementMedium2.3 M2brian averyNEW
10542use CDT "new build system" to enable building for the various supported Project typesenhancementMedium2.3 M2brian averyNEW
10547Eclipse CROPS plugin support for debugging via gdbenhancementMedium2.3 M3brian averyNEW
10552Devtool add from existing Eclipse project within the Eclipse CROPS pluginenhancementMedium2.3 M3brian averyNEW5
10557Replace Eclipse Poky plugin with Eclipse CROPS pluginenhancementMedium2.3 M4brian averyNEW
10551Full Devtool Support in Eclipse CROPSenhancementMedium2.4brian averyNEW
10553Context sensitive recipe syntax support within the Eclipse CROPS pluginenhancementMedium2.4brian averyNEW
10554Devtool modify from existing recipe into a new Eclipse project within the Eclipse CROPS pluginenhancementMedium2.4brian averyNEW
10555Devtool upgrade from existing recipe into an Eclipse project within the Eclipse CROPS pluginenhancementMedium2.4brian averyNEW
 15       
Bruce Ashfield
9656NFS boot failed due No working init found kernel panic on qemunormalMedium1.8.3Bruce AshfieldACCEPTED
9854Kernel hangs on LTP cgroup testsnormalMedium2.2Bruce AshfieldACCEPTED
7646KBUILD_DEFCONFIG does not work if config file is created as a result of patch to be appliednormalMedium2.3 M1Bruce AshfieldIN PROGRESS IMPLEMENTATION3
8743configme --allnoconfig breaks defconfig generated with kconfig / make savedefconfignormalMedium2.3 M1Bruce AshfieldIN PROGRESS REVIEW1
96094.1.x: musb fails to compilenormalMedium2.3 M1Bruce AshfieldWaitForUpstream
9813Strange kernel image for qemumips and qemumips64 in deploy directorynormalMedium2.3 M1Bruce AshfieldACCEPTED1
6630linux-yocto: kernel-dev package does not include target arch scripts binariesenhancementMedium2.3 M2Bruce AshfieldIN PROGRESS IMPLEMENTATION3
9069perf: missing python modules for scripts in 'perf report'normalMedium2.3 M2Bruce AshfieldIN PROGRESS REVIEW3
6022kernel-dev: How do I know which features are available for KERNEL_FEATURES ?enhancementMedium2.3 M3Bruce AshfieldIN PROGRESS DESIGN COMPLETE2
9125arm64 dmesg test fails show dmi Firmware registration failednormalMedium2.3 M3Bruce AshfieldACCEPTED2
 10       
California Sullivan
10110parselogs/intel-core-i7-64 on cherryhill /irq stat interface fatal error/failed to enable keyboardnormalMedium2.3California SullivanACCEPTED1.5
10628Parselogs: Failed to obtain handles for "Service Changed" characteristicnormalMedium2.3California SullivanNEW0.75
9267test_parselogs (oeqa.runtime.parselogs.ParseLogsTest) failed on NUC 6i5SYH, firmware load for i915/skl_guc_ver4.bin failednormalMedium2.3 M1California SullivanIN PROGRESS DESIGN3
10608[Test Case 1059] dmesg log shows various error on NUC with image corei7normalMedium2.3 M1California SullivanNEW1.29
10640Parselog: dmi: Firmware registration failed.normalMedium2.3 M1California SullivanNEW0.5
7096Document how to use initramfs featuresenhancementMedium2.3 M2California SullivanNEEDINFONIR 11/20, 11/27 - 03 Nov 2016: IN PROGRESS REVIEW2
9525Make install prompt available on all consolesenhancementMedium2.3 M2California SullivanACCEPTED4
 7       
Daniela Plascencia
9308patchtest: improve signal handling when the process is interruptedenhancementMedium2.3 M2Daniela PlascenciaACCEPTED1
9944patchtest-oe: check that patch was sent to the correct mailing listenhancementMedium2.3 M2Daniela PlascenciaNEW
9979patchtest: provide a command line argument to list the discovered test casesenhancementMedium2.3 M3Daniela PlascenciaNEW3
 3       
David Reyna
8190The 'set in file' filters in the BitBake variables table seem to return the wrong informationnormalMedium2.3 M1David ReynaIN PROGRESS REVIEW6
9494Custom images created from the build history pages fail to buildnormalMedium2.3 M1David ReynaIN PROGRESS IMPLEMENTATION5
10632Add distro selection supportenhancementMedium2.3 M1David ReynaNEW2
10650Import non-git layer directory path input validation is incorrectnormalMedium2.3 M1David ReynaIN PROGRESS IMPLEMENTATION1
8126Messages are missing when "IMAGE_FSTYPES" field is not properly editednormalMedium2.3 M2David ReynaACCEPTED2
9743builds: The search result of the content of the builds table is incorrectnormalMedium2.3 M2David ReynaNEW4
7502Show image information if rootfs files are generatednormalMedium2.3 M3David ReynaNEW4
9530Arrows in directory structure do not expand directoriesnormalMedium2.3 M3David ReynaNEW2
9630Show tasks currently running as part of progress bar updateenhancementMedium2.3 M3David ReynaACCEPTEDGUI design pending5
9916Show git clone progress in most recent builds areaenhancementMedium2.3 M3David ReynaNEW6
9971Toaster does not report progress while setscene tasks are runningnormalMedium2.3 M3David ReynaACCEPTED5
 11       
David Lopez Barriba
8497Continuous Toaster exploratory testingenhancementMedium2.3 M1David Lopez BarribaNEW1
9808Create selenium tests for project dashboard pagenormalMedium2.3 M2David Lopez BarribaNEW
 2       
dengke
5157LSB perl tests: op/stat.t 167 unreported No resultnormalMedium2.3dengkeACCEPTED0.1
8740LTP and LSB NG casesnormalMedium2.3dengkeIN PROGRESS REVIEW3
8832pTest - bash tests fail for 2.1_M1.rc1normalMedium2.3dengkeNEW1
9042pTest - strace fails on NUC 5425WYK for YP 2.1_M2.rc1normalMedium2.3dengkeACCEPTED3
5158LSB printing tests: 11 failures for 'Printing Tests'normalMedium2.3 M2dengkeWaitForUpstream0.1
5697busybox: ptest cases failednormalMedium2.3 M2dengkeWaitForUpstream0.1
5698bash: ptest cases failednormalMedium2.3 M2dengkeACCEPTED2
 7       
 
10241Missing files in rootfs when adding links /bin ->/usr/bin and /lib -> /usr/lib in recipe base-filesenhancementMedium2.3 NEEDINFONIR 11/271
 1       
Ed Bartosh
10619Refactor wic codebaseenhancementMedium2.3Ed BartoshACCEPTEDLET10
8719Ensure bootable images can be supported by wic for all reference BSPsenhancementMedium2.3 M1Ed BartoshIN PROGRESS IMPLEMENTATIONLET10
10751Add help on all oe scripts exported to the path and display it when no required arguments are specifiedenhancementMedium2.3 M2Ed BartoshNEW
 3       
Plauchu Edwin
10414devtool: deploy-target: support deploying kernelenhancementMedium2.3Plauchu EdwinNEW4
10416Extensible SDK: provide easy means of reconfiguring the kernelenhancementMedium2.3Plauchu EdwinNEW5
10440Create a reference HW design and a python controlling library for a single power control unitnormalMedium2.3 M1Plauchu EdwinIN PROGRESS REVIEW3
7909RRS: Track patches and Upstream-Status informationenhancementMedium2.3 M2Plauchu EdwinNEW5
8133RRS should handle upstream repositories without version tagsenhancementMedium2.3 M2Plauchu EdwinIN PROGRESS DESIGNGUI design available2
8400rrs: add the cause of an unknown recipe versionenhancementMedium2.3 M2Plauchu EdwinNEW3
8943RRS: Add a function hook that would process upstream and recipe versionsenhancementMedium2.3 M2Plauchu EdwinNEW2
9081RRS should respect DEFAULT_PREFERENCE when multiple versions of the same recipe are availablenormalMedium2.3 M2Plauchu EdwinIN PROGRESS DESIGN2
10580attach an html results page at the Autobulider's testing jobsenhancementMedium2.3 M2Plauchu EdwinNEW
7724useradd.bbclass users cannot be safely referred to by dependent recipes due to sstate-induced race with base-passwdmajorMedium2.3 M3Plauchu EdwinACCEPTEDTC needed7
8650RRS: track ptest-enabled and potentially ptest-enabled statusenhancementMedium2.3 M3Plauchu EdwinACCEPTEDGUI design available3
 11       
Francisco Pedraza
8502Store BSPs Firmware and HW info for BSP test casesenhancementMedium2.3 M2Francisco PedrazaACCEPTED5
8504Identify and add if needed BSP test cases specific to meta-intelenhancementMedium2.3 M2Francisco PedrazaACCEPTED5
9369Extensible SDK: oe-selftest test does not test that update actually worksnormalMedium2.3 M2Francisco PedrazaNEW4
10063testimage: Add tests for apt/dpkg like smart/rpm onesenhancementMedium2.3 M2Francisco PedrazaACCEPTED5
10725Add test for BBPOSTCONF and BBPRECONF on bitbakeenhancementMedium2.3 M2Francisco PedrazaNEW3
10728Create Test Plan to verify functionallity of the combo-layer scriptenhancementMedium2.3 M2Francisco PedrazaNEW
 6       
Joshua Rogers
8087eglibc patch bugnormalMedium2.3Joshua RogersNEEDINFO2
 1       
Hongxu Jia
6153Archiver causes manifest warnings for the toolchainnormalMedium2.2 M4Hongxu JiaNEW2
10308rpm installs bad signature package with option --nodigest --nosignature failednormalMedium2.2 M4Hongxu JiaNEW
6420Detect and error when required packages are not producedenhancementMedium2.3Hongxu JiaNEW5
7018archiver missing tasks between do_unpack and do_patchnormalMedium2.3Hongxu JiaIN PROGRESS REVIEW3
7149rpm: print which pkgname for warningenhancementMedium2.3Hongxu JiaNEW5
8446fix .pyc/.pyo buildpaths issueenhancementMedium2.3Hongxu JiaNEW5
10487readline examples should go in -doc packagenormalMedium2.3Hongxu JiaNEW
 7       
Humberto Ibarra
6926Create yocto-bsp testsuiteenhancementMedium2.3 M2Humberto IbarraACCEPTED15
9133Eclipse plugin testing integrate into ABenhancementMedium2.3 M2Humberto IbarraACCEPTED5
10714Need to document workaround for NullPointer in Eclipse MarsnormalMedium2.3 M2Humberto IbarraIN PROGRESS REVIEW29 Nov 2016: IN PROGRESS REVIEW1
 3       
Ismo Puustinen
10704add OSTree to update mechanism overviewenhancementMedium2.3 M2Ismo PuustinenNEW
 1       
Jair Gonzalez
10481[Test Case 1059] Parselogs is failing on genericx86 (32 and 64 bits) WIC giving error: GPT: Use GNU Parted to correct GPT errors.normalMedium2.3 M1Jair GonzalezIN PROGRESS REVIEW1
10147Create a tool to compare the automated test list against the Testopia Test list DBenhancementMedium2.3 M2Jair GonzalezACCEPTED4
10489"test_1_logrotate_setup" fails on second run of test image due existing filesenhancementMedium2.3 M2Jair GonzalezACCEPTED1
10607Creation of unit test suite for DevAuto package and its sub packagesnormalMedium2.3 M2Jair GonzalezACCEPTED3
10726Add a test to verify if oe-pkgdata-util print help when no parameters specifiedenhancementMedium2.3 M2Jair GonzalezACCEPTED2
8455Add tests to empty imageminorMedium2.3 M3Jair GonzalezACCEPTED3
9724Create a YP 2.2 test plan for package upgradesnormalMedium2.3 M3Jair GonzalezACCEPTED5
10050oeqa runner generate wrong test results in log file when running dynamic test casesenhancementMedium2.3 M3Jair GonzalezACCEPTED3
10089RMC: Test Case DevelopmentnormalMedium2.3 M3Jair GonzalezACCEPTED5
 9       
Jianxun Zhang
10073wic: generic bootloader-agnostic EFI pluginenhancementMedium2.3 M1Jianxun ZhangNEW5
10084RMC: Deploy central database file without dependency on EFI bootloaderenhancementMedium2.3 M2Jianxun ZhangNEW5
 2       
Jose Lamego
7823Convert Eclipse projects to Yocto recipes with devtoolenhancementMedium2.3Jose LamegoIN PROGRESS DESIGNGUI design available1
8873Create an appropriate Yocto Project Workspace from an existing Eclipse projectenhancementMedium2.3Jose LamegoNEW5
8874Create a new Yocto recipe from an existing Eclipse project using devtoolenhancementMedium2.3Jose LamegoNEW5
6618Make the layer name searchable and show item page when search returns only one resultenhancementMedium2.3 M2Jose LamegoNEW2
8727fetcher: should not log errors but pass them for handlingenhancementMedium2.3 M2Jose LamegoNEW2
10739patchwork: pw should not create new revisions from comments/replies containing patch-like contentnormalMedium2.3 M3Jose LamegoNEW2
 6       
Jose Perez C
9903Add more test cases for Systemd-bootenhancementMedium2.3 M1Jose Perez CIN PROGRESS REVIEW2
7526add test for checking if fontcache is created inside an imageenhancementMedium2.3 M2Jose Perez CNEW1
8332Add a broken recipe for testing purposesenhancementMedium2.3 M2Jose Perez CNEW2
9070Add test that locales are workingenhancementMedium2.3 M2Jose Perez CNEW3
9085Build QA Warnings: add a test for unlisted dependenciesnormalMedium2.3 M2Jose Perez CNEW2
9787create selftest for useradd-staticidsenhancementMedium2.3 M3Jose Perez CNEW4
9949oe-selftest needs to verify bberror etcenhancementMedium2.3 M3Jose Perez CNEW4
10318a tool to consolidate testopia's database with the test listenhancementMedium2.3 M3Jose Perez CNEW5
10752Add test to verify help option in oe scripts and ensure it's displayed when no required arguments are specifiedenhancementMedium2.3 M3Jose Perez CNEW
 9       
Joshua Lock
7040Support for /usr merge (à la systemd and Fedora)enhancementMedium2.3Joshua LockIN PROGRESS DESIGN5
8760Autobuilder additional task log availabilityenhancementMedium2.3Joshua LockNEW2
9115Added packages filter seems to show the wrong package listnormalMedium2.3Joshua LockACCEPTED4
9224[meta-swupd] Try to speed up update generation by parallelising calls to swupd_* programs where possibleenhancementMedium2.3Joshua LockNEW3
9322[meta-swupd] Improve the algorithm for determining previous versionenhancementMedium2.3Joshua LockNEW1.5
9539Resolve string formatting issues in busyboxnormalMedium2.3Joshua LockNEW3
9540Resolve string formatting issues in console-toolsnormalMedium2.3Joshua LockNEW1.5
9541Resolve string formatting issues in cmakenormalMedium2.3Joshua LockNEW2
9542Resolve string formatting issues in expectnormalMedium2.3Joshua LockNEW1.5
9543Resolve string formatting issues in gccnormalMedium2.3Joshua LockNEW4
9544Resolve string formatting issues in gettextnormalMedium2.3Joshua LockNEW1.5
9545Resolve string formatting issues in kexec-toolsnormalMedium2.3Joshua LockNEW1.5
9725add docstrings to functions in lib/bb/utils.py that are used in meta- files.normalMedium2.3Joshua LockACCEPTED1
9790Design a solution for using a package manager to develop and transitioning to swupd for productionnormalMedium2.3Joshua LockNEW5
9917autobuilder: Add ability to get worker informationnormalMedium2.3Joshua LockNEW1
9948"-fstack-protector-strong" seems unnecessary in SECURITY_LDFLAGSnormalMedium2.3Joshua LockIN PROGRESS REVIEW0.5
9981Make Autobuilder workers get hostname dynamicallyenhancementMedium2.3Joshua LockNEW2
10382master - nightly-mips-lsb failednormalMedium2.3Joshua LockNEW5
10475Document correct usage of FuncFailedenhancementMedium2.3Joshua LockNEW1
10476Unify exception handling in core/classesenhancementMedium2.3Joshua LockNEW3
9187[meta-swupd] implement generic versions of the update helper scripts in oe-swupd-helpersnormalMedium2.3 M2Joshua LockNEW3
9188[meta-swupd] Remove hard-coded paths from swupd-clientnormalMedium2.3 M2Joshua LockWaitForUpstream1
9511Provide support for swupd manifest includesenhancementMedium2.3 M2Joshua LockNEW5
9612functions used in recipes and recipe examples (like bb.utils.contains) not documented.normalMedium2.3 M2Joshua LockACCEPTEDWaiting on 9725 (7/8/16)5
9858Make xattrs in images work [meta]enhancementMedium2.3 M3Joshua LockACCEPTED5
9859setcap doesn't worknormalMedium2.3 M3Joshua LockNEW5
 26       
Juro Bystricky
6278runqemu without /etc/resolv.confenhancementMedium2.3Juro BystrickyNEW3
8074Graphic display using Virtual Box differs from VMwarenormalMedium2.3Juro BystrickyIN PROGRESS REVIEW1
9442Please add virtio console to qemux86-64.confenhancementMedium2.3Juro BystrickyIN PROGRESS DESIGN2
 3       
Jussi Kukkonen
10644Libnss uses deprecated function readdir_r()normalMedium2.1.3Jussi KukkonenNEW
6077piglit depends on libx11enhancementMedium2.3Jussi KukkonenACCEPTED2
6378libfakekey patch to allow shift-ed version of symbol not already in keymapnormalMedium2.3Jussi KukkonenNEW1
7054Need remote profiler (sysprof or eclipse?)normalMedium2.3Jussi KukkonenACCEPTED2
8586multilib build includes 32bit connman without good reasonnormalMedium2.3Jussi KukkonenIN PROGRESS REVIEW1
9350As a developer, I want a global variable exist for choosing the default SSL/TLS provider.enhancementMedium2.3Jussi KukkonenNEW4
9527Design support for a stateless OSenhancementMedium2.3Jussi KukkonenNEW
10025Missing 'Connection Manager' icon for qemumips and qemumips64normalMedium2.3Jussi KukkonenNEW4
10266Add ptest for gnutlsenhancementMedium2.3Jussi KukkonenNEW2
10288mesa and wayland: mesa master now requires native wayland-scanner in order to buildnormalMedium2.3Jussi KukkonenIN PROGRESS REVIEW0.5
10486libintl*.so should be in gettext-runtime when using muslnormalMedium2.3Jussi KukkonenNEW
 11       
Christopher Larson
6372Feature request: recipe hook for source tree preparationenhancementMedium2.4Christopher LarsonNEW
7670Proposal: make TOPDIR or BUILDDIR available to the devshellenhancementMedium2.4Christopher LarsonIN PROGRESS REVIEW
7958Implement shallow git clone functionalityenhancementMedium2.4Christopher LarsonIN PROGRESS REVIEW2
 3       
Kristian Amlie
10712Have wic split the rootfs filesystem and distribute specified subdirectories to different partitionsenhancementMedium2.3 M2Kristian AmlieNEW3
 1       
Leonardo Sandoval Gonzalez
10674The patch file is not applied to linux-yocto by yocto-kernel add patch command in 2.1.2 rc1normalMedium2.1.3Leonardo Sandoval GonzalezNEW1
8192python3.4.3 os.fork and os.waitpid (prelink related)minorMedium2.3Leonardo Sandoval GonzalezNEW15
10667Define packagegroup for python3enhancementMedium2.3Leonardo Sandoval GonzalezNEW
10078patchtest-oe: check patch authorenhancementMedium2.3 M1Leonardo Sandoval GonzalezNEW1
6128Incorrect wildcard unpack behaviour in fetchernormalMedium2.3 M2Leonardo Sandoval GonzalezACCEPTED2
6129Local directories unpack to a different location than local filesnormalMedium2.3 M2Leonardo Sandoval GonzalezACCEPTED2
8676devtool: extend oe-selftest testing for devtool upgradeenhancementMedium2.3 M2Leonardo Sandoval GonzalezACCEPTED2
8919Code coverage: add ability to create coverage-based test exclusion reportsenhancementMedium2.3 M2Leonardo Sandoval GonzalezNEW5
8921Code coverage: add ability to create missing 'coverage area' reportsenhancementMedium2.3 M2Leonardo Sandoval GonzalezNEW5
9927yocto-bsp: listing properties stdout and data send to -o option should be the samenormalMedium2.3 M2Leonardo Sandoval GonzalezNEW2
9928yocto-bsp: logical if statements should be avoided in json return by list subcommandnormalMedium2.3 M2Leonardo Sandoval GonzalezNEW2
9945patchtest-oe: check pull request series against git repositoryenhancementMedium2.3 M2Leonardo Sandoval GonzalezNEW4
9946patchtest: must be able to test the series on every branch specified on mbox summaryenhancementMedium2.3 M2Leonardo Sandoval GonzalezNEW5
9960patchtest-oe: implement 'selftest' validation patches for the test suiteenhancementMedium2.3 M2Leonardo Sandoval GonzalezNEW3
9998packaging: src separately from dbgenhancementMedium2.3 M2Leonardo Sandoval GonzalezNEW5
10058patchtest-oe: check SUMMARY presence on new recipesenhancementMedium2.3 M2Leonardo Sandoval GonzalezIN PROGRESS IMPLEMENTATION1
10254esdk tests take very longnormalMedium2.3 M2Leonardo Sandoval GonzalezNEW2
10522python: test.regrtest failsnormalMedium2.3 M2Leonardo Sandoval GonzalezACCEPTED3
5399Analyze Sharing PR server between builders with different metadataenhancementMedium2.3 M3Leonardo Sandoval GonzalezNEW1
8156lib/bb/fetch2/svn.py should support latest_versionstring()enhancementMedium2.3 M3Leonardo Sandoval GonzalezNEW1
8730separate code generating python manifest file from manifest information and improve the manifest generationenhancementMedium2.3 M3Leonardo Sandoval GonzalezNEW4
9563yocto-kernel script should use argparse instead of optparse libraryenhancementMedium2.3 M3Leonardo Sandoval GonzalezACCEPTED5
9564yocto-layer script should use argparse instead of optparse libraryenhancementMedium2.3 M3Leonardo Sandoval GonzalezACCEPTED5
9635buildhistory-diff script should use argparse instead of optparse libraryenhancementMedium2.3 M3Leonardo Sandoval GonzalezACCEPTED5
9636wic script should use argparse instead of optparse libraryenhancementMedium2.3 M3Leonardo Sandoval GonzalezACCEPTED5
9693oeqa/selftest/recipetool: runCmd's output is populated with previous outputminorMedium2.3 M3Leonardo Sandoval GonzalezACCEPTED2
10564Fix PR Sharing PR server between builders with different metadataenhancementMedium2.3 M3Leonardo Sandoval GonzalezNEW5
10738patchtest: Patches not sent as reply to their respective series/root message should trigger a warning messagenormalMedium2.3 M3Leonardo Sandoval GonzalezNEW1
10224oeqa/utils/sshcontrol.py:SSHProcess decode stdout data failnormalMedium2.3 M4Leonardo Sandoval GonzalezNEW2
 29       
Robert Yang
5389bitbake/lib/bb/fetch2: filename too longnormalMedium2.3Robert YangIN PROGRESS IMPLEMENTATION4
8967Need a way to cleanup DEPENDS and RDEPENDSenhancementMedium2.3Robert YangNEW5
9055pTest - acl (NUC) failed tested on NUC 5425WYK for YP 2.1_M2.rc1normalMedium2.3Robert YangACCEPTED2
9404Smart will remove RECOMMENDS during a remove commandnormalMedium2.3Robert YangNEW3
9423devshell: export CONFIGUREOPTS to envenhancementMedium2.3Robert YangNEW5
7459Implement the use of host USB devices on Linux for qemu machinesenhancementMedium2.3 M2Robert YangNEW3
7887Add support for user networking to runqemuenhancementMedium2.3 M2Robert YangIN PROGRESS REVIEW3
10193bitbake: improve --dump-signatures=SIGNATURE_HANDLERenhancementMedium2.3 M2Robert YangNEW5
10457ppp: 4.8 kernel fix breaks builds with older external toolchainsnormalMedium2.3 M2Robert YangNEW4
10474Reduce runqemu's default loglevelnormalMedium2.3 M2Robert YangNEW3
10710make it be able to login as root by default when debug-tweaks is not setenhancementMedium2.3 M2Robert YangIN PROGRESS REVIEW1
10194bitbake-whatchanged is brokennormalMedium2.3 M3Robert YangNEW5
7984RPM backend does not honor package overrides for PACKAGE_ARCHnormalMedium2.3 M4Robert YangNEW5
 13       
 
10669apt package missing systemd filesnormalMedium2.3 M1 IN PROGRESS REVIEW2
 1       
Ming Liu
9233As a developer, I want initramfs bundled kernel could be installed into rootfsnormalMedium2.2Ming LiuIN PROGRESS REVIEW
10312Failed to execute child process "oe-gnome-terminal-phonehome" (No such file or directory)normalMedium2.2 M4Ming LiuIN PROGRESS REVIEW
 2       
Mariano Lopez
10342Lots of debug noise "while parsing exportTests"minorMedium2.3 M1Mariano LopezACCEPTED2
9468Export Tests execution (Runexport.py) execution log needs improvementsenhancementMedium2.3 M2Mariano LopezNEW3
9770oe-selftest: test import of tests from other layersenhancementMedium2.3 M2Mariano LopezIN PROGRESS REVIEW2
9930o-selftest: add a coverage subcommand to handle coverage related tasksenhancementMedium2.3 M2Mariano LopezNEW5
9294Error Reporting Tool: Add a 'solutions' relationship to the error entriesenhancementMedium2.3 M3Mariano LopezACCEPTEDGUI design pending3
9848testimage/testexport: support permissions and attributes for package installationenhancementMedium2.3 M3Mariano LopezIN PROGRESS DESIGN3
10703add mender.io to update mechanism overviewenhancementMedium2.3 M3Mariano LopezNEW
 7       
Mark Hatle
9208createrepo fails to correctly update the repodata, image generation then failsnormalMedium2.2Mark HatleNEW
8582Error message not in log filenormalMedium2.3Mark HatleNEW2
 2       
Markus Lehtonen
9782Add support for parallel gzip to package creationenhancementMedium2.3Markus LehtonenNEW4
10622buildstats: use JSON formatenhancementMedium2.3Markus LehtonenNEW3
 2       
Maxin B. John
8471ptest - some valgrind ptests fail on 2.0.rc1normalMedium2.3Maxin B. JohnACCEPTED2
 1       
Michael Wood
9586document and verify production setup for jenkins ci interactionnormalMedium2.3Michael WoodNEW1
9651Error report web: Optimize searching timesenhancementMedium2.3Michael WoodNEW3
9915Show all layer revisions supported by Toaster, not just the ones compatible with the projectenhancementMedium2.3Michael WoodNEWGUI design pending
10220The toaster-custom-images comes up as "Unidentified layer" in the build history pagesnormalMedium2.3Michael WoodIN PROGRESS REVIEW4
8051Importing layer fails silently if the layer name already existsnormalMedium2.3 M1Michael WoodIN PROGRESS REVIEW2
9519Consolidate used API into it's own viewenhancementMedium2.3 M1Michael WoodIN PROGRESS IMPLEMENTATION10
10581Provide example production settings filenormalMedium2.3 M1Michael WoodIN PROGRESS REVIEW1
 7       
Michael Halstead
9821create a configuration for a deployable autobuilder clusterenhancementMedium2.2Michael HalsteadNEW5
9997oe-selftest: make available unittest-xml-reporting at the autobuilder workersnormalMedium2.3 M2Michael HalsteadNEW1
10708Need to add a notice so that meta-openembedded defects are not added to YP BZenhancementMediumQ4Michael HalsteadNEW
10736Clean up categoriesnormalMediumQ4Michael HalsteadNEW
 4       
Otavio Salvador
8092Implementation of the function glXChooseFBConfig in the libGL.so does not match OpenGL documentationnormalMedium2.0.3Otavio SalvadorWaitForUpstream
10525Chromium 52 segfaults on i.MX6 duallitenormalMedium2.3Otavio SalvadorNEW
 2       
Patrick Ohly
10584rm_work.bbclass: reduce maximum amount of disk space required for a buildenhancementMedium2.3Patrick OhlyIN PROGRESS DESIGN3
9189[meta-swupd] Creates a lot of duplicate filesenhancementMedium2.3 M1Patrick OhlyACCEPTED1
10665swupd + tar extraction errors + IMAnormalMedium2.3 M1Patrick OhlyIN PROGRESS REVIEW0.5
10666pack-from-0-*.tar lacks symlinksnormalMedium2.3 M1Patrick OhlyIN PROGRESS REVIEW0.5
10702add meta-swupd to update mechanism overviewenhancementMedium2.3 M1Patrick OhlyACCEPTED1
 5       
Paul Eggleton
5057Conflict when building SDK for image containing dropbear and openssh-sftp-servernormalMedium2.3Paul EggletonACCEPTEDRelease Note4
6626Add an example for debugging software with the corresponding -dbg packagenormalMedium2.3Paul EggletonNEW1
6661devtool: add ability to submit changes for reviewenhancementMedium2.3Paul EggletonNEWLET10
7336buildhistory-diff reports recipe-wide changes per-subpackageenhancementMedium2.3Paul EggletonNEW1
7637devtool: add: interactive recipe creationenhancementMedium2.3Paul EggletonNEW5
7852bitbake-layers layerindex-fetch doesn't respect branch (-b|--branch) optionnormalMedium2.3Paul EggletonIN PROGRESS DESIGN1
8325devtool modify could handle patch failure more usefullyenhancementMedium2.3Paul EggletonNEW3
8840Failure to build 32 bit eSDK on a 64 bit hostenhancementMedium2.3Paul EggletonNEW4
8909Mention standard fetcher options also in fetcher seaction (not only in SRC_URI in the glossary)enhancementMedium2.3Paul EggletonNEW2
9220buildhistory should track native recipesenhancementMedium2.3Paul EggletonNEW2
9360devtool: update-recipe ignores SRC_URI_appendnormalMedium2.3Paul EggletonNEW4
9479Extensible SDK breaks if python-dependent items added to TOOLCHAIN_HOST_TASKnormalMedium2.3Paul EggletonNEW2
9627devtool seems to mangle incorrectly the .bb file, when modifying the set of patches for a componentnormalMedium2.3Paul EggletonNEW4
9638devtool changes the format of the SRC_URI unnecessarilynormalMedium2.3Paul EggletonNEW1
9879Enable search for recipes that inherit a specific classenhancementMedium2.3Paul EggletonIN PROGRESS REVIEW1
9974Extensible SDK: reparse occurs on first devtool useminorMedium2.3Paul EggletonNEW3
9993uninative loader: no error on checksum failure for file:// urlsnormalMedium2.3Paul EggletonNEW1
10237bitbake -c cleanall on npm fetched recipe will prevent fetching other versions of the same packagenormalMedium2.3Paul EggletonNEW2
10322better way to grab layers and get them automatically batched by generating a bash script on the fly to do the tedious partsenhancementMedium2.3Paul EggletonNEW2
10417devtool: modify: look at optimising kernel rebuildsenhancementMedium2.3Paul EggletonNEW3
10418devtool: look at devshell integrationenhancementMedium2.3Paul EggletonNEW2
10515devtool: if npm module version not specified, use latestenhancementMedium2.3Paul EggletonNEW
10516devtool: display progress during npm addenhancementMedium2.3Paul EggletonNEW
10699Ensure consistency in repository URLsenhancementMedium2.3Paul EggletonNEW
7588devtool: improve devtool build outputenhancementMedium2.3 M1Paul EggletonNEEDINFONIR 11/275
8223bbwarn warnings during do_rootfs printed twiceminorMedium2.3 M1Paul EggletonIN PROGRESS IMPLEMENTATION1
9753Document automatic layer priority calculationenhancementMedium2.3 M1Paul EggletonACCEPTED1
10177Two openembedded-core entries when searching for recipesnormalMedium2.3 M1Paul EggletonIN PROGRESS REVIEW1
 28       
Beth 'pidge' Flanagan
10184Autobuilder fails when PARALLEL_MAKE ?= "-j ${@oe.utils.cpu_count()}"normalMedium2.2Beth 'pidge' FlanaganACCEPTED
4183Reference material for how a user creates a build that meets GPL obligations given a reference BSP, standard rootfs/kernel...etc.enhancementMedium2.2 M4Beth 'pidge' FlanaganNEW2
 2       
Chen Qi
4339psplash doesn't work with systemdnormalMedium2.3Chen QiNEWRelease Note 1.44
5427Extend and tidy up layer sanity checkingenhancementMedium2.3Chen QiIN PROGRESS REVIEW5
6016CrossTap has issues on running scheduler script against qemuppcnormalMedium2.3Chen QiNEW5
6700systemd's resolved conflicts with connmanenhancementMedium2.3Chen QiACCEPTED2
8831pTest - busybox tests fail for 2.1_M1.rc1normalMedium2.3Chen QiACCEPTED2
6132Have persistent log data (/var/log)enhancementMedium2.3 M1Chen QiIN PROGRESS REVIEW21 Nov 2016: Posed a comment to help documentation part.4
6660Compare sstate packages within SDK publishing toolenhancementMedium2.3 M1Chen QiACCEPTED4
7800systemd.bbclass doesn't check for services in systemd/user/ directoryenhancementMedium2.3 M1Chen QiIN PROGRESS IMPLEMENTATION3
8314warn when ALTERNATIVE_PRIORITY are the sameenhancementMedium2.3 M1Chen QiACCEPTED5
10250qemumips64 + systemd + pam results in login failurenormalMedium2.3 M1Chen QiIN PROGRESS REVIEW2
4420No init scripts in core-image-sato with systemd if 'sysvinit' is not in DISTRO_FEATURESenhancementMedium2.3 M2Chen QiIN PROGRESS IMPLEMENTATION2
7710devtool: deploy-target: interact with target packaging where availableenhancementMedium2.3 M2Chen QiIN PROGRESS DESIGN5
9372Ptest for acl hang because of lack of two user bin and daemoncriticalMedium2.3 M2Chen QiACCEPTED3
 13       
Khem Raj
9417Bring clang/llvm compiler infrastructure to OE-CoreenhancementMedium2.2Khem RajACCEPTED
 1       
Randy Witt
9503Add a way to add docker metadata to container imagesenhancementMedium2.3 M1Randy WittNEW3
10530add dumbinit as entry point for crops containersenhancementMedium2.3 M1Randy WittNEW
10452allow the samba container to host multiple volumesenhancementMedium2.3 M2Randy WittNEW2
8789extensible SDK: command disable devtool subcommands based on capabilitiesenhancementMedium2.4Randy WittNEW2
8928extensible SDK - add a way to prepare the sdk for offline usageenhancementMedium2.4Randy WittNEW3
 5       
Richard Purdie
4143Support real-time logging when using bitbake interactivelyenhancementMedium2.3Richard PurdieNEW5
5395Nativesdk postinstalls directory issues.normalMedium2.3Richard PurdieNEW5
7298packagegroups are not rebuilt when rdependency pkg name changesnormalMedium2.3Richard PurdieNEW5
7846devshell cannot be kept open across rebuildsenhancementMedium2.3Richard PurdieNEW1
7877Depending on the error found, inconsistent line reported.normalMedium2.3Richard PurdieNEW3
7879Depending on the name of a recipe, the build succeeds or fails.normalMedium2.3Richard PurdieNEW3
7960Feature Request: to enable poky to support building multilib native commandsenhancementMedium2.3Richard PurdieNEW5
8161Can't use "\" characters in SRC_URI entries - not even escapednormalMedium2.3Richard PurdieNEW2
8173Wrong dynamic loader because of missing -mfloat-abi=hard in LDFLAGS (in scons)normalMedium2.3Richard PurdieNEW2
8779update-alternatives.bbclass automatic renaming doesn't happen in sysrootsnormalMedium2.3Richard PurdieNEW
8805Detect and warn people naming functions something_remove_somethingnormalMedium2.3Richard PurdieNEW1
8828pTest - lttng-tools tests fail for 2.1_M1.rc1normalMedium2.3Richard PurdieNEW3
9061git fetcher inconsistency for working with PREMIRRORS.normalMedium2.3Richard PurdieNEW5
9272BBCLASSEXTEND="cross" overrides do_install()normalMedium2.3Richard PurdieNEW1
9279Issue with PREFERRED_PROVIDER interaction with overridesnormalMedium2.3Richard PurdieNEW1
9762Add support for poisoning of variablesenhancementMedium2.3Richard PurdieNEW3
9888uninative cannot find tarball when using "own-mirrors" and BB_NO_NETWORKnormalMedium2.3Richard PurdieNEW1
10061Ctrl+C during BB_HASHCHECK_FUNCTION execution does not interrupt processing nicelyminorMedium2.3Richard PurdieNEW3
10096Allow PREFERRED_VERSION miss to be fatalenhancementMedium2.3Richard PurdieNEW1
10682multiconfig sstate optimisationsenhancementMedium2.3Richard PurdieNEW
10684Distributed build supportenhancementMedium2.3Richard PurdieNEW
10076Docs should have pointer to latest manual at the topnormalMedium2.3 M2Richard PurdieNEEDINFONIR 11/27 - 08 Nov 2016: NEEDINFO3
 22       
Ross Burton
3276PulseAudio isn't testedenhancementMedium2.3Ross BurtonNEEDINFO3
3488Enable Mesa's llvmpipe?enhancementMedium2.3Ross BurtonACCEPTED2
5322Global DNS fallback mechanism not present in poky distroenhancementMedium2.3Ross BurtonACCEPTED3
6142we need general documentation on Systemd vs SysV related issuesenhancementMedium2.3Ross BurtonACCEPTED1
7010systemd-serialgetty cannot create a serial-getty@.service that is not enablednormalMedium2.3Ross BurtonNEWBackport to 1.7.31
7136Packaging non-versioned libraries is non-trivialnormalMedium2.3Ross BurtonNEW1
8064ptest fails tracker bugnormalMedium2.3Ross BurtonNEW1
8302sstate_create_package fails to chmod filenormalMedium2.3Ross BurtonNEW1
8430inaccurate 'du' usage in Image::_get_rootfs_sizeenhancementMedium2.3Ross BurtonACCEPTED1
8454archiver.bbclass does not create subfolder per licensenormalMedium2.3Ross BurtonNEW1
8593The head files of ncurses installing into sysroot seems different in multiple times compilationnormalMedium2.3Ross BurtonNEW2
8688busybox syslog not update-alternatives awarenormalMedium2.3Ross BurtonNEW2
9110Move some oe-pkgdata-util logic into lib/oeenhancementMedium2.3Ross BurtonNEW2
9119ptest fails tracker bug (Cont.)normalMedium2.3Ross BurtonNEW1
9171Consider limiting the scope of depchains to runtime depsnormalMedium2.3Ross BurtonNEW5
9207Need to fix prelink to iterate mulitlibsnormalMedium2.3Ross BurtonNEW4
9213Enable thumb for ARM buildsnormalMedium2.3Ross BurtonNEW1
9259The rpm database costs lots of disk space after install a packagenormalMedium2.3Ross BurtonNEW3
9424systemd tmpfiles.d warnings (volatile, resolv.conf)minorMedium2.3Ross BurtonNEW1
9883curl-native: invalid builtin ca-bundle path when restoring from sstatenormalMedium2.3Ross BurtonNEW1
10130Excessive warnings for incorrectly formatted LICENSEminorMedium2.3Ross BurtonNEW1
10133uninative tarball should contain layer manifestenhancementMedium2.3Ross BurtonACCEPTED2
10300libunwind fails to build with ld-is-goldnormalMedium2.3Ross BurtonNEW2
10737binconfig-disabled should install non-broken files to packagesnormalMedium2.3Ross BurtonNEW
7142cmake.bbclass fails when rebuilding after MACHINE changesnormalMedium2.3 M2Ross BurtonNEEDINFONIF 11/13, 11/20, 11/273
8200Add acl to default DISTRO_FEATURES?enhancementMedium2.3 M2Ross BurtonNEW1
9880Support locale archivesenhancementMedium2.3 M2Ross BurtonNEW5
 27       
Rudolf J Streif
8732Branch Support for BuildhistoryenhancementMedium2.3Rudolf J StreifNEW2
 1       
Saul Wold
9531Need a proper way to fix mismatched arch generated with bare-bone kernel recipenormalMedium2.3Saul WoldNEW
10325license.bbclass should only copy licenses for packages actually installedenhancementMedium2.3Saul WoldNEW3
9451Document a cookbook procedure on how to change kernel versionnormalMedium2.3 M4Saul WoldNEEDINFONIR 11/27 - Waits until after meta-intel release completed2
 3       
Seebs
8447Host contamination in glibc-localesnormalMedium2.3SeebsACCEPTED1
 1       
Sonia Delgado
9484Port QA UI tests to Toaster's Django+Selenium frameworknormalMedium2.3 M2Sonia DelgadoNEW25
 1       
Scott Rifenbark
10323Sample script to create source release for specific licences failsnormalMedium2.3 M1Scott RifenbarkIN PROGRESS REVIEW26 Sept 2016: IN PROGRESS REVIEW1
10405[bitbake] Missing SRC_URI "path_spec" option for SVN fetchernormalMedium2.3 M1Scott RifenbarkIN PROGRESS DESIGN10 Oct 2016: IN PROGRESS DESIGN3
8596Document proper way of adding a userspace header for the kernelenhancementMedium2.3 M2Scott RifenbarkNEW1
8631Fully document sysroot populationenhancementMedium2.3 M2Scott RifenbarkIN PROGRESS DESIGN22 Sept 2016: IN PROGRESS DESIGN3
9001bootimg.bbclass does not ducument GRUB boot lodader supportnormalMedium2.3 M2Scott RifenbarkACCEPTED27 Jan 2016: NEEDINFO2
9962Suggested additions to the --help output re. -v and -DenhancementMedium2.3 M2Scott RifenbarkNEW1
10095Suggested documentation for the currently undocumented *_task-foo override syntaxnormalMedium2.3 M2Scott RifenbarkIN PROGRESS REVIEW08 August 2016: IN PROGRESS REVIEW1
10692Add references to SYSROOT_DIRSenhancementMedium2.3 M2Scott RifenbarkIN PROGRESS REVIEW18 Nov 2016: IN PROGRESS REVIEW1
10717KERNEL_IMAGE_BASE_NAME: morty definition does not match poky's codenormalMedium2.3 M2Scott RifenbarkIN PROGRESS REVIEW29 July 2016: IN PROGRESS REVIEW1
 9       
Stephano Cetola
9789systemd rootfs-postprocess command should check staticidsnormalMedium2.3Stephano CetolaACCEPTED2
10383create test for subprocess calls to identify problemsenhancementMedium2.3 M1Stephano CetolaACCEPTED1
 2       
Sujith H
10343Toaster fails to to build with image customization in non git layer for local releasenormalMedium2.3Sujith HACCEPTED
10387Toaster when run with non git layers fails to add packages that are built separately into new custom imagenormalMedium2.3 M1Sujith HIN PROGRESS REVIEW
 2       
Tim Orling
7819Support multi-image debuggingenhancementMedium2.3Tim OrlingACCEPTED5
10722devtool: be able to specify src_uri in upgradeenhancementMedium2.3Tim OrlingNEW2
9597RCPTT initial implementation so that we can automate testing of the pluginenhancementMedium2.3 M1Tim OrlingIN PROGRESS IMPLEMENTATION2
10539Use "new project template" framework to create sample GTK projectenhancementMedium2.3 M2Tim OrlingNEW4
10535Build container for Maven/Tycho build for Eclipse CROPS PluginenhancementMedium2.3 M3Tim OrlingNEW2
10529Kconfig support in Eclipse CROPSenhancementMedium2.4Tim OrlingNEW
10550Build yocto Eclipse CROPS documentation using Saxon/JaxonenhancementMedium2.4Tim OrlingNEW
 7       
Todor Minchev
3043runqemu: Investigate and implement (if possible) a local firewall sanity checkenhancementMedium2.3Todor MinchevNEW3
10750add some useful host tools to crops/pokyenhancementMedium2.3Todor MinchevNEW
10528Add VNC support for cli containers for QEMUenhancementMedium2.3 M1Todor MinchevNEW1
10212Support to deploy non-bootloader-specific files in EFI partition when build hddimg imagenormalMedium2.3 M2Todor MinchevNEW5
10126RMC: Bring supported RMC functions to grub-efi bootloaderenhancementMedium2.3 M3Todor MinchevNEW3
10638RMC: Refactoring database generation in rmc.bbclassenhancementMedium2.3 M3Todor MinchevNEW
 6       
Tracy Graydon
8158INCOMPATIBLE_LICENSES has unexpected results with GNU librariesnormalMedium2.3Tracy GraydonNEW10
6287Release scripts for BSPs/images.enhancementMedium2.3 M2Tracy GraydonNEW5
 2       
Yann Dirson
10642BUILD_CC and such are missing from variable indexnormalMedium2.3 M4Yann DirsonNEEDINFONIR 11/27 - 10 Nov 2016: NEEDINFO2
 1       
Yi Zhao
8961sudoku-savant does not get downloaded correctlynormalMedium2.0.3Yi ZhaoACCEPTED3
 1       

Other High Bugs

IDSummary (17 tasks) SeverityPMilestoneAssigneeStatusWhiteboardE
10706meta-gnome: epiphany: build failure, libwnck is too old (2.31), epiphany requires >= 3.0majorHigh2.1.3Armin KusterIN PROGRESS IMPLEMENTATION
1560Enable recipe specific sysrootsenhancementHigh2.3 M1Richard PurdieIN PROGRESS IMPLEMENTATION5
5546Optimise away meta-oe X init mechanismenhancementHigh2.3 M1Jussi KukkonenIN PROGRESS IMPLEMENTATION2
9502Add a way to build container images using oe-coreenhancementHigh2.3 M1Randy WittIN PROGRESS DESIGN5
9592Add a mechanism for creating build appliance as a container imageenhancementHigh2.3 M1brian averyNEW4
9727Add autobuilder support to publish sstate objects for releasesenhancementHigh2.3 M1Joshua LockIN PROGRESS IMPLEMENTATION3
9954report tool: a communication mechanism for sending resultsenhancementHigh2.3 M1Mariano LopezIN PROGRESS REVIEW4
10229New cluster publishes artefacts regardless of whether deploy_artifacts ChoiceString is setnormalHigh2.3 M1Stephano CetolaIN PROGRESS IMPLEMENTATION3
10352Performance of bitbake -S is horribleenhancementHigh2.3 M1Jianxun ZhangACCEPTED15
10394Creation of component to emulate keyboard with USB-KM232enhancementHigh2.3 M1Plauchu EdwinIN PROGRESS IMPLEMENTATION7
10532Create Target file definition for Eclipse CROPS PluginenhancementHigh2.3 M1Tim OrlingIN PROGRESS REVIEW2
10612Don't perform git clone on shared volumenormalHigh2.3 M1Stephano CetolaIN PROGRESS IMPLEMENTATION2
10655Add support for ZephyrenhancementHigh2.3 M1Juro BystrickyACCEPTED3
5470+bitbake-layers cannot be used with memory resident bitbake runningnormalHigh2.3 M2Aníbal LimónIN PROGRESS IMPLEMENTATION5
5866Reproducible builds: identical binariesenhancementHigh2.3 M2Juro BystrickyNEW5
10558Create Nexus instance (a java repository manager)enhancementHigh2.3 M2Michael HalsteadNEW
10596Enable tests of layers for compatibility (YP Compatible v2)enhancementHigh2.3 M2Aníbal LimónNEW
 17       

Major or Critical

IDSummary (27 tasks) SeverityPMilestoneAssigneeStatusWhiteboardE
8946opkg install does not appear to fail on file overwritemajorUndecided0.4Alejandro del CastilloNEW
9759python-2.7.9-r1 do_install failing (meta-intel [minnowboard])criticalMedium1.8.3Alejandro HernandezNEW
10706meta-gnome: epiphany: build failure, libwnck is too old (2.31), epiphany requires >= 3.0majorHigh2.1.3Armin KusterIN PROGRESS IMPLEMENTATION
8078useradd.bbclass: useradd_preinst not run when rebuilding on second MACHINEmajorMedium+2.3 M1Maxin B. JohnACCEPTED3
10304QEMU doesnot support e6500 emulation for gobject-introspectionmajorMedium+2.3 M1Otavio SalvadorNEW
10411Provide a working python-pylint recipemajorMedium+2.3 M1Daniela PlascenciaIN PROGRESS IMPLEMENTATION5
10441source-highlight-native world build failuresmajorMedium+2.3 M1Ed BartoshIN PROGRESS REVIEW3
10448Package files already existed at Publishing Artifacts stepmajorMedium+2.3 M1Joshua LockNEW2
10508bitbake fetcher does not always check for trusted_networkmajorMedium+2.3 M1Markus LehtonenIN PROGRESS REVIEW3
10614[Test Case 204] intel-corei7-64 sato, lsb and wic images doesn't boot on Cherry Hill platformmajorMedium+2.3 M1California SullivanNEW1.5
10647core-image-minimal: do_testsdkext failedmajorMedium+2.3 M1Robert YangIN PROGRESS REVIEW2
10651bitbake -g world is brokenmajorMedium+2.3 M1Richard PurdieIN PROGRESS REVIEW1
9372Ptest for acl hang because of lack of two user bin and daemoncriticalMedium2.3 M2Chen QiACCEPTED3
8879opkg-utils is built when build lib32-imagemajorMedium+2.3 M2Robert YangIN PROGRESS IMPLEMENTATION5
10113native reicpes does not include runtime dependencies when populating sysrootmajorMedium+2.3 M2Richard PurdieNEW3
10449tar-native - task do_populate_sysroot_setscene fails - likely racemajorMedium+2.3 M2Ross BurtonNEW3
10524Command line build monitoring broken when using custom builddir and config filemajorMedium+2.3 M2Joshua LockACCEPTED2
7724useradd.bbclass users cannot be safely referred to by dependent recipes due to sstate-induced race with base-passwdmajorMedium2.3 M3Plauchu EdwinACCEPTEDTC needed7
5331error play video via gstreamer with "mfw_isink"criticalMediumFutureOtavio SalvadorNEW
9395Cleanly support unicode throughout ToastercriticalMediumFutureDavid ReynaNEW15
4155i.MX6: VPU plugins for GStreamer do not work with appsinkmajorMediumFutureOtavio SalvadorIN PROGRESS REVIEW
6683Produce a script to automate release preparation tasksmajorMediumFutureTracy GraydonNEW3
6806Smart failure when running bitbake over and overmajorMediumFutureRobert YangACCEPTED5
7945Toaster startup script assumes it's in a git repositorymajorMediumFuturebrian averyNEW2
8947opkg conffile resolution cannot detect unmodified conffiles modified in upgraded packagemajorUndecided---Alejandro del CastilloNEW
9348Opkg requires root privileges for all operationsmajorUndecided---Alejandro del CastilloNEW
10757multiconfig MACHINE ignoredmajorUndecided---Richard PurdieNEW
 27       

NEEDINFO

IDSummary (11 tasks) AssigneeStatusSeverityPMilestoneWhiteboard
3276PulseAudio isn't testedRoss BurtonNEEDINFOenhancementMedium2.3
7096Document how to use initramfs featuresCalifornia SullivanNEEDINFOenhancementMedium2.3 M2NIR 11/20, 11/27 - 03 Nov 2016: IN PROGRESS REVIEW
7142cmake.bbclass fails when rebuilding after MACHINE changesRoss BurtonNEEDINFOnormalMedium2.3 M2NIF 11/13, 11/20, 11/27
7588devtool: improve devtool build outputPaul EggletonNEEDINFOenhancementMedium2.3 M1NIR 11/27
8087eglibc patch bugJoshua RogersNEEDINFOnormalMedium2.3
9300AFTER POWER ON, LED(D1)ON BUT LED(D2)flickerJohn 'Warthog9' HawleyNEEDINFOnormalMediumProduction Release
9451Document a cookbook procedure on how to change kernel versionSaul WoldNEEDINFOnormalMedium2.3 M4NIR 11/27 - Waits until after meta-intel release completed
10076Docs should have pointer to latest manual at the topRichard PurdieNEEDINFOnormalMedium2.3 M2NIR 11/27 - 08 Nov 2016: NEEDINFO
10241Missing files in rootfs when adding links /bin ->/usr/bin and /lib -> /usr/lib in recipe base-files NEEDINFOenhancementMedium2.3NIR 11/27
10642BUILD_CC and such are missing from variable indexYann DirsonNEEDINFOnormalMedium2.3 M4NIR 11/27 - 10 Nov 2016: NEEDINFO
10755AUTOREV: morty definition results in a RecursionError when setting PV=SRCPV as documentedScott RifenbarkNEEDINFOnormalUndecided2.3 M302 Dec 2016: NEEDINFO
 11      

Old Milestone

IDSummary (673 tasks) AssigneeStatusSeverityPMilestoneWhiteboard
8165[libsolv] opkg_list_upgradable_cmd() does not work with an external solver enabled.Alejandro del CastilloNEWnormalMedium0.3.4
8163opkg don't resume big upgrades (old issue #17)Alejandro del CastilloNEWnormalMedium1.0
7814Weston fails to build with core-image-weston on imx6qsabresdOtavio SalvadorNEWnormalLow1.8.3
8613udev-extraconf: automount does not work with systemd >= 219Alejandro HernandezIN PROGRESS REVIEWnormalMedium1.8.3Check 2.0 also
8667populate_sdk task fails when Debian packaging used in FIDOAníbal LimónACCEPTEDnormalMedium1.8.3
9100uclibc image fails to buildArmin KusterNEWnormalLow1.8.3
9656NFS boot failed due No working init found kernel panic on qemuBruce AshfieldACCEPTEDnormalMedium1.8.3
9759python-2.7.9-r1 do_install failing (meta-intel [minnowboard])Alejandro HernandezNEWcriticalMedium1.8.3
8092Implementation of the function glXChooseFBConfig in the libGL.so does not match OpenGL documentationOtavio SalvadorWaitForUpstreamnormalMedium2.0.3
8961sudoku-savant does not get downloaded correctlyYi ZhaoACCEPTEDnormalMedium2.0.3
9349Jethro build fails for core-image-x11 with package_debAníbal LimónIN PROGRESS DESIGNnormalMedium2.0.3
9601meta-qt5 Krogoth Branch Building Error During 'do_qa_staging'Armin KusterNEWnormalMedium2.1.3
10644Libnss uses deprecated function readdir_r()Jussi KukkonenNEWnormalMedium2.1.3
10674The patch file is not applied to linux-yocto by yocto-kernel add patch command in 2.1.2 rc1Leonardo Sandoval GonzalezNEWnormalMedium2.1.3
10675Failed to build cvs and iptables with extensible sdk on Fedora 24 i686 in Yocto 2.1.2Armin KusterIN PROGRESS DESIGN COMPLETEnormalMedium+2.1.3
10706meta-gnome: epiphany: build failure, libwnck is too old (2.31), epiphany requires >= 3.0Armin KusterIN PROGRESS IMPLEMENTATIONmajorHigh2.1.3
9208createrepo fails to correctly update the repodata, image generation then failsMark HatleNEWnormalMedium2.2
9233As a developer, I want initramfs bundled kernel could be installed into rootfsMing LiuIN PROGRESS REVIEWnormalMedium2.2
9417Bring clang/llvm compiler infrastructure to OE-CoreKhem RajACCEPTEDenhancementMedium2.2
9821create a configuration for a deployable autobuilder clusterMichael HalsteadNEWenhancementMedium2.2
9854Kernel hangs on LTP cgroup testsBruce AshfieldACCEPTEDnormalMedium2.2
9982npm.bbclass install function will package patches directoryBrendan Le FollNEWnormalMedium2.2
10103systemd-reboot: systemd 2.29 takes 90s longer than it should on shutdown if a corefile is createdArmin KusterNEWnormalMedium2.2
10184Autobuilder fails when PARALLEL_MAKE ?= "-j ${@oe.utils.cpu_count()}"Beth 'pidge' FlanaganACCEPTEDnormalMedium2.2
4183Reference material for how a user creates a build that meets GPL obligations given a reference BSP, standard rootfs/kernel...etc.Beth 'pidge' FlanaganNEWenhancementMedium2.2 M4
6153Archiver causes manifest warnings for the toolchainHongxu JiaNEWnormalMedium2.2 M4
10308rpm installs bad signature package with option --nodigest --nosignature failedHongxu JiaNEWnormalMedium2.2 M4
10312Failed to execute child process "oe-gnome-terminal-phonehome" (No such file or directory)Ming LiuIN PROGRESS REVIEWnormalMedium2.2 M4
10499NUC6 freezes on core-image-sato using genericx86-64 with kernel 4.1.33Alejandro HernandezACCEPTEDnormalLow2.2.1
824Usability: Improve RRECOMMENDS warning messages for -dbg packagesPaul EggletonACCEPTEDenhancementLow2.3
3043runqemu: Investigate and implement (if possible) a local firewall sanity checkTodor MinchevNEWenhancementMedium2.3
3488Enable Mesa's llvmpipe?Ross BurtonACCEPTEDenhancementMedium2.3
4143Support real-time logging when using bitbake interactivelyRichard PurdieNEWenhancementMedium2.3
4339psplash doesn't work with systemdChen QiNEWnormalMedium2.3Release Note 1.4
5057Conflict when building SDK for image containing dropbear and openssh-sftp-serverPaul EggletonACCEPTEDnormalMedium2.3Release Note
5157LSB perl tests: op/stat.t 167 unreported No resultdengkeACCEPTEDnormalMedium2.3
5322Global DNS fallback mechanism not present in poky distroRoss BurtonACCEPTEDenhancementMedium2.3
5389bitbake/lib/bb/fetch2: filename too longRobert YangIN PROGRESS IMPLEMENTATIONnormalMedium2.3
5395Nativesdk postinstalls directory issues.Richard PurdieNEWnormalMedium2.3
5427Extend and tidy up layer sanity checkingChen QiIN PROGRESS REVIEWenhancementMedium2.3
5574Add kernel configuration check mechanismPaul EggletonIN PROGRESS DESIGNenhancementLow2.3
6016CrossTap has issues on running scheduler script against qemuppcChen QiNEWnormalMedium2.3
6077piglit depends on libx11Jussi KukkonenACCEPTEDenhancementMedium2.3
6142we need general documentation on Systemd vs SysV related issuesRoss BurtonACCEPTEDenhancementMedium2.3
6258svn fetch uses last changed revision instead of revision on a svn branch.Richard PurdieACCEPTEDnormalLow2.3
6278runqemu without /etc/resolv.confJuro BystrickyNEWenhancementMedium2.3
6378libfakekey patch to allow shift-ed version of symbol not already in keymapJussi KukkonenNEWnormalMedium2.3
6420Detect and error when required packages are not producedHongxu JiaNEWenhancementMedium2.3
6607Auto-detect client locale and use for date formattingbrian averyNEWenhancementLow2.3
6626Add an example for debugging software with the corresponding -dbg packagePaul EggletonNEWnormalMedium2.3
6661devtool: add ability to submit changes for reviewPaul EggletonNEWenhancementMedium2.3LET
6700systemd's resolved conflicts with connmanChen QiACCEPTEDenhancementMedium2.3
6839Handle dev package with no main package more gracefullyPaul EggletonNEWenhancementLow2.3
7010systemd-serialgetty cannot create a serial-getty@.service that is not enabledRoss BurtonNEWnormalMedium2.3Backport to 1.7.3
7018archiver missing tasks between do_unpack and do_patchHongxu JiaIN PROGRESS REVIEWnormalMedium2.3
7040Support for /usr merge (à la systemd and Fedora)Joshua LockIN PROGRESS DESIGNenhancementMedium2.3
7054Need remote profiler (sysprof or eclipse?)Jussi KukkonenACCEPTEDnormalMedium2.3
7136Packaging non-versioned libraries is non-trivialRoss BurtonNEWnormalMedium2.3
7149rpm: print which pkgname for warningHongxu JiaNEWenhancementMedium2.3
7298packagegroups are not rebuilt when rdependency pkg name changesRichard PurdieNEWnormalMedium2.3
7336buildhistory-diff reports recipe-wide changes per-subpackagePaul EggletonNEWenhancementMedium2.3
7637devtool: add: interactive recipe creationPaul EggletonNEWenhancementMedium2.3
7819Support multi-image debuggingTim OrlingACCEPTEDenhancementMedium2.3
7823Convert Eclipse projects to Yocto recipes with devtoolJose LamegoIN PROGRESS DESIGNenhancementMedium2.3GUI design available
7846devshell cannot be kept open across rebuildsRichard PurdieNEWenhancementMedium2.3
7852bitbake-layers layerindex-fetch doesn't respect branch (-b|--branch) optionPaul EggletonIN PROGRESS DESIGNnormalMedium2.3
7877Depending on the error found, inconsistent line reported.Richard PurdieNEWnormalMedium2.3
7879Depending on the name of a recipe, the build succeeds or fails.Richard PurdieNEWnormalMedium2.3
7960Feature Request: to enable poky to support building multilib native commandsRichard PurdieNEWenhancementMedium2.3
7982Have an option to exclude some packages from the SDK generationRichard PurdieNEWenhancementLow2.3
8064ptest fails tracker bugRoss BurtonNEWnormalMedium2.3
8074Graphic display using Virtual Box differs from VMwareJuro BystrickyIN PROGRESS REVIEWnormalMedium2.3
8158INCOMPATIBLE_LICENSES has unexpected results with GNU librariesTracy GraydonNEWnormalMedium2.3
8161Can't use "\" characters in SRC_URI entries - not even escapedRichard PurdieNEWnormalMedium2.3
8173Wrong dynamic loader because of missing -mfloat-abi=hard in LDFLAGS (in scons)Richard PurdieNEWnormalMedium2.3
8192python3.4.3 os.fork and os.waitpid (prelink related)Leonardo Sandoval GonzalezNEWminorMedium2.3
8222Elide dependency from -dev package on main package if there are no shared libraries in itPaul EggletonNEWenhancementLow2.3
8302sstate_create_package fails to chmod fileRoss BurtonNEWnormalMedium2.3
8325devtool modify could handle patch failure more usefullyPaul EggletonNEWenhancementMedium2.3
8430inaccurate 'du' usage in Image::_get_rootfs_sizeRoss BurtonACCEPTEDenhancementMedium2.3
8446fix .pyc/.pyo buildpaths issueHongxu JiaNEWenhancementMedium2.3
8447Host contamination in glibc-localesSeebsACCEPTEDnormalMedium2.3
8454archiver.bbclass does not create subfolder per licenseRoss BurtonNEWnormalMedium2.3
8471ptest - some valgrind ptests fail on 2.0.rc1Maxin B. JohnACCEPTEDnormalMedium2.3
8582Error message not in log fileMark HatleNEWnormalMedium2.3
8586multilib build includes 32bit connman without good reasonJussi KukkonenIN PROGRESS REVIEWnormalMedium2.3
8593The head files of ncurses installing into sysroot seems different in multiple times compilationRoss BurtonNEWnormalMedium2.3
8606Evaluate using connman-ui instead of connman-gnomeJussi KukkonenACCEPTEDenhancementLow2.3
8612Add a locked sigs mode allowing locked task to rerunRichard PurdieNEWenhancementLow2.3
8688busybox syslog not update-alternatives awareRoss BurtonNEWnormalMedium2.3
8732Branch Support for BuildhistoryRudolf J StreifNEWenhancementMedium2.3
8740LTP and LSB NG casesdengkeIN PROGRESS REVIEWnormalMedium2.3
8760Autobuilder additional task log availabilityJoshua LockNEWenhancementMedium2.3
8779update-alternatives.bbclass automatic renaming doesn't happen in sysrootsRichard PurdieNEWnormalMedium2.3
8805Detect and warn people naming functions something_remove_somethingRichard PurdieNEWnormalMedium2.3
8828pTest - lttng-tools tests fail for 2.1_M1.rc1Richard PurdieNEWnormalMedium2.3
8831pTest - busybox tests fail for 2.1_M1.rc1Chen QiACCEPTEDnormalMedium2.3
8832pTest - bash tests fail for 2.1_M1.rc1dengkeNEWnormalMedium2.3
8840Failure to build 32 bit eSDK on a 64 bit hostPaul EggletonNEWenhancementMedium2.3
8873Create an appropriate Yocto Project Workspace from an existing Eclipse projectJose LamegoNEWenhancementMedium2.3
8874Create a new Yocto recipe from an existing Eclipse project using devtoolJose LamegoNEWenhancementMedium2.3
8909Mention standard fetcher options also in fetcher seaction (not only in SRC_URI in the glossary)Paul EggletonNEWenhancementMedium2.3
8967Need a way to cleanup DEPENDS and RDEPENDSRobert YangNEWenhancementMedium2.3
9042pTest - strace fails on NUC 5425WYK for YP 2.1_M2.rc1dengkeACCEPTEDnormalMedium2.3
9055pTest - acl (NUC) failed tested on NUC 5425WYK for YP 2.1_M2.rc1Robert YangACCEPTEDnormalMedium2.3
9061git fetcher inconsistency for working with PREMIRRORS.Richard PurdieNEWnormalMedium2.3
9078When changing SDKIMAGE_FEATURES to "dev-pkgs", some -dbg packages are still installedRoss BurtonNEWenhancementLow2.3
9110Move some oe-pkgdata-util logic into lib/oeRoss BurtonNEWenhancementMedium2.3
9115Added packages filter seems to show the wrong package listJoshua LockACCEPTEDnormalMedium2.3
9119ptest fails tracker bug (Cont.)Ross BurtonNEWnormalMedium2.3
9171Consider limiting the scope of depchains to runtime depsRoss BurtonNEWnormalMedium2.3
9207Need to fix prelink to iterate mulitlibsRoss BurtonNEWnormalMedium2.3
9213Enable thumb for ARM buildsRoss BurtonNEWnormalMedium2.3
9220buildhistory should track native recipesPaul EggletonNEWenhancementMedium2.3
9224[meta-swupd] Try to speed up update generation by parallelising calls to swupd_* programs where possibleJoshua LockNEWenhancementMedium2.3
9259The rpm database costs lots of disk space after install a packageRoss BurtonNEWnormalMedium2.3
9272BBCLASSEXTEND="cross" overrides do_install()Richard PurdieNEWnormalMedium2.3
9279Issue with PREFERRED_PROVIDER interaction with overridesRichard PurdieNEWnormalMedium2.3
9322[meta-swupd] Improve the algorithm for determining previous versionJoshua LockNEWenhancementMedium2.3
9350As a developer, I want a global variable exist for choosing the default SSL/TLS provider.Jussi KukkonenNEWenhancementMedium2.3
9360devtool: update-recipe ignores SRC_URI_appendPaul EggletonNEWnormalMedium2.3
9404Smart will remove RECOMMENDS during a remove commandRobert YangNEWnormalMedium2.3
9423devshell: export CONFIGUREOPTS to envRobert YangNEWenhancementMedium2.3
9424systemd tmpfiles.d warnings (volatile, resolv.conf)Ross BurtonNEWminorMedium2.3
9442Please add virtio console to qemux86-64.confJuro BystrickyIN PROGRESS DESIGNenhancementMedium2.3
9463An easier way to debug package install (do_rootfs, do_populate_sdk)Robert YangNEWenhancementLow2.3
9479Extensible SDK breaks if python-dependent items added to TOOLCHAIN_HOST_TASKPaul EggletonNEWnormalMedium2.3
9527Design support for a stateless OSJussi KukkonenNEWenhancementMedium2.3
9531Need a proper way to fix mismatched arch generated with bare-bone kernel recipeSaul WoldNEWnormalMedium2.3
9539Resolve string formatting issues in busyboxJoshua LockNEWnormalMedium2.3
9540Resolve string formatting issues in console-toolsJoshua LockNEWnormalMedium2.3
9541Resolve string formatting issues in cmakeJoshua LockNEWnormalMedium2.3
9542Resolve string formatting issues in expectJoshua LockNEWnormalMedium2.3
9543Resolve string formatting issues in gccJoshua LockNEWnormalMedium2.3
9544Resolve string formatting issues in gettextJoshua LockNEWnormalMedium2.3
9545Resolve string formatting issues in kexec-toolsJoshua LockNEWnormalMedium2.3
9586document and verify production setup for jenkins ci interactionMichael WoodNEWnormalMedium2.3
9627devtool seems to mangle incorrectly the .bb file, when modifying the set of patches for a componentPaul EggletonNEWnormalMedium2.3
9638devtool changes the format of the SRC_URI unnecessarilyPaul EggletonNEWnormalMedium2.3
9645The image recipe details does not show "Last build" informationMichael WoodNEWnormalLow2.3
9651Error report web: Optimize searching timesMichael WoodNEWenhancementMedium2.3
9657Saving an added variable seems to save all other added variablesDavid ReynaNEWnormalLow2.3
9700Add layer and bitbake information to error reportsAníbal LimónNEWenhancementMedium2.3GUI design pending
9725add docstrings to functions in lib/bb/utils.py that are used in meta- files.Joshua LockACCEPTEDnormalMedium2.3
9762Add support for poisoning of variablesRichard PurdieNEWenhancementMedium2.3
9782Add support for parallel gzip to package creationMarkus LehtonenNEWenhancementMedium2.3
9789systemd rootfs-postprocess command should check staticidsStephano CetolaACCEPTEDnormalMedium2.3
9790Design a solution for using a package manager to develop and transitioning to swupd for productionJoshua LockNEWnormalMedium2.3
9879Enable search for recipes that inherit a specific classPaul EggletonIN PROGRESS REVIEWenhancementMedium2.3
9883curl-native: invalid builtin ca-bundle path when restoring from sstateRoss BurtonNEWnormalMedium2.3
9888uninative cannot find tarball when using "own-mirrors" and BB_NO_NETWORKRichard PurdieNEWnormalMedium2.3
9915Show all layer revisions supported by Toaster, not just the ones compatible with the projectMichael WoodNEWenhancementMedium2.3GUI design pending
9917autobuilder: Add ability to get worker informationJoshua LockNEWnormalMedium2.3
9921oe-selftest naming test guidelinesBenjamin EsquivelNEWnormalMedium2.3
9948"-fstack-protector-strong" seems unnecessary in SECURITY_LDFLAGSJoshua LockIN PROGRESS REVIEWnormalMedium2.3
9974Extensible SDK: reparse occurs on first devtool usePaul EggletonNEWminorMedium2.3
9981Make Autobuilder workers get hostname dynamicallyJoshua LockNEWenhancementMedium2.3
9993uninative loader: no error on checksum failure for file:// urlsPaul EggletonNEWnormalMedium2.3
10025Missing 'Connection Manager' icon for qemumips and qemumips64Jussi KukkonenNEWnormalMedium2.3
10061Ctrl+C during BB_HASHCHECK_FUNCTION execution does not interrupt processing nicelyRichard PurdieNEWminorMedium2.3
10096Allow PREFERRED_VERSION miss to be fatalRichard PurdieNEWenhancementMedium2.3
10110parselogs/intel-core-i7-64 on cherryhill /irq stat interface fatal error/failed to enable keyboardCalifornia SullivanACCEPTEDnormalMedium2.3
10130Excessive warnings for incorrectly formatted LICENSERoss BurtonNEWminorMedium2.3
10133uninative tarball should contain layer manifestRoss BurtonACCEPTEDenhancementMedium2.3
10151Custom image recipe download button incorrect disabled state appliedMichael WoodIN PROGRESS REVIEWminorLow2.3
10220The toaster-custom-images comes up as "Unidentified layer" in the build history pagesMichael WoodIN PROGRESS REVIEWnormalMedium2.3
10237bitbake -c cleanall on npm fetched recipe will prevent fetching other versions of the same packagePaul EggletonNEWnormalMedium2.3
10266Add ptest for gnutlsJussi KukkonenNEWenhancementMedium2.3
10288mesa and wayland: mesa master now requires native wayland-scanner in order to buildJussi KukkonenIN PROGRESS REVIEWnormalMedium2.3
10300libunwind fails to build with ld-is-goldRoss BurtonNEWnormalMedium2.3
10316Vivante: Memory corruption in wayland client process after hiding windowTom HochsteinWaitForUpstreamnormalLow2.3
10322better way to grab layers and get them automatically batched by generating a bash script on the fly to do the tedious partsPaul EggletonNEWenhancementMedium2.3
10325license.bbclass should only copy licenses for packages actually installedSaul WoldNEWenhancementMedium2.3
10343Toaster fails to to build with image customization in non git layer for local releaseSujith HACCEPTEDnormalMedium2.3
10382master - nightly-mips-lsb failedJoshua LockNEWnormalMedium2.3
10414devtool: deploy-target: support deploying kernelPlauchu EdwinNEWenhancementMedium2.3
10416Extensible SDK: provide easy means of reconfiguring the kernelPlauchu EdwinNEWenhancementMedium2.3
10417devtool: modify: look at optimising kernel rebuildsPaul EggletonNEWenhancementMedium2.3
10418devtool: look at devshell integrationPaul EggletonNEWenhancementMedium2.3
10475Document correct usage of FuncFailedJoshua LockNEWenhancementMedium2.3
10476Unify exception handling in core/classesJoshua LockNEWenhancementMedium2.3
10486libintl*.so should be in gettext-runtime when using muslJussi KukkonenNEWnormalMedium2.3
10487readline examples should go in -doc packageHongxu JiaNEWnormalMedium2.3
10515devtool: if npm module version not specified, use latestPaul EggletonNEWenhancementMedium2.3
10516devtool: display progress during npm addPaul EggletonNEWenhancementMedium2.3
10525Chromium 52 segfaults on i.MX6 dualliteOtavio SalvadorNEWnormalMedium2.3
10584rm_work.bbclass: reduce maximum amount of disk space required for a buildPatrick OhlyIN PROGRESS DESIGNenhancementMedium2.3
10619Refactor wic codebaseEd BartoshACCEPTEDenhancementMedium2.3LET
10622buildstats: use JSON formatMarkus LehtonenNEWenhancementMedium2.3
10628Parselogs: Failed to obtain handles for "Service Changed" characteristicCalifornia SullivanNEWnormalMedium2.3
10667Define packagegroup for python3Leonardo Sandoval GonzalezNEWenhancementMedium2.3
10672AUH log's tarball should have relative path starting at the timestampAníbal LimónNEWminorMedium2.3
10682multiconfig sstate optimisationsRichard PurdieNEWenhancementMedium2.3
10683perl packages should be allarch in many casesAníbal LimónACCEPTEDenhancementMedium2.3
10684Distributed build supportRichard PurdieNEWenhancementMedium2.3
10699Ensure consistency in repository URLsPaul EggletonNEWenhancementMedium2.3
10722devtool: be able to specify src_uri in upgradeTim OrlingNEWenhancementMedium2.3
10737binconfig-disabled should install non-broken files to packagesRoss BurtonNEWnormalMedium2.3
10750add some useful host tools to crops/pokyTodor MinchevNEWenhancementMedium2.3
1560Enable recipe specific sysrootsRichard PurdieIN PROGRESS IMPLEMENTATIONenhancementHigh2.3 M1
3343perf script: install audit-libs-python to get syscall name for syscall-displaying scriptsPlauchu EdwinACCEPTEDenhancementLow2.3 M1
4527create a Runtime performance test layer to enable runtime performance testsHumberto IbarraACCEPTEDenhancementMedium+2.3 M1
4528boot time should be tracked for systemd and SysVinitHumberto IbarraACCEPTEDenhancementMedium+2.3 M1
5319Need a test to verify firstboot postinst script orderFrancisco PedrazaIN PROGRESS REVIEWnormalMedium+2.3 M1
5369Create test plan to do performance analysis of x32 runtimeHumberto IbarraACCEPTEDenhancementMedium+2.3 M1
5520poky-tiny enhancementsAlejandro HernandezACCEPTEDenhancementMedium2.3 M1On Track for Initial Impl
5546Optimise away meta-oe X init mechanismJussi KukkonenIN PROGRESS IMPLEMENTATIONenhancementHigh2.3 M1
6132Have persistent log data (/var/log)Chen QiIN PROGRESS REVIEWenhancementMedium2.3 M121 Nov 2016: Posed a comment to help documentation part.
6296Add support for runtime performance tests to image_testsHumberto IbarraACCEPTEDenhancementMedium+2.3 M1
6660Compare sstate packages within SDK publishing toolChen QiACCEPTEDenhancementMedium2.3 M1
7376oe-selftest doesn't run lib/oe/tests/*Jose Perez CIN PROGRESS REVIEWenhancementMedium+2.3 M1
7646KBUILD_DEFCONFIG does not work if config file is created as a result of patch to be appliedBruce AshfieldIN PROGRESS IMPLEMENTATIONnormalMedium2.3 M1
7800systemd.bbclass doesn't check for services in systemd/user/ directoryChen QiIN PROGRESS IMPLEMENTATIONenhancementMedium2.3 M1
8051Importing layer fails silently if the layer name already existsMichael WoodIN PROGRESS REVIEWnormalMedium2.3 M1
8078useradd.bbclass: useradd_preinst not run when rebuilding on second MACHINEMaxin B. JohnACCEPTEDmajorMedium+2.3 M1
8190The 'set in file' filters in the BitBake variables table seem to return the wrong informationDavid ReynaIN PROGRESS REVIEWnormalMedium2.3 M1
8223bbwarn warnings during do_rootfs printed twicePaul EggletonIN PROGRESS IMPLEMENTATIONminorMedium2.3 M1
8314warn when ALTERNATIVE_PRIORITY are the sameChen QiACCEPTEDenhancementMedium2.3 M1
8433Add test for package postinstsJose Perez CIN PROGRESS IMPLEMENTATIONenhancementMedium+2.3 M1
8497Continuous Toaster exploratory testingDavid Lopez BarribaNEWenhancementMedium2.3 M1
8525selftest needs to control distro configurationLeonardo Sandoval GonzalezIN PROGRESS REVIEWnormalMedium+2.3 M1
8719Ensure bootable images can be supported by wic for all reference BSPsEd BartoshIN PROGRESS IMPLEMENTATIONenhancementMedium2.3 M1LET
8743configme --allnoconfig breaks defconfig generated with kconfig / make savedefconfigBruce AshfieldIN PROGRESS REVIEWnormalMedium2.3 M1
9037Consider alternate methods for maintain Yocto releases after 1yrRichard PurdieNEWenhancementMedium+2.3 M1
9038extensible sdk - generates empty manifests/needs file with what is installedPaul EggletonNEWnormalMedium+2.3 M1
9189[meta-swupd] Creates a lot of duplicate filesPatrick OhlyACCEPTEDenhancementMedium2.3 M1
9267test_parselogs (oeqa.runtime.parselogs.ParseLogsTest) failed on NUC 6i5SYH, firmware load for i915/skl_guc_ver4.bin failedCalifornia SullivanIN PROGRESS DESIGNnormalMedium2.3 M1
9338Support building optimised Python (with profile-opt make target)Markus LehtonenIN PROGRESS IMPLEMENTATIONenhancementMedium+2.3 M1
9342Vet subprocess callsStephano CetolaIN PROGRESS REVIEWenhancementMedium+2.3 M1
9377Enable automated build performance testing in AutobuilderMonserratIN PROGRESS IMPLEMENTATIONenhancementMedium+2.3 M1
9387Extensible SDK: add image customisation functionalityMichael WoodNEWenhancementMedium+2.3 M1
9481Add example to "5.23. Debugging With the GNU Project Debugger (GDB) Remotely"Mark HatleIN PROGRESS REVIEWenhancementMedium+2.3 M111 Oct 2016: IN PROGRESS REVIEW
9494Custom images created from the build history pages fail to buildDavid ReynaIN PROGRESS IMPLEMENTATIONnormalMedium2.3 M1
9502Add a way to build container images using oe-coreRandy WittIN PROGRESS DESIGNenhancementHigh2.3 M1
9503Add a way to add docker metadata to container imagesRandy WittNEWenhancementMedium2.3 M1
9519Consolidate used API into it's own viewMichael WoodIN PROGRESS IMPLEMENTATIONenhancementMedium2.3 M1
9592Add a mechanism for creating build appliance as a container imagebrian averyNEWenhancementHigh2.3 M1
9596Build "minimal" extensible SDK installers instead of "full" onesJoshua LockIN PROGRESS IMPLEMENTATIONenhancementMedium+2.3 M1
9597RCPTT initial implementation so that we can automate testing of the pluginTim OrlingIN PROGRESS IMPLEMENTATIONenhancementMedium2.3 M1
96094.1.x: musb fails to compileBruce AshfieldWaitForUpstreamnormalMedium2.3 M1
9617Create Toaster Docker production containerbrian averyIN PROGRESS DESIGNnormalMedium2.3 M1
9620Update layer index to django 1.8 ltsMichael HalsteadIN PROGRESS IMPLEMENTATIONnormalMedium+2.3 M1
9660Create a YP-2.3 test plan for SWUpdSonia DelgadoNEWnormalMedium+2.3 M1
9689Create a python library for automatic device testingBenjamin EsquivelIN PROGRESS IMPLEMENTATIONenhancementMedium+2.3 M1
9727Add autobuilder support to publish sstate objects for releasesJoshua LockIN PROGRESS IMPLEMENTATIONenhancementHigh2.3 M1
9753Document automatic layer priority calculationPaul EggletonACCEPTEDenhancementMedium2.3 M1
9813Strange kernel image for qemumips and qemumips64 in deploy directoryBruce AshfieldACCEPTEDnormalMedium2.3 M1
9903Add more test cases for Systemd-bootJose Perez CIN PROGRESS REVIEWenhancementMedium2.3 M1
9924Prevent users from using HEAD as Git revision when importing layersDavid ReynaNEWenhancementMedium+2.3 M1
9942patchwork: ensure patches are not marked as Accepted when a newer Series revision is modifiedJose LamegoACCEPTEDnormalMedium+2.3 M1
9954report tool: a communication mechanism for sending resultsMariano LopezIN PROGRESS REVIEWenhancementHigh2.3 M1
9992If we run oe-init-build-env with an argument for builddir, toaster start failsbrian averyIN PROGRESS DESIGNnormalMedium2.3 M1
10035oe-selftest: Use SSTATES without corrupting them.Leonardo Sandoval GonzalezNEWenhancementMedium+2.3 M1
10047Piglit isn't in images (removed from tools-testapps)Ross BurtonIN PROGRESS REVIEWnormalMedium+2.3 M1
10059patchtest-oe: check bitbake datastore variables on classes or includesLeonardo Sandoval GonzalezACCEPTEDenhancementMedium+2.3 M1
10073wic: generic bootloader-agnostic EFI pluginJianxun ZhangNEWenhancementMedium2.3 M1
10078patchtest-oe: check patch authorLeonardo Sandoval GonzalezNEWenhancementMedium2.3 M1
10086RMC: RMC Project - single library, single APIJianxun ZhangIN PROGRESS REVIEWenhancementMedium+2.3 M1
10101When power cycling in masterimage.py, 'shutdown -h now' can return a non-zero exit status because the ssh connection is cutPlauchu EdwinACCEPTEDnormalMedium+2.3 M1
10112Patchtest-oe: tests summary must provide patch nameDaniela PlascenciaNEWenhancementMedium+2.3 M1
10168On-target binutils produces non-running code when linking with "-Wl,-z,nocopyreloc" on ARM or PPCKhem RajNEWnormalMedium+2.3 M1
10177Two openembedded-core entries when searching for recipesPaul EggletonIN PROGRESS REVIEWnormalMedium2.3 M1
10229New cluster publishes artefacts regardless of whether deploy_artifacts ChoiceString is setStephano CetolaIN PROGRESS IMPLEMENTATIONnormalHigh2.3 M1
10231oeqa: Refactor code to avoid dependencies on bitbake datastoreAníbal LimónIN PROGRESS IMPLEMENTATIONenhancementMedium+2.3 M1
10234oeqa: Implement QemuTestRunnerAníbal LimónNEWenhancementMedium+2.3 M1
10235oeqa: Implement OETiemout decoratorMariano LopezIN PROGRESS IMPLEMENTATIONenhancementMedium+2.3 M1
10236oeqa: Implement OETag decorator.Mariano LopezIN PROGRESS IMPLEMENTATIONenhancementMedium+2.3 M1
10250qemumips64 + systemd + pam results in login failureChen QiIN PROGRESS REVIEWnormalMedium2.3 M1
10263oeqa: Refactor oetest moduleAníbal LimónIN PROGRESS IMPLEMENTATIONenhancementMedium+2.3 M1
10271KeyError exception when pushing buildhistory failsRoss BurtonNEWnormalMedium+2.3 M1
10304QEMU doesnot support e6500 emulation for gobject-introspectionOtavio SalvadorNEWmajorMedium+2.3 M1
10317oeqa tests are incompatible with python's unittest runnerMariano LopezIN PROGRESS DESIGNenhancementMedium+2.3 M1
10323Sample script to create source release for specific licences failsScott RifenbarkIN PROGRESS REVIEWnormalMedium2.3 M126 Sept 2016: IN PROGRESS REVIEW
10338perl-native embeds host-dependent variables in sysrootAníbal LimónIN PROGRESS REVIEWnormalMedium+2.3 M1
10342Lots of debug noise "while parsing exportTests"Mariano LopezACCEPTEDminorMedium2.3 M1
10352Performance of bitbake -S is horribleJianxun ZhangACCEPTEDenhancementHigh2.3 M1
10353oeqa allow to filter tests based on different criteriaMariano LopezIN PROGRESS IMPLEMENTATIONenhancementMedium+2.3 M1
10359Improve taskhash mismatch diagnosticsRichard PurdieNEWenhancementMedium+2.3 M1
10368bitbake event don't have unittestsJair GonzalezIN PROGRESS DESIGNenhancementMedium+2.3 M1
10369Performance degradation on eSDK, install time is twice on 2.1Paul EggletonIN PROGRESS IMPLEMENTATIONnormalMedium+2.3 M1
10376patchtest: deploy patchtest on serverMichael HalsteadNEWnormalMedium+2.3 M1
10383create test for subprocess calls to identify problemsStephano CetolaACCEPTEDenhancementMedium2.3 M1
10387Toaster when run with non git layers fails to add packages that are built separately into new custom imageSujith HIN PROGRESS REVIEWnormalMedium2.3 M1
10394Creation of component to emulate keyboard with USB-KM232Plauchu EdwinIN PROGRESS IMPLEMENTATIONenhancementHigh2.3 M1
10405[bitbake] Missing SRC_URI "path_spec" option for SVN fetcherScott RifenbarkIN PROGRESS DESIGNnormalMedium2.3 M110 Oct 2016: IN PROGRESS DESIGN
10411Provide a working python-pylint recipeDaniela PlascenciaIN PROGRESS IMPLEMENTATIONmajorMedium+2.3 M1
10423PKGSIZE double counts hard linked filesRoss BurtonNEWnormalMedium+2.3 M1
10426Kernel config warnings while building linux-yocto-4.8 for intel-corei7-64California SullivanIN PROGRESS REVIEWnormalMedium+2.3 M1
10428*.qemuboot.conf files are left in DEPLOY_DIR after other image artifacts are removedRobert YangIN PROGRESS REVIEWnormalMedium+2.3 M1
10433syslog-ng rc5.d symlinks missing after install, broken postinstMarkus LehtonenIN PROGRESS REVIEWnormalMedium+2.3 M1Need backport to 2.2.1
10437Improve PublishArtifacts (remove hard-coded paths & assumptions)Joshua LockNEWenhancementMedium+2.3 M1
10440Create a reference HW design and a python controlling library for a single power control unitPlauchu EdwinIN PROGRESS REVIEWnormalMedium2.3 M1
10441source-highlight-native world build failuresEd BartoshIN PROGRESS REVIEWmajorMedium+2.3 M1
10447eSDK: runqemu fails unless unless DEPLOY_DIR_IMAGE is setPaul EggletonACCEPTEDnormalMedium+2.3 M1
10448Package files already existed at Publishing Artifacts stepJoshua LockNEWmajorMedium+2.3 M1
10453add .inputrc file for the default users so the up arrow history worksRandy WittNEWenhancementLow2.3 M1
10454support the multiple containers working off 1 volume modelRandy WittNEWenhancementMedium+2.3 M1
10466Update BuildLog with build progressJoshua LockIN PROGRESS IMPLEMENTATIONenhancementMedium+2.3 M1
10467Link to BuildLog entries from autobuilder UIJoshua LockNEWenhancementMedium+2.3 M1
10478run-postinsts doesn't update package manager database on target deviceJussi KukkonenIN PROGRESS REVIEWnormalMedium+2.3 M1Backport to YP 2.2.1 and 2.1.2
10481[Test Case 1059] Parselogs is failing on genericx86 (32 and 64 bits) WIC giving error: GPT: Use GNU Parted to correct GPT errors.Jair GonzalezIN PROGRESS REVIEWnormalMedium2.3 M1
10488Changing Git revision in Toaster has no effectDavid ReynaNEWnormalMedium+2.3 M1
10498adwaita install failed on autobuilderRoss BurtonNEWnormalMedium+2.3 M1
10502Ensure BuildLogger doesn't try and update whilst the target wiki page is being editedJoshua LockIN PROGRESS DESIGNenhancementMedium+2.3 M1
10503Enable the capability to check the details of an image when is already bootedAníbal LimónNEWenhancementMedium2.3 M1
10505Extensible SDK: make it easier to track changes to the metadataPaul EggletonNEWenhancementMedium+2.3 M1
10506Patchwork: Create new Build-test wizardJose LamegoIN PROGRESS DESIGNnormalMedium+2.3 M1
10508bitbake fetcher does not always check for trusted_networkMarkus LehtonenIN PROGRESS REVIEWmajorMedium+2.3 M1
10528Add VNC support for cli containers for QEMUTodor MinchevNEWenhancementMedium2.3 M1
10530add dumbinit as entry point for crops containersRandy WittNEWenhancementMedium2.3 M1
10531Oomph installer script for Developer environment setupTim OrlingIN PROGRESS DESIGNenhancementMedium+2.3 M1
10532Create Target file definition for Eclipse CROPS PluginTim OrlingIN PROGRESS REVIEWenhancementHigh2.3 M1
10533Enable Maven/Tycho Command line build for Eclipse CROPS pluginTim OrlingIN PROGRESS IMPLEMENTATIONenhancementMedium+2.3 M1
10534Create docker container to run RCPTT for Eclipse CROPS pluginTim OrlingIN PROGRESS IMPLEMENTATIONenhancementMedium+2.3 M1
10537Use "new project template" framework to create sample Make projectbrian averyNEWenhancementMedium2.3 M1
10538Use "new project template" framework to create sample Automake projectbrian averyNEWenhancementMedium2.3 M1
10540Use "new project template" framework to create sample CMake projectbrian averyNEWenhancementMedium2.3 M1
10556Docker tooling support to manipulate CROPS containers from the Eclipse CROPS pluginbrian averyNEWenhancementMedium+2.3 M1
10569Integrate DevAuto USB multiplexer module to AFTBenjamin EsquivelIN PROGRESS IMPLEMENTATIONenhancementMedium+2.3 M1
10579create the devauto command line interfaceBenjamin EsquivelACCEPTEDenhancementMedium+2.3 M1
10581Provide example production settings fileMichael WoodIN PROGRESS REVIEWnormalMedium2.3 M1
10583buildstats.bbclass + pybootchart: record and render system utilization statisticsPatrick OhlyIN PROGRESS IMPLEMENTATIONenhancementMedium+2.3 M1
10594Ensure all options of WIC script are testedJair GonzalezACCEPTEDnormalMedium+2.3 M1
10597license_create_manifest fails when linux-dummy is used to create own kernelRoss BurtonNEWnormalMedium+2.3 M1
10600Extensible SDK: add a more practical means of adding components at build timePaul EggletonNEWenhancementMedium+2.3 M1
10608[Test Case 1059] dmesg log shows various error on NUC with image corei7California SullivanNEWnormalMedium2.3 M1
10609The TestLandingPage browser test is failing.brian averyNEWnormalMedium2.3 M1
10611[Test Case 1059] Parselogs is failing on corei7-64 in Joule giving several error messages.California SullivanNEWnormalMedium+2.3 M1
10612Don't perform git clone on shared volumeStephano CetolaIN PROGRESS IMPLEMENTATIONnormalHigh2.3 M1
10614[Test Case 204] intel-corei7-64 sato, lsb and wic images doesn't boot on Cherry Hill platformCalifornia SullivanNEWmajorMedium+2.3 M1
10625Don't show "Series without cover letter" for series without cover letterJose LamegoIN PROGRESS REVIEWenhancementMedium+2.3 M1
10627Way to navigate through patches in a seriesJose LamegoACCEPTEDenhancementMedium+2.3 M1
10630Toaster: protect against circular Layer dependenciesDavid ReynaIN PROGRESS REVIEWnormalMedium+2.3 M1
10631Fix missing close bracketDavid ReynaIN PROGRESS REVIEWnormalMedium+2.3 M1
10632Add distro selection supportDavid ReynaNEWenhancementMedium2.3 M1
10635matchbox-window-manager: _NET_CURRENT_DESKTOP is not implemented correctlyJussi KukkonenNEWnormalMedium+2.3 M1
10640Parselog: dmi: Firmware registration failed.California SullivanNEWnormalMedium2.3 M1
10647core-image-minimal: do_testsdkext failedRobert YangIN PROGRESS REVIEWmajorMedium+2.3 M1
10650Import non-git layer directory path input validation is incorrectDavid ReynaIN PROGRESS IMPLEMENTATIONnormalMedium2.3 M1
10651bitbake -g world is brokenRichard PurdieIN PROGRESS REVIEWmajorMedium+2.3 M1
10654Investigate binary component functionalityStephano CetolaIN PROGRESS IMPLEMENTATIONnormalMedium+2.3 M1
10655Add support for ZephyrJuro BystrickyACCEPTEDenhancementHigh2.3 M1
10665swupd + tar extraction errors + IMAPatrick OhlyIN PROGRESS REVIEWnormalMedium2.3 M1
10666pack-from-0-*.tar lacks symlinksPatrick OhlyIN PROGRESS REVIEWnormalMedium2.3 M1
10668shell parser fails when using & for background processesPatrick OhlyIN PROGRESS REVIEWnormalMedium+2.3 M1
10669apt package missing systemd files IN PROGRESS REVIEWnormalMedium2.3 M1
10670AUH: Upgrade status email should indicate the URL of the log folder instead of the tar's URLPlauchu EdwinIN PROGRESS REVIEWnormalMedium+2.3 M1
10671RMC: Compiling error with musl C libraryJianxun ZhangIN PROGRESS REVIEWnormalMedium+2.3 M1
10676cooker: event queue overflowedRichard PurdieNEWnormalMedium+2.3 M1
10678Drop usage/support of bb.data.expand() and replace with d.expand()Joshua LockNEWenhancementMedium+2.3 M1
10679Drop unneeded expansion parameter to getVar and getVarFlagJoshua LockIN PROGRESS REVIEWenhancementMedium+2.3 M1
10680multiconfig globbing supportJuro BystrickyIN PROGRESS DESIGN COMPLETEenhancementMedium+2.3 M1
10686oeqa: migrate runtime to use the new frameworkMariano LopezIN PROGRESS DESIGNnormalMedium+2.3 M1
10687oeqa: migrate sdk to use the new frameworkAníbal LimónIN PROGRESS IMPLEMENTATIONnormalMedium+2.3 M1
10701create overview of update mechanismsPatrick OhlyIN PROGRESS DESIGN COMPLETEenhancementMedium+2.3 M1
10702add meta-swupd to update mechanism overviewPatrick OhlyACCEPTEDenhancementMedium2.3 M1
10713Allow testimage to work with slirp in addition to working with tun/tapRandy WittACCEPTEDnormalMedium+2.3 M1
10718send-pull-request: Avoid creating duplicated email reference headersJose LamegoIN PROGRESS REVIEWnormalMedium+2.3 M1
10719Newly created recipe from the yocto-layer script fails to buildAlejandro HernandezIN PROGRESS REVIEWnormalMedium+2.3 M1
10721patchtest-oe: improve issue and fix strings for test_mbox_format testDaniela PlascenciaACCEPTEDminorMedium+2.3 M1
10740Handle exceptions while populating data to transmit using xmlrpcSujith HNEWnormalMedium+2.3 M1
10742Update GStreamer to 1.10.1Jussi KukkonenIN PROGRESS REVIEWnormalMedium+2.3 M1
10753QA Kernel-dev test cases basic functionalityFrancisco PedrazaNEWenhancementMedium+2.3 M1
4144Runtime performance testingHumberto IbarraACCEPTEDenhancementMedium+2.3 M2
4420No init scripts in core-image-sato with systemd if 'sysvinit' is not in DISTRO_FEATURESChen QiIN PROGRESS IMPLEMENTATIONenhancementMedium2.3 M2
5049Create a WDD like charts for the Performance Test script that we are running regularlyMarkus LehtonenIN PROGRESS DESIGNnormalMedium+2.3 M2TRT
5158LSB printing tests: 11 failures for 'Printing Tests'dengkeWaitForUpstreamnormalMedium2.3 M2
5470+bitbake-layers cannot be used with memory resident bitbake runningAníbal LimónIN PROGRESS IMPLEMENTATIONnormalHigh2.3 M2
5477Check for any performance degradations with gcc security flags enabledHumberto IbarraACCEPTEDenhancementMedium+2.3 M2
5478test build time performance degradations with gcc security flags enabledHumberto IbarraACCEPTEDenhancementMedium+2.3 M2
5697busybox: ptest cases faileddengkeWaitForUpstreamnormalMedium2.3 M2
5698bash: ptest cases faileddengkeACCEPTEDnormalMedium2.3 M2
5866Reproducible builds: identical binariesJuro BystrickyNEWenhancementHigh2.3 M2
6128Incorrect wildcard unpack behaviour in fetcherLeonardo Sandoval GonzalezACCEPTEDnormalMedium2.3 M2
6129Local directories unpack to a different location than local filesLeonardo Sandoval GonzalezACCEPTEDnormalMedium2.3 M2
6287Release scripts for BSPs/images.Tracy GraydonNEWenhancementMedium2.3 M2
6319Automated storage and graphing of build performance metricsMarkus LehtonenNEWenhancementMedium+2.3 M2TRT
6359Include QA tests for kernel-dev manual tasksFrancisco PedrazaIN PROGRESS DESIGNenhancementMedium+2.3 M2
6428Improve the ability to isolate changes that have caused a rebuildRichard PurdieNEWenhancementMedium+2.3 M2
6432Document an example SDK usage workflowPaul EggletonACCEPTEDenhancementMedium+2.3 M210 Oct 2016: Some thoughts about the solution
6437Document how to set up the Yocto Project for production workPaul EggletonACCEPTEDenhancementMedium+2.3 M2
6618Make the layer name searchable and show item page when search returns only one resultJose LamegoNEWenhancementMedium2.3 M2
6630linux-yocto: kernel-dev package does not include target arch scripts binariesBruce AshfieldIN PROGRESS IMPLEMENTATIONenhancementMedium2.3 M2
6803Comprehensive large file supportRoss BurtonNEWenhancementMedium+2.3 M2
6926Create yocto-bsp testsuiteHumberto IbarraACCEPTEDenhancementMedium2.3 M2
7174AUH can't tell when MACHINE is set with = in local.conf and thus multi-machine build won't workAníbal LimónACCEPTEDnormalLow2.3 M2
7314Audit all recipes for proper CONFFILES assignmentRobert YangNEWenhancementMedium+2.3 M2
7459Implement the use of host USB devices on Linux for qemu machinesRobert YangNEWenhancementMedium2.3 M2
7526add test for checking if fontcache is created inside an imageJose Perez CNEWenhancementMedium2.3 M2
7557distrodata/distro_check should use BPNAníbal LimónNEWenhancementMedium2.3 M2
7683Provide means of turning a recipe change into a bbappendPaul EggletonNEWenhancementMedium+2.3 M2
7710devtool: deploy-target: interact with target packaging where availableChen QiIN PROGRESS DESIGNenhancementMedium2.3 M2
7887Add support for user networking to runqemuRobert YangIN PROGRESS REVIEWenhancementMedium2.3 M2
7909RRS: Track patches and Upstream-Status informationPlauchu EdwinNEWenhancementMedium2.3 M2
8126Messages are missing when "IMAGE_FSTYPES" field is not properly editedDavid ReynaACCEPTEDnormalMedium2.3 M2
8133RRS should handle upstream repositories without version tagsPlauchu EdwinIN PROGRESS DESIGNenhancementMedium2.3 M2GUI design available
8191apply kernel config fragments to arbitrary kernelsBruce AshfieldIN PROGRESS IMPLEMENTATIONenhancementLow2.3 M2
8200Add acl to default DISTRO_FEATURES?Ross BurtonNEWenhancementMedium2.3 M2
8332Add a broken recipe for testing purposesJose Perez CNEWenhancementMedium2.3 M2
8400rrs: add the cause of an unknown recipe versionPlauchu EdwinNEWenhancementMedium2.3 M2
8493Automate manual BSP test casesLeonardo Sandoval GonzalezNEWenhancementMedium+2.3 M2
8502Store BSPs Firmware and HW info for BSP test casesFrancisco PedrazaACCEPTEDenhancementMedium2.3 M2
8504Identify and add if needed BSP test cases specific to meta-intelFrancisco PedrazaACCEPTEDenhancementMedium2.3 M2
8570problems with gdk-pixbuf and pango loading on multilibRobert YangNEWnormalMedium+2.3 M2
8596Document proper way of adding a userspace header for the kernelScott RifenbarkNEWenhancementMedium2.3 M2
8631Fully document sysroot populationScott RifenbarkIN PROGRESS DESIGNenhancementMedium2.3 M222 Sept 2016: IN PROGRESS DESIGN
8673distutils3 packages installed via an egg file cannot be imported by the python3 interpreterJose LamegoACCEPTEDenhancementMedium+2.3 M2
8676devtool: extend oe-selftest testing for devtool upgradeLeonardo Sandoval GonzalezACCEPTEDenhancementMedium2.3 M2
8699offer a way to use sstate-object hashes as dependencies of builds/packagesJoshua LockACCEPTEDenhancementMedium+2.3 M2
8714Patchwork frontend page for incoming patch testingJose LamegoIN PROGRESS DESIGNenhancementMedium+2.3 M2
8715Update patchwork / build status page on patch test build completionJose LamegoACCEPTEDenhancementMedium+2.3 M2
8716Build summary page for incoming patch testingJose LamegoNEWenhancementMedium+2.3 M2GUI design pending
8724Automate information collection for runtime errorsTodor MinchevNEWenhancementMedium+2.3 M24
8727fetcher: should not log errors but pass them for handlingJose LamegoNEWenhancementMedium2.3 M2
8879opkg-utils is built when build lib32-imageRobert YangIN PROGRESS IMPLEMENTATIONmajorMedium+2.3 M2
8919Code coverage: add ability to create coverage-based test exclusion reportsLeonardo Sandoval GonzalezNEWenhancementMedium2.3 M2
8921Code coverage: add ability to create missing 'coverage area' reportsLeonardo Sandoval GonzalezNEWenhancementMedium2.3 M2
8938oe-selftest: refactor command line arguments so usage is simplerMariano LopezIN PROGRESS REVIEWenhancementMedium+2.3 M2
8943RRS: Add a function hook that would process upstream and recipe versionsPlauchu EdwinNEWenhancementMedium2.3 M2
8962AUH: Add support for meta-intelLeonardo Sandoval GonzalezACCEPTEDenhancementMedium+2.3 M2
9001bootimg.bbclass does not ducument GRUB boot lodader supportScott RifenbarkACCEPTEDnormalMedium2.3 M227 Jan 2016: NEEDINFO
9069perf: missing python modules for scripts in 'perf report'Bruce AshfieldIN PROGRESS REVIEWnormalMedium2.3 M2
9070Add test that locales are workingJose Perez CNEWenhancementMedium2.3 M2
9080Autobuilder/oe-selftest: Have a way to specify a which oe-self tests get run on a forced AB jobAníbal LimónNEWnormalMedium2.3 M2
9081RRS should respect DEFAULT_PREFERENCE when multiple versions of the same recipe are availablePlauchu EdwinIN PROGRESS DESIGNnormalMedium2.3 M2
9085Build QA Warnings: add a test for unlisted dependenciesJose Perez CNEWnormalMedium2.3 M2
9090extensible sdk test compatibility with sdkFrancisco PedrazaIN PROGRESS IMPLEMENTATIONenhancementMedium+2.3 M2
9104ffmpeg libraries are missing -dbg packagingRoss BurtonNEWnormalMedium+2.3 M2
9132Toaster automated testing inclusion at the AutobuilderSonia DelgadoACCEPTEDenhancementMedium+2.3 M2
9133Eclipse plugin testing integrate into ABHumberto IbarraACCEPTEDenhancementMedium2.3 M2
9187[meta-swupd] implement generic versions of the update helper scripts in oe-swupd-helpersJoshua LockNEWnormalMedium2.3 M2
9188[meta-swupd] Remove hard-coded paths from swupd-clientJoshua LockWaitForUpstreamnormalMedium2.3 M2
9261Can't distinguish between delayed and failed postinstRoss BurtonNEWenhancementMedium+2.3 M2
9308patchtest: improve signal handling when the process is interruptedDaniela PlascenciaACCEPTEDenhancementMedium2.3 M2
9369Extensible SDK: oe-selftest test does not test that update actually worksFrancisco PedrazaNEWnormalMedium2.3 M2
9372Ptest for acl hang because of lack of two user bin and daemonChen QiACCEPTEDcriticalMedium2.3 M2
9391refactor syslinux.bbclass, grub-efi.bbclass and gummiboot.bbclassRobert YangNEWenhancementMedium+2.3 M2
9449[meta-swupd] Reduce runtime of do_swupd_updatePatrick OhlyACCEPTEDenhancementMedium+2.3 M2
9460Provide a way to automate testing of meta-mingw and meta-darwin layers.Joshua LockNEWenhancementMedium+2.3 M2
9468Export Tests execution (Runexport.py) execution log needs improvementsMariano LopezNEWenhancementMedium2.3 M2
9484Port QA UI tests to Toaster's Django+Selenium frameworkSonia DelgadoNEWnormalMedium2.3 M2
9511Provide support for swupd manifest includesJoshua LockNEWenhancementMedium2.3 M2
9525Make install prompt available on all consolesCalifornia SullivanACCEPTEDenhancementMedium2.3 M2
9588Create a method for describing builds and desired output. aka a build descriptorbrian averyNEWenhancementMedium+2.3 M2
9589Create a script for consuming a "build descriptor"brian averyNEWenhancementMedium+2.3 M2
9612functions used in recipes and recipe examples (like bb.utils.contains) not documented.Joshua LockACCEPTEDnormalMedium2.3 M2Waiting on 9725 (7/8/16)
9675Replacing/updating smartpm/createrepoAlexander KanavinNEWenhancementMedium+2.3 M2
9678Include automated test execution and reporting in AutobuilderAníbal LimónACCEPTEDenhancementMedium+2.3 M2
9708oe-selftest --list-tests with options to control fields shownLeonardo Sandoval GonzalezACCEPTEDenhancementMedium+2.3 M2
9743builds: The search result of the content of the builds table is incorrectDavid ReynaNEWnormalMedium2.3 M2
9770oe-selftest: test import of tests from other layersMariano LopezIN PROGRESS REVIEWenhancementMedium2.3 M2
9783Implement automated testing for meta-swupdJoshua LockNEWenhancementMedium+2.3 M2
9808Create selenium tests for project dashboard pageDavid Lopez BarribaNEWnormalMedium2.3 M2
9867yocto-bsp: listing values for some properties throws exceptionLeonardo Sandoval GonzalezACCEPTEDnormalMedium+2.3 M2
9878feature request: secure boot layerCalifornia SullivanNEWenhancementMedium+2.3 M2
9880Support locale archivesRoss BurtonNEWenhancementMedium2.3 M2
9894Investigate porting smartpm, createrepo to python3Chen QiACCEPTEDenhancementMedium+2.3 M2
9927yocto-bsp: listing properties stdout and data send to -o option should be the sameLeonardo Sandoval GonzalezNEWnormalMedium2.3 M2
9928yocto-bsp: logical if statements should be avoided in json return by list subcommandLeonardo Sandoval GonzalezNEWnormalMedium2.3 M2
9930o-selftest: add a coverage subcommand to handle coverage related tasksMariano LopezNEWenhancementMedium2.3 M2
9944patchtest-oe: check that patch was sent to the correct mailing listDaniela PlascenciaNEWenhancementMedium2.3 M2
9945patchtest-oe: check pull request series against git repositoryLeonardo Sandoval GonzalezNEWenhancementMedium2.3 M2
9946patchtest: must be able to test the series on every branch specified on mbox summaryLeonardo Sandoval GonzalezNEWenhancementMedium2.3 M2
9960patchtest-oe: implement 'selftest' validation patches for the test suiteLeonardo Sandoval GonzalezNEWenhancementMedium2.3 M2
9962Suggested additions to the --help output re. -v and -DScott RifenbarkNEWenhancementMedium2.3 M2
9997oe-selftest: make available unittest-xml-reporting at the autobuilder workersMichael HalsteadNEWnormalMedium2.3 M2
9998packaging: src separately from dbgLeonardo Sandoval GonzalezNEWenhancementMedium2.3 M2
10058patchtest-oe: check SUMMARY presence on new recipesLeonardo Sandoval GonzalezIN PROGRESS IMPLEMENTATIONenhancementMedium2.3 M2
10063testimage: Add tests for apt/dpkg like smart/rpm onesFrancisco PedrazaACCEPTEDenhancementMedium2.3 M2
10084RMC: Deploy central database file without dependency on EFI bootloaderJianxun ZhangNEWenhancementMedium2.3 M2
10095Suggested documentation for the currently undocumented *_task-foo override syntaxScott RifenbarkIN PROGRESS REVIEWnormalMedium2.3 M208 August 2016: IN PROGRESS REVIEW
10113native reicpes does not include runtime dependencies when populating sysrootRichard PurdieNEWmajorMedium+2.3 M2
10147Create a tool to compare the automated test list against the Testopia Test list DBJair GonzalezACCEPTEDenhancementMedium2.3 M2
10165bitbake fails with "Please use a locale setting which supports utf-8"Ross BurtonNEWnormalMedium+2.3 M2
10193bitbake: improve --dump-signatures=SIGNATURE_HANDLERRobert YangNEWenhancementMedium2.3 M2
10200Create Test Plan for Tinfoil verificationJose Perez CACCEPTEDenhancementMedium+2.3 M2
10212Support to deploy non-bootloader-specific files in EFI partition when build hddimg imageTodor MinchevNEWnormalMedium2.3 M2
10215Add a class which allows buiding git upstream versions of code using BBCLASSEXTENDRoss BurtonIN PROGRESS IMPLEMENTATIONenhancementMedium+2.3 M2
10230oeqa refactor and improvements (master bug)Stephen K JolleyNEWenhancementMedium+2.3 M2
10232oeqa.utils: Audit/merge modules to avoid code duplicity and dependencies on bitbakeAníbal LimónNEWenhancementMedium+2.3 M2
10233oeqa: Runner add the ability to output XML test resultsMariano LopezACCEPTEDenhancementMedium+2.3 M2
10249runqemu: add test casesRobert YangNEWenhancementMedium+2.3 M2
10254esdk tests take very longLeonardo Sandoval GonzalezNEWnormalMedium2.3 M2
10332gummiboot: purge all gummiboot features and support from OEAlejandro HernandezIN PROGRESS REVIEWnormalMedium2.3 M2
10344multiconfig: TMPDIR not handled properlyRichard PurdieNEWnormalMedium+2.3 M2
10357multiconfig: error building meta-toolchainsRichard PurdieNEWnormalMedium+2.3 M2
10362yocto-bsp: several config fragments yield multiple warnings when building virtual/kernel'sLeonardo Sandoval GonzalezNEWnormalMedium+2.3 M2
10412Specifying milestone with a DISTRO_VERSION in format of MM.mm.pp will cause build to fail on GetDistroVersionJoshua LockNEWnormalMedium+2.3 M2
10415devtool: add: override preferred kernel when a new one is addedPlauchu EdwinNEWenhancementMedium+2.3 M2
10425poky-tiny distro shows Kernel config warnings during qemux86 buildAlejandro HernandezACCEPTEDnormalMedium2.3 M2Add release notes for 2.2
10429Add runtime dependencies for native "packages"Richard PurdieNEWenhancementMedium+2.3 M2
10449tar-native - task do_populate_sysroot_setscene fails - likely raceRoss BurtonNEWmajorMedium+2.3 M2
10450Reduce fuzz factor when patching filesAlexander KanavinIN PROGRESS DESIGNnormalMedium+2.3 M2LET
10452allow the samba container to host multiple volumesRandy WittNEWenhancementMedium2.3 M2
10457ppp: 4.8 kernel fix breaks builds with older external toolchainsRobert YangNEWnormalMedium2.3 M2
10473Fail to launch custom qemu image with runqemuLeonardo Sandoval GonzalezNEWnormalMedium+2.3 M2
10474Reduce runqemu's default loglevelRobert YangNEWnormalMedium2.3 M2
10477yocto-bsp: tool should output a conf file to be consume by the qemu runnerLeonardo Sandoval GonzalezNEWenhancementMedium+2.3 M2
10489"test_1_logrotate_setup" fails on second run of test image due existing filesJair GonzalezACCEPTEDenhancementMedium2.3 M2
10490Error on oeqa.runtime.rpm.RpmInstallRemoveTest when running testimageMarkus LehtonenACCEPTEDnormalMedium+2.3 M2
 500      
Warnings were generated during the execution of function
  1. Report truncated - count greater than max allowed 501 > 500

Old Queries

Personal tools