Bug Triage

From Yocto Project
(Difference between revisions)
Jump to: navigation, search
(NEEDINFO)
Line 167: Line 167:
 
{{#bugzilla:
 
{{#bugzilla:
 
   |status=NEEDINFO
 
   |status=NEEDINFO
 +
  |columns=id,summary,from,to,status,severity,priority,milestone
 +
  |sort=milestone
 +
  |noresultsmessage="No matching bugs found."
 +
  |total=summary
 +
}}
 +
 +
== Old Milestone ==
 +
{{#bugzilla:
 +
  |milestone= !(1.5.2, 1.6.1, 1.7, 1.7 M1, 1.7 M2, 1.7 M3, 1.7 M4, 1.7 M5, future)
 
   |columns=id,summary,from,to,status,severity,priority,milestone
 
   |columns=id,summary,from,to,status,severity,priority,milestone
 
   |sort=milestone
 
   |sort=milestone

Revision as of 17:51, 9 April 2014

Contents

Goal

The output of the bug triage meeting should be that all bugs have an owner, a target milestone, and a priority.

Prior to the meeting, each Product Owner should review their Weekly New and High Bugs and be ready with any opens. An example open would be a bug that may need to change Products.

Roles

  • Call facilitator: Jessica Zhang
    • Ensure we keep to the agenda, don't rathole on bug resolution, and stay within our time block.


Agenda

  • Opens
    • Collect opens
    • Discuss opens
  • Review Queries
    • State number and owner
    • Owner makes any modifications
    • Assign owner, target milestone, and priority.


Bug Criteria

  • Priority-Severity
    • High-Critical: Two Week
    • High: Milestone
    • Medium: Nice to have for milestone, must have for release


Bug Triage Searches

Non-Prioritized Bugs

IDSummary (43 tasks) SeverityPMilestoneAssigneeStatusWhiteboardE
8336[internalsolv] Problem when upgrading a package which depends on a new package (old issue #32)minorUndecided1.0Alejandro del CastilloNEW
8337Make opkg translatable (old issue #42)enhancementUndecided---Alejandro del CastilloNEW
8338ManpagesenhancementUndecided---Alejandro del CastilloNEW
8339Manpages (old issue #56)enhancementUndecided1.0Alejandro del CastilloNEW
8340libopkg needs a better error reporting mechanism (old issue #63)enhancementUndecided0.4Alejandro del CastilloNEW
8342[internalsolv] Opkg fails to attempt all satisfying dependencies after installing the first one fails (old issue #85)minorUndecided0.4Alejandro del CastilloNEW
8343Downgrade to Prefer (old issue #111)enhancementUndecided0.4Alejandro del CastilloNEW
8344update-alternatives: Support change of link path during upgrade (old issue #113)normalUndecided0.4Alejandro del CastilloNEW
8345Install package(s) only after download of all needed packages. (old issue #116)enhancementUndecided0.4Alejandro del CastilloNEW
8346Check for package list update before downloading (old issue #117)enhancementUndecided1.0Alejandro del CastilloNEW
8347Review performance of algorithms using pkg_vec (old issue #120)enhancementUndecided1.0Alejandro del CastilloNEW
8349dist-upgrade feature (old issue #126)enhancementUndecided1.0Alejandro del CastilloNEW
8350Customisable uid/gid translation during installation (old issue #129)enhancementUndecided0.4Alejandro del CastilloNEW
8351double entries in the info file (old issue #142)normalUndecided0.3.2Alejandro del CastilloNEW
8352Needs a more detailed error message if an upgarde is not possible (old issue #143)normalUndecided0.4Alejandro del CastilloNEW
8353Add multiple compression algorithms support (old issue #148)enhancementUndecided0.4Alejandro del CastilloNEW
8355Not possible to build static opkg 0.3 (old issue #158)normalUndecided0.4Alejandro del CastilloNEW
8356Opkg flag always returns successminorUndecided0.4Alejandro del CastilloNEW
8357Add comman line option to skip package signature check (old issue #161)normalUndecided0.4Alejandro del CastilloNEW
8359[internalsolv] --force-removal-of-dependent-packages does not remove packages depending on the removed package (old issue #163)normalUndecided0.4Alejandro del CastilloNEW
8360[internalsolv] Packages fail to install when Recommends can't be installed (old issue #165)normalUndecided0.4Alejandro del CastilloNEW
8537Feature request: new libopkg APIenhancementUndecided0.4Alejandro del CastilloNEW
8564Deprecated OpenSSL signing supportnormalUndecided---Alejandro del CastilloNEW
8565Add global preinst/postinst hooks to opkgenhancementUndecided---Alejandro del CastilloNEW
8598--offline-root works only when i install using ipk isntead of package namenormalUndecided---Alejandro del CastilloNEW
8599when i use force downgrade option i have to give full ipk pathnormalUndecided---Alejandro del CastilloNEW
8912[internalsolv] opkg remove --autoremove' does not fully uninstall product.normalUndecided---Alejandro del CastilloNEW
8931replaces field does not support version constrainsmajorUndecided0.3.2Alejandro del CastilloNEW
8946opkg install does not appear to fail on file overwritemajorUndecided0.4Alejandro del CastilloNEW
8947opkg conffile resolution cannot detect unmodified conffiles modified in upgraded packagemajorUndecided---Alejandro del CastilloNEW
8948Implement *.md5sums (or equivalent)enhancementUndecided---Alejandro del CastilloNEW
8972failed to add I2C device MSFT8000:00 from ACPI on MinnowBoard MaxnormalUndecided---He, TimIN PROGRESS DESIGN COMPLETE
9060If an install succeeds despite broken deps due to --force-depends, it still outputs a diagnostic that makes it look like it failednormalUndecided---Alejandro del CastilloNEW
9073When local path for src/gz is provided and temp directory is also provided opkg creates mutiple copies of debian packagesmajorUndecided---Alejandro del CastilloNEW
9238opkg-make-index reformats package description when generating repo index from package control filenormalUndecided--- NEW
9348Opkg requires root privileges for all operationsmajorUndecided---Alejandro del CastilloNEW
9372Ptest for acl hang because of lack of two user bin and daemoncriticalUndecided---Alexandru GeorgescuNEW
9373ptest for perl hangcriticalUndecided---Alexandru GeorgescuNEW
9392When running testimage test_syslog_startup_config failed getting test log string not found output grep: /var/log/test error messagenormalUndecided---Francisco PedrazaNEEDINFO
9434Running testimage test_parselogs failed getting the following error message failed to retrieve link info, disabling eDP on Minnowboard Max 32 and 64normalUndecided2.1 M4California SullivanNEEDINFO
9633Content of INSTALL file is incompatible with release source codeenhancementUndecided0.3.2Alejandro del CastilloNEW
9658Detect postinst failing verses asking to be delayed?normalUndecided---Alejandro del CastilloNEW
9677Update bugzilla instance to 5.X or greaternormalUndecided---Michael HalsteadNEW
 43       

Non-Targeted Bugs

Low bugs not included.

IDSummary (20 tasks) SeverityPMilestoneAssigneeStatusWhiteboardE
8165[libsolv] opkg_list_upgradable_cmd() does not work with an external solver enabled.normalMedium---Alejandro del CastilloNEW
8337Make opkg translatable (old issue #42)enhancementUndecided---Alejandro del CastilloNEW
8338ManpagesenhancementUndecided---Alejandro del CastilloNEW
8564Deprecated OpenSSL signing supportnormalUndecided---Alejandro del CastilloNEW
8565Add global preinst/postinst hooks to opkgenhancementUndecided---Alejandro del CastilloNEW
8598--offline-root works only when i install using ipk isntead of package namenormalUndecided---Alejandro del CastilloNEW
8599when i use force downgrade option i have to give full ipk pathnormalUndecided---Alejandro del CastilloNEW
8912[internalsolv] opkg remove --autoremove' does not fully uninstall product.normalUndecided---Alejandro del CastilloNEW
8947opkg conffile resolution cannot detect unmodified conffiles modified in upgraded packagemajorUndecided---Alejandro del CastilloNEW
8948Implement *.md5sums (or equivalent)enhancementUndecided---Alejandro del CastilloNEW
8972failed to add I2C device MSFT8000:00 from ACPI on MinnowBoard MaxnormalUndecided---He, TimIN PROGRESS DESIGN COMPLETE
9060If an install succeeds despite broken deps due to --force-depends, it still outputs a diagnostic that makes it look like it failednormalUndecided---Alejandro del CastilloNEW
9073When local path for src/gz is provided and temp directory is also provided opkg creates mutiple copies of debian packagesmajorUndecided---Alejandro del CastilloNEW
9238opkg-make-index reformats package description when generating repo index from package control filenormalUndecided--- NEW
9348Opkg requires root privileges for all operationsmajorUndecided---Alejandro del CastilloNEW
9372Ptest for acl hang because of lack of two user bin and daemoncriticalUndecided---Alexandru GeorgescuNEW
9373ptest for perl hangcriticalUndecided---Alexandru GeorgescuNEW
9392When running testimage test_syslog_startup_config failed getting test log string not found output grep: /var/log/test error messagenormalUndecided---Francisco PedrazaNEEDINFO
9658Detect postinst failing verses asking to be delayed?normalUndecided---Alejandro del CastilloNEW
9677Update bugzilla instance to 5.X or greaternormalUndecided---Michael HalsteadNEW
 20       

New This Week

IDSummary (21 tasks) SeverityPMilestoneAssigneeStatusWhiteboardE
9661upgrade oe-selftest to python 3normalMedium+2.2 M1Leonardo Sandoval GonzalezIN PROGRESS IMPLEMENTATION3
9666esdk: 'devtool build' fails due to certificates problemnormalMedium+2.2 M1Paul EggletonIN PROGRESS REVIEW
9657Saving an added variable seems to save all other added variablesnormalLow2.2Michael WoodNEW
9658Detect postinst failing verses asking to be delayed?normalUndecided---Alejandro del CastilloNEW
9659hidden symbol pthread_atforkmajorMedium+2.2 M1Khem RajNEW
9660Create a YP-2.2 test plan for SWUpdnormalMedium+2.2 M1Benjamin EsquivelNEW
9662patchdir fails silently if no trailing slash is presentnormalMedium+2.2 M2Markus LehtonenNEW
9663do_populate_lic assumes that license basenames are uniquenormalMedium2.2Markus LehtonenNEW
9664The old gstreamer1.0-plugins-bad recipe is causing errors and conflictsnormalMedium+2.2 M1Jussi KukkonenNEW
9665quoting bug in poky/scripts/contrib/mkefidisk.shnormalMedium2.2Troy D. HansonNEW
9667Image types in quick start guide should be appropriate and consistentnormalMedium+2.2 M2Jussi KukkonenNEW
9668libarchive doesn't respect disable-aclnormalMedium2.2Jussi KukkonenNEW
9669No category for OE-core/recipes-extendednormalMediumFutureMichael HalsteadNEW
9670Toaster does not set a correct MIME type for tasks' logs filesnormalLow2.2Elliot SmithNEW
9671UPSTREAM_CHECK_* variables needs documentationenhancementMedium2.2Scott RifenbarkNEW
9672Add documentation for package installation during runtime testingenhancementMedium2.2Scott RifenbarkNEW
9673perl ptest package tries to include generate_uudmap host executablemajorMedium+2.2 M2Aníbal LimónNEW1
9675Replacing/updating smartpm/createreponormalMedium+2.2 M1Mark HatleNEW
9676ToasterTables does not take into account the target when displaying package dependenciesnormalMedium+2.2 M1Michael WoodNEW
9677Update bugzilla instance to 5.X or greaternormalUndecided---Michael HalsteadNEW
9674Rename qemux86_64 to qemux86-64 in adt repo for 2.0.2 rc1normalUndecided---Bill RandleRESOLVED0.1
 21      4.1

High Bugs

IDSummary (21 tasks) SeverityPMilestoneAssigneeStatusWhiteboardE
7583Gather and allow reporting all types of errors, not just task failuresenhancementHigh2.2 M1Aníbal LimónIN PROGRESS DESIGN5
9293bitbake: Add support for trigger event on errors like exceptionsenhancementHigh2.2 M1Aníbal LimónIN PROGRESS IMPLEMENTATION5
9517Move to Bootstrap 3enhancementHigh2.2 M1Belen Barros PenaNEW
9559test reporting tool planenhancementHigh2.2 M1Benjamin EsquivelNEW5
9394bootstrap v2 License is not compatible with bitbake/toaster license.criticalHigh2.2 M1brian averyNEW
9298Autobuilder enable KVM on the cluster for x86, x86-64enhancementHigh2.2 M1Beth FlanaganNEW4.5
9581CVE-2016-2107, CVE-2016-2108, CVE-2016-2105, CVE-2016-2106, CVE-2016-2109, CVE-2016-2176majorHigh2.2 M1Jussi KukkonenIN PROGRESS REVIEW
9457patchtest: security check on incoming patchesenhancementHigh2.2 M1Leonardo Sandoval GonzalezACCEPTED5
9131Prelink breaks fork IFUNCmajorHigh2.2 M1Mark HatleIN PROGRESS IMPLEMENTATION10
4078A method to validate the contents of changes to recipes, configuration files and classesenhancementHigh2.2 M1Michael HalsteadNEWNIR 04/24, 05/01, 05/085
4431Set up buildhistory-web for autobuilderenhancementHigh2.2 M1Michael HalsteadACCEPTED3
7658patchwork: provide means of recording additional patch statusesenhancementHigh2.2 M1Michael HalsteadNEWNIR 04/24, 05/01, 05/084
8648Automatic testing of incoming patchesenhancementHigh2.2 M1Michael HalsteadNEWNIR 04/24, 05/01, 05/0810
8649Script to assemble patches for autobuilder testingenhancementHigh2.2 M1Michael HalsteadNEWNIR 04/24, 05/01, 05/0815
9130Update OE patchwork instanceenhancementHigh2.2 M1Michael HalsteadACCEPTED
9112pseudo connection startup/reworkenhancementHigh2.2 M1SeebsNEW
9588Create a method for describing builds and desired output. aka a build descriptorenhancementHigh2.2 M1Randy WittNEW5
9592Add a mechanism for creating build appliance as a container imageenhancementHigh2.2 M1Randy WittNEW4
7518Build multiple machines in the same bitbake invocationenhancementHigh2.2 M1Richard PurdieNEW15
9383Move to LSB 5enhancementHigh2.2 M2Ross BurtonNEW3
8647Script to analyse what areas a patch changes and what tests need runningenhancementHigh2.2 M3Leonardo Sandoval GonzalezACCEPTED13
 21       

Medium+ Bugs !(Future,1.7)

IDSummary (111 tasks) SeverityPMilestoneAssigneeStatusWhiteboardE
7469SDL package cannot be found on OpenSUSE 13.2normalMedium+1.6.4Juro BystrickyIN PROGRESS REVIEW2
7641CVE-2014-9365 python: failure to validate certificates in the HTTP client with TLS (PEP 476)normalMedium+1.7.4Armin KusterACCEPTED5
8487PTEST image does not install on hdd on 1.8.1normalMedium+1.7.4Armin KusterIN PROGRESS IMPLEMENTATION1
9652boot and install from USB failed getting [sdc] error messagemajorMedium+1.8.3Jianxun ZhangNEW
9654Ogg media file audio is not working on NUC and MMaxnormalMedium+1.8.3Saul WoldNEW
9353yocto-bsp: script using different kernel than the one given when creating bspnormalMedium+2.0.2Humberto IbarraIN PROGRESS REVIEW0.5
8028Garbage in SDK manifest filenormalMedium+2.0.2Mariano LopezIN PROGRESS REVIEW3
7991qemuppc bootup failure with oe-core toolchain (with systemd)normalMedium+2.0.2Mark HatleIN PROGRESS IMPLEMENTATION
8092Implementation of the function glXChooseFBConfig in the libGL.so does not match OpenGL documentationnormalMedium+2.0.2Otavio SalvadorWaitForUpstream
8877WebKitGTK+ Security AdvisoriesnormalMedium+2.0.2ytaoNEW
9302Failed to start qemu with toolchain sysrootnormalMedium+2.1.1brian averyNEW
9362Failed to run and debug a project to qemux86 in EclipsenormalMedium+2.1.1brian averyNEW3
9472[NO USB support ] Beaglebone black latest yoctomajorMedium+2.1.1Kevin HaoIN PROGRESS REVIEW1
9520test_parselogs failed on udevd[342] inotify_add_watch /dev/loop when running test imagenormalMedium+2.1.1Saul WoldNEW
9105[MARS] Cannot install eclipse-poky pluginnormalMedium+2.1.1Tim OrlingIN PROGRESS IMPLEMENTATION1.5
7968empty page states for no information in the databasenormalMedium+2.2Belen Barros PenaNEWGUI design pending5
1989Default module selections need attentionminorMedium+2.2Bruce AshfieldIN PROGRESS IMPLEMENTATION4
8037External link to recipe file links to non-existing page when recipe information comes from a buildnormalMedium+2.2David ReynaIN PROGRESS IMPLEMENTATION5
8440Toaster has some issues when showing builds that fail at the build request stagenormalMedium+2.2Elliot SmithIN PROGRESS REVIEWGUI design available8
8556Toaster: bitbake variables image_fstypes not being passed to build processnormalMedium+2.2Elliot SmithIN PROGRESS IMPLEMENTATION15
9594Toaster is not showing properly image files for buildsnormalMedium+2.2Elliot SmithNEW
8078useradd.bbclass: useradd_preinst not run when rebuilding on second MACHINEmajorMedium+2.2Maxin B. JohnACCEPTED3
8952Changes to the revision of an imported layer are not savednormalMedium+2.2Michael WoodNEW
9124Location of kernel sources is incorrectnormalMedium+2.2Tom ZanussiIN PROGRESS REVIEW2
8192python3.4.3 os.fork and os.waitpidminorMedium+2.2 M1Alejandro HernandezACCEPTED15
8142avahi daemon fails to start on systemd while testing core-image-satonormalMedium+2.2 M1Aníbal LimónACCEPTED5
8771test_smart_channel_add (oeqa.runtime.smart.SmartRepoTest) failed in AutobuildernormalMedium+2.2 M1Aníbal LimónIN PROGRESS DESIGN5
9660Create a YP-2.2 test plan for SWUpdnormalMedium+2.2 M1Benjamin EsquivelNEW
9617Create Toaster Docker production containernormalMedium+2.2 M1brian averyNEW1.5
9584upgrade toaster to Python3normalMedium+2.2 M1Ed BartoshIN PROGRESS IMPLEMENTATION5
9397[Autobuilder] - public WIC buildset artifactsnormalMedium+2.2 M1Beth FlanaganNEW0.5
9536oe-selftest: test_sstate_noop_samesigs failed due qmmp LICENSE_FLAGS_WHITELISTnormalMedium+2.2 M1Francisco PedrazaNEEDINFO1
9507Misleading error message when conf/bblayers has problemsnormalMedium+2.2 M1Geoffroy Van CutsemIN PROGRESS REVIEW1
8245dmesg qa check: fbcon_init: detected unhandled fb_set_par error (timeout case)normalMedium+2.2 M1Jianxun ZhangIN PROGRESS REVIEW0.1
9452[meta-swupd] update to latest swupd and adapt to changesnormalMedium+2.2 M1Joshua LockNEW2
9664The old gstreamer1.0-plugins-bad recipe is causing errors and conflictsnormalMedium+2.2 M1Jussi KukkonenNEW
9249patchwork: test that CVE patches contain the proper formattingnormalMedium+2.2 M1Leonardo Sandoval GonzalezACCEPTED1
9572sudoku-savant tarball not found when SDK testing on core-image-satonormalMedium+2.2 M1Leonardo Sandoval GonzalezACCEPTED1
9573openssh, subversion and ghostscript URLs fail on do_checkuri testnormalMedium+2.2 M1Leonardo Sandoval GonzalezIN PROGRESS REVIEW1
9661upgrade oe-selftest to python 3normalMedium+2.2 M1Leonardo Sandoval GonzalezIN PROGRESS IMPLEMENTATION3
8570problems with gdk-pixbuf and pango loading on multilibnormalMedium+2.2 M1Robert YangNEW2
8879opkg-utils is built when build lib32-imagemajorMedium+2.2 M1Robert YangIN PROGRESS IMPLEMENTATION5
9474epiphany doesn't work on ARMnormalMedium+2.2 M1Robert YangIN PROGRESS REVIEW1
9575Test SDK EXT failed on core-image-sato for MIPS architecturecriticalMedium+2.2 M1Robert YangNEW5
9577gen-lockedsig-cache fails when populating sdk ext on PPC architecturenormalMedium+2.2 M1Robert YangNEW3
9639cmake-native autodetects libidn-nativenormalMedium+2.2 M1Robert YangNEW
9675Replacing/updating smartpm/createreponormalMedium+2.2 M1Mark HatleNEW
9064do_unpack does not wipe old source treemajorMedium+2.2 M1Markus LehtonenIN PROGRESS REVIEW1
9351Issues using bitbake with externalsrc and gitnormalMedium+2.2 M1Markus LehtonenIN PROGRESS REVIEW1
9455When I try to make a new project toaster cries "Fields missing: projectversion"normalMedium+2.2 M1Michael WoodIN PROGRESS IMPLEMENTATION4
9676ToasterTables does not take into account the target when displaying package dependenciesnormalMedium+2.2 M1Michael WoodNEW
9038extensible sdk - generates empty manifests/needs file with what is installednormalMedium+2.2 M1Paul EggletonNEW2
9083Extensible SDK: SDK installation ERROR: Unexpected tasks left over to be executednormalMedium+2.2 M1Paul EggletonACCEPTED1
9177Failed to install jethro eSDK image from AutobuildermajorMedium+2.2 M1Paul EggletonNEW1
9626ERROR: core-image-sato-1.0-r0 do_testsdkext: Couldn't install the SDK EXT:normalMedium+2.2 M1Paul EggletonNEW
9666esdk: 'devtool build' fails due to certificates problemnormalMedium+2.2 M1Paul EggletonIN PROGRESS REVIEW
9317pseudo: incorrect xattr semantic for hardlinksnormalMedium+2.2 M1SeebsACCEPTED
8616arm64's multilib SDK is brokenmajorMedium+2.2 M1Chen QiIN PROGRESS REVIEW3
8642The "32" is a broken symlink in aarch64's mutilib SDKnormalMedium+2.2 M1Chen QiACCEPTED3
9608pkg-config 0.29 compilation error after gcc update (5.3 -> 6.1)criticalMedium+2.2 M1Khem RajIN PROGRESS REVIEW
9659hidden symbol pthread_atforkmajorMedium+2.2 M1Khem RajNEW
9555Create Toaster Docker containernormalMedium+2.2 M1Randy WittNEW1.5
9513Failed to install sdk_ext for i686normalMedium+2.2 M1Richard PurdieNEEDINFONIR 05/22
8273openjade-native doesn't remove from sysroot correctlynormalMedium+2.2 M1Ross BurtonNEW1
8555Reading shlibs providers sometimes failsnormalMedium+2.2 M1Ross BurtonNEW2
8988test_rpm_query_nonroot (oeqa.runtime.rpm.RpmInstallRemoveTest) - Failed to create new usernormalMedium+2.2 M1Ross BurtonNEWJethro Backport1
9104ffmpeg libraries are missing -dbg packagingnormalMedium+2.2 M1Ross BurtonNEW5
9242Relocate segments in native binaries when restoring from sstatenormalMedium+2.2 M1Ross BurtonNEW3
9281Changing SDK_OS hits warnings unless you wipe tmpnormalMedium+2.2 M1Ross BurtonNEW1
9342Vet subprocess callsnormalMedium+2.2 M1Ross BurtonNEW2
9508cross-localedef-native_2.22 fails to build on aarch64 hostnormalMedium+2.2 M1Ross BurtonIN PROGRESS REVIEW1
9554Add section for on-target debuggingnormalMedium+2.2 M1Ross BurtonNEW2
9606libjpeg-turbo fail to build with mips64-nf (soft float)normalMedium+2.2 M1Ross BurtonNEW
9655zip/unzip: needs to update SRC_URI failing in checkurinormalMedium+2.2 M1Ross BurtonIN PROGRESS REVIEW
9369Extensible SDK: oe-selftest test does not test that update actually worksnormalMedium+2.2 M1Stephano CetolaIN PROGRESS DESIGN2
8525selftest needs to control distro configurationnormalMedium+2.2 M1Bill RandleACCEPTED10
9632gcc: Security fix CVE-2016-4490normalMedium+2.2 M2Armin KusterNEW
9285Failed to build gobject-introspection for qemumips64 on i686 hostsnormalMedium+2.2 M2Alexander KanavinNEW1
9286Failed to build gst-player for qemuarm64 on Fedora23 i686normalMedium+2.2 M2Alexander KanavinNEW3
9673perl ptest package tries to include generate_uudmap host executablemajorMedium+2.2 M2Aníbal LimónNEW1
7095Can't install kernel-dev and kernel-devsrc togethernormalMedium+2.2 M2Bruce AshfieldIN PROGRESS IMPLEMENTATION4
8210Should be able to restart a crashed vnc servernormalMedium+2.2 M2Beth FlanaganNEW3
8443Builds that failed at the build request stage need a custom dashboardnormalMedium+2.2 M2Elliot SmithIN PROGRESS IMPLEMENTATIONLook at 84403
9475db locking - Nothing happens when you click the "Create custom image" buttonnormalMedium+2.2 M2Elliot SmithIN PROGRESS IMPLEMENTATION20
9667Image types in quick start guide should be appropriate and consistentnormalMedium+2.2 M2Jussi KukkonenNEW
9416rpm: tmpfile creation failsnormalMedium+2.2 M2Markus LehtonenACCEPTED3
9499license.bbclass find_license_files does not process LICENSE_pn variables correctlynormalMedium+2.2 M2Markus LehtonenACCEPTED1
9662patchdir fails silently if no trailing slash is presentnormalMedium+2.2 M2Markus LehtonenNEW
5470bitbake-layers cannot be used with memory resident bitbake runningnormalMedium+2.2 M2Paul EggletonIN PROGRESS IMPLEMENTATION5
8884Locked signature warning is shown even if package can be fetched from SSTATE_MIRRORSnormalMedium+2.2 M2Paul EggletonNEW1
9532useradd / extrausers chain pseudo, causing stack overflows (segfaults)normalMedium+2.2 M2SeebsNEW
8508Remove knowledge of MACHINE from distutils3normalMedium+2.2 M2Ross BurtonNEW3
9287Failed to build nativesdk-glibc for qemumips and qemumips64 on Fedora 23 i686normalMedium+2.2 M2Ross BurtonNEW1
9440SERIAL_CONSOLES_CHECK doesn't work if kernel console name and device node name differnormalMedium+2.2 M2Ross BurtonNEW1
9509Backport binutils bugfix: fix build of webkitgtk4 on aarch64normalMedium+2.2 M2Ross BurtonNEW1
9510gcc-cross-initial parallel make problem / build break (found on aarch64)normalMedium+2.2 M2Ross BurtonNEW2
9566devtool documentation is duplicated in dev and sdk manualsnormalMedium+2.2 M2Scott RifenbarkNEW
9491Enable explicit removal of support packages when not needednormalMedium+2.2 M2Stephano CetolaACCEPTED
7828Impossible to add a new image type in ToasternormalMedium+2.2 M2Sujith HACCEPTEDGUI design available4
9133Eclipse plugin testing integrate into ABnormalMedium+2.2 M3Aníbal LimónNEW5
5319Need a test to verify firstboot postinst script ordernormalMedium+2.2 M3Jose Perez CNEW43
9620Update layer index to django 1.8 ltsnormalMedium+2.2 M4Elliot SmithNEW5
8576QemuRunner logging for qemu start failure does not log anything to the console in oe-selftestmajorMedium+2.2 M4Jose Perez CNEW2
8578opkg-make-index skips some packages so the package index is not up to date during rootfs generationnormalMedium+2.2 M4Robert YangNEW5
6868Add support for 4gb DDR3 configurationnormalMedium+A3 ReleaseDavid AndersIN PROGRESS DESIGN COMPLETE
6865I2S support on LSE needs clock sourcenormalMedium+A4 ReleaseDavid AndersIN PROGRESS DESIGN COMPLETE
6927I2C Controller Intermittently Timeout and Lost ArbitrationmajorMedium+A4 ReleaseDavid AndersIN PROGRESS DESIGN COMPLETE
7719HDMI not working with TFP-401 DVI based devicesmajorMedium+A4 ReleaseDavid AndersACCEPTED
94701.8.1. documentation missing from the websitenormalMedium+Q2Michael HalsteadNEW
9522Documentation isn't cachablenormalMedium+Q2Michael HalsteadACCEPTED
9558Documentation for 1.7.3 is missingnormalMedium+Q2Michael HalsteadNEW
 111       

Medium+ Enhancements by Owner !(Future,1.7)

IDSummary (124 tasks) SeverityPMilestoneAssigneeStatusWhiteboardE
 0       
Aníbal Limón
9132Toaster integrate testing into AB/buildbotenhancementMedium+2.2 M1Aníbal LimónIN PROGRESS IMPLEMENTATION5
8480Extendable structure for test controller to support kinds of image flash methods and communication methods with DUTenhancementMedium+2.2 M2Aníbal LimónNEW7
8962AUH: Add support for meta-intelenhancementMedium+2.2 M2Aníbal LimónNEW3
9088Extensible SDK add tests for devtoolenhancementMedium+2.2 M2Aníbal LimónNEW3
9090extensible sdk test compatibility with sdkenhancementMedium+2.2 M2Aníbal LimónNEW1
9299Enable Tracing boot and process times in testing imagesenhancementMedium+2.2 M2Aníbal LimónNEW5
 6       
Belen Barros Pena
6238delete projects/builds through the toaster UIenhancementMedium+2.2Belen Barros PenaNEWGUI design pending2
6640Customise BitBake and layer versions in a projectenhancementMedium+2.3Belen Barros PenaNEWGUI design pending7
 2       
Benjamin Esquivel
6319Automated storage and graphing of build performance metricsenhancementMedium+2.2Benjamin EsquivelNEW5
 1       
Bruce Ashfield
9466enhance kernel configuration audit to include reasons for missing configs, and required config checkingenhancementMedium+2.2 M2Bruce AshfieldIN PROGRESS DESIGN COMPLETE7
8179It should be possible to disable kernel features using config fragmentsenhancementMedium+2.2 M3Bruce AshfieldIN PROGRESS IMPLEMENTATION10
 2       
California Sullivan
8773refactor yocto-kernel-cache common-pc / intel-common scc/cfg file to reduce delta & overlapenhancementMedium+2.2 M1California SullivanACCEPTED11
 1       
Plauchu Edwin
7561Port beaglebone BSP to use xf86-video-modesettingsenhancementMedium+2.2 M1Plauchu EdwinIN PROGRESS REVIEW1
 1       
Beth Flanagan
9335[Autobuilder] Add support for display bitbake log errors in buildbot pageenhancementMedium+2.2 M1Beth FlanaganIN PROGRESS DESIGN4
9450Add automated runtime tests that use the musl libc rather than glibcenhancementMedium+2.2 M1Beth FlanaganNEW2
9460Provide a way to automate testing of meta-mingw and meta-darwin layers.enhancementMedium+2.2 M2Beth FlanaganNEW3
 3       
Elliot Smith
8563Improve detection and presentation of build artifactsenhancementMedium+2.2Elliot SmithNEW5
9023Improve the content of the "other artifacts" sectionenhancementMedium+2.2Elliot SmithNEWGUI design pending4
9631add state Transitions to progress bar as well as build progress.enhancementMedium+2.2Elliot SmithNEWGUI design pending10
9439Verify that the REST API works with httpsenhancementMedium+2.2 M2Elliot SmithIN PROGRESS REVIEW1
 4       
Humberto Ibarra
9563yocto-kernel script should use argparse instead of optparse libraryenhancementMedium+2.2 M1Humberto IbarraACCEPTED5
9564yocto-layer script should use argparse instead of optparse libraryenhancementMedium+2.2 M1Humberto IbarraACCEPTED5
9635buildhistory-diff script should use argparse instead of optparse libraryenhancementMedium+2.2 M1Humberto IbarraACCEPTED5
9636wic script should use argparse instead of optparse libraryenhancementMedium+2.2 M1Humberto IbarraACCEPTED5
8938oe-selftest: refactor command line arguments so usage is simplerenhancementMedium+2.2 M2Humberto IbarraACCEPTED3
 5       
Jianxun Zhang
6362Runtime machine configurationenhancementMedium+2.2Jianxun ZhangACCEPTED10
8761[RMC]: Handle machine specific kernel command line differencesenhancementMedium+2.2 M1Jianxun ZhangIN PROGRESS IMPLEMENTATION15
9292Update Graphic recipes with candidate versions in planned Graphic Stack 2016Q1 ReleaseenhancementMedium+2.2 M1Jianxun ZhangACCEPTED0.1
 3       
jingwang
8482Support multi-nodes interoperability testingenhancementMedium+2.2jingwangNEW
8530runexported.py parameter support for: -m <machine arch>enhancementMedium+2.2 M1jingwangIN PROGRESS IMPLEMENTATION1
8531runexported.py parameter support for: -f <manifest>enhancementMedium+2.2 M1jingwangNEW
8533runexported.py parameter support for: -x <xunit>enhancementMedium+2.2 M1jingwangNEW
 4       
Jose Lamego
7654patchwork: ensure superseded patches are marked as suchenhancementMedium+2.2 M1Jose LamegoIN PROGRESS IMPLEMENTATION2
8704patchwork: support history tracking of patch statusenhancementMedium+2.2 M1Jose LamegoIN PROGRESS REVIEW3
8714Patchwork frontend page for incoming patch testingenhancementMedium+2.2 M1Jose LamegoNEWGUI design pending6
8715Update patchwork / build status page on patch test build completionenhancementMedium+2.2 M1Jose LamegoACCEPTED2
8716Build summary page for incoming patch testingenhancementMedium+2.2 M1Jose LamegoNEWGUI design pending4
8717patchwork: keep build page up-to-date with important patch status changesenhancementMedium+2.2 M1Jose LamegoNEW2
 6       
Jose Perez C
4527create a Runtime performance test layer to enable runtime performance testsenhancementMedium+2.2 M2Jose Perez CNEW3
5369Create test plan to do performance analysis of x32 runtimeenhancementMedium+2.2 M2Jose Perez CNEW3
4144Runtime performance testingenhancementMedium+2.2 M3Jose Perez CNEW2
4528boot time should be tracked for systemd and SysVinitenhancementMedium+2.2 M3Jose Perez CNEW2
5477Check for any performance degradations with gcc security flags enabledenhancementMedium+2.2 M3Jose Perez CIN PROGRESS IMPLEMENTATION2
5478test build time performance degradations with gcc security flags enabledenhancementMedium+2.2 M3Jose Perez CIN PROGRESS IMPLEMENTATION2
6296Add support for runtime performance tests to image_testsenhancementMedium+2.2 M3Jose Perez CNEW2
6359Include QA tests for kernel-dev manual tasksenhancementMedium+2.2 M3Jose Perez CNEW10
7376oe-selftest doesn't run lib/oe/tests/*enhancementMedium+2.2 M4Jose Perez CIN PROGRESS DESIGN3
 9       
Joshua Lock
9449[meta-swupd] Add libarchive backend to swupd-server to improve runtime of do_swupd_updateenhancementMedium+2.2 M1Joshua LockNEW5
9493Support dummy/empty bundlesenhancementMedium+2.2 M1Joshua LockIN PROGRESS IMPLEMENTATION1
9527Implement initial support for a stateless OSenhancementMedium+2.2 M1Joshua LockNEW10
9599Reduce bundle overheads by not depending on os-core when generating bundle sysrootsenhancementMedium+2.2 M1Joshua LockIN PROGRESS IMPLEMENTATION4
8699offer a way to use sstate-object hashes as dependencies of builds/packagesenhancementMedium+2.2 M2Joshua LockACCEPTED4
9448Add mechanism for running image level QA checksenhancementMedium+2.2 M2Joshua LockACCEPTED1
9538Review common security hardening flags and expand security_flags.incenhancementMedium+2.2 M2Joshua LockNEW10
 7       
Jussi Kukkonen
3169Implement Shuku proposalenhancementMedium+2.2 M1Jussi KukkonenIN PROGRESS IMPLEMENTATION15
8640Remove vala from oe-core?enhancementMedium+2.2 M1Jussi KukkonenACCEPTED2
8489Update DirectFB to git?enhancementMedium+2.2 M2Jussi KukkonenNEW1
 3       
Christopher Larson
9556The EFI bootloaders should deploy startup.nsh for wicenhancementMedium+2.2 M2Christopher LarsonIN PROGRESS REVIEW
 1       
Leonardo Sandoval Gonzalez
9244patchtest-oe: Create tests to validate recipes, classes or config filesenhancementMedium+2.2 M1Leonardo Sandoval GonzalezACCEPTED5
9401patchtest: show assertion messages on summaryenhancementMedium+2.2 M1Leonardo Sandoval GonzalezACCEPTED1
9403patchtest-oe: show the solution on the assertion messageenhancementMedium+2.2 M1Leonardo Sandoval GonzalezACCEPTED1
8433Add test for package postinstsenhancementMedium+2.2 M3Leonardo Sandoval GonzalezNEW4
8493Automate manual BSP test casesenhancementMedium+2.3Leonardo Sandoval GonzalezNEW5
8505Add Bluetooth testing suiteenhancementMedium+2.3Leonardo Sandoval GonzalezNEW5
8506Add WiFi testing suiteenhancementMedium+2.3Leonardo Sandoval GonzalezNEW5
8507Add NFC testing suiteenhancementMedium+2.3Leonardo Sandoval GonzalezNEW5
 8       
Robert Yang
8880Need better allarch multilib sanity or automated QA testsenhancementMedium+2.2 M1Robert YangNEW5
9454improve on why a recipe is builtenhancementMedium+2.2 M1Robert YangNEW10
9391refactor syslinux.bbclass, grub-efi.bbclass and gummiboot.bbclassenhancementMedium+2.2 M2Robert YangNEW10
 3       
Mariano Lopez
7850Handle native and target test dependency binaries in build test and export testenhancementMedium+2.2 M1Mariano LopezIN PROGRESS DESIGN10
8384Exported tests needs a test suiteenhancementMedium+2.2 M1Mariano LopezNEW2
8478Decoupling export test with Yocto build environmentenhancementMedium+2.2 M1Mariano LopezIN PROGRESS REVIEW5
8481Generate test tar balls for export testenhancementMedium+2.2 M1Mariano LopezIN PROGRESS REVIEW5
8536support un-extracted package (e.g. rpm) as one type of test binariesenhancementMedium+2.2 M1Mariano LopezIN PROGRESS REVIEW5
8694Add support for multiple binaries in one testenhancementMedium+2.2 M1Mariano LopezIN PROGRESS REVIEW5
9432Add test for exported test functionalityenhancementMedium+2.2 M1Mariano LopezNEW3
7515Add CVE testing toolenhancementMedium+2.2 M2Mariano LopezIN PROGRESS REVIEW10
9515update-rcd class should add build dependencies if requiredenhancementMedium+2.2 M2Mariano LopezNEW1
 9       
Markus Lehtonen
8974Add eSDK benchmarkingenhancementMedium+2.2 M1Markus LehtonenNEW2
9377Enable automated build performance testing in AutobuilderenhancementMedium+2.2 M1Markus LehtonenACCEPTED
9623Rewrite build-perf-test.sh in pythonenhancementMedium+2.2 M1Markus LehtonenNEW4
9624build-perf-test: store test results in GitenhancementMedium+2.2 M1Markus LehtonenNEW
9625build-perf-test: re-organize test output dataenhancementMedium+2.2 M1Markus LehtonenNEW
9338Support building optimised Python (with profile-opt make target)enhancementMedium+2.2 M2Markus LehtonenNEW
 6       
Michael Wood
9184Cannot delete layer from toaster databaseenhancementMedium+2.2Michael WoodNEWGUI design pending
9519Consolidate used API into it's own viewenhancementMedium+2.2 M2Michael WoodNEW
8132Implement deleting custom imagesenhancementMedium+2.2 M3Michael WoodNEWGUI design available4
 3       
Michael Halstead
7981Set up procedure for layer index database upgradesenhancementMedium+2.2 M1Michael HalsteadIN PROGRESS REVIEW2
 1       
Paul Eggleton
6432Document an example SDK usage workflowenhancementMedium+2.2 M1Paul EggletonACCEPTED2
6437Document how to set up the Yocto Project for production workenhancementMedium+2.2 M1Paul EggletonACCEPTED2
8657extensible SDK: improve handling for sanity checksenhancementMedium+2.2 M1Paul EggletonNEW1
9537recipetool: support node.js code outside of npmenhancementMedium+2.2 M1Paul EggletonNEW
7683Provide means of turning a recipe change into a bbappendenhancementMedium+2.2 M2Paul EggletonNEW4
9361Failed to reconfigure a project in Eclipse with eSDKenhancementMedium+2.2 M2Paul EggletonNEW3
9387Extensible SDK: add image customisation functionalityenhancementMedium+2.2 M2Paul EggletonNEW5
9613Extensible SDK: Improve perceived performance of preparation during installenhancementMedium+2.2 M2Paul EggletonNEW
 8       
Randy Witt
9004Produce container image providing extensible SDKenhancementMedium+2.2 M1Randy WittNEW4
9502Add a way to build container images using oe-coreenhancementMedium+2.2 M1Randy WittNEW3
9589Create a script for consuming a "build descriptor"enhancementMedium+2.2 M1Randy WittNEW5.34
 3       
Richard Purdie
3433Create Interactive bitbake commandline modeenhancementMedium+2.2Richard PurdieNEW15
7555make oe-init-build-env-memres default for 2.2enhancementMedium+2.2Richard PurdieNEW3
2398make bitbake work using python 3.xenhancementMedium+2.2 M1Richard PurdieIN PROGRESS IMPLEMENTATION
5534Bitbake resident server autoloading/unloadingenhancementMedium+2.2 M1Richard PurdieACCEPTED3
8554Support for self-contained "baremetal" CPU meta-layersenhancementMedium+2.2 M1Richard PurdieNEW3
9037Consider alternate methods for maintain Yocto releases after 1yrenhancementMedium+2.2 M1Richard PurdieNEW1
9255Allow rootfs tasks to run in parallel with rpmenhancementMedium+2.2 M1Richard PurdieNEW0.5
6428Improve the ability to isolate changes that have caused a rebuildenhancementMedium+2.2 M2Richard PurdieNEW5
 8       
Ross Burton
4634BitBake default 'dirs' in exec_func (${B}) causes build failuresenhancementMedium+2.2 M1Ross BurtonNEW5
8548Document best practises/style guide for selftest tests and update testsenhancementMedium+2.2 M1Ross BurtonNEW2
9261Can't distinguish between delayed and failed postinstenhancementMedium+2.2 M1Ross BurtonNEW3
6803Comprehensive large file supportenhancementMedium+2.2 M2Ross BurtonNEW5
6707Add ptest for curlenhancementMedium+2.2 M3Ross BurtonNEW3
6862input subsystem testingenhancementMedium+2.2 M3Ross BurtonNEW5
8584Enable building API documentationenhancementMedium+2.2 M3Ross BurtonNEW10
8851Add bashism checks for shell script functionsenhancementMedium+2.2 M3Ross BurtonIN PROGRESS IMPLEMENTATION5
 8       
Scott Rifenbark
9481Add example to "5.23. Debugging With the GNU Project Debugger (GDB) Remotely"enhancementMedium+2.2 M1Scott RifenbarkNEW
 1       
Stephano Cetola
8318Avoid unnecessary package feed churn due to packages rebuildingenhancementMedium+2.2Stephano CetolaACCEPTED4
 1       
Tim Orling
4209Extend our developer experience to enable system and app development on Windows or MacOSenhancementMedium+2.2Tim OrlingNEWThis is a placeholder bug for Eclipse for non Linux platform bug, the estimate will be reflected in the blocking bugs25
7820Replace Hob with Toaster in EclipseenhancementMedium+2.2Tim OrlingIN PROGRESS IMPLEMENTATION10
 2       
Bill Randle
8532runexported.py parameter support for: -a <tag>enhancementMedium+2.2 M1Bill RandleACCEPTED15
8534need export manifest files to SDK package under /conf/test/ folders of every layerenhancementMedium+2.2 M1Bill RandleIN PROGRESS REVIEW15
8535export the test scripts under all layers' ./lib/oeqaenhancementMedium+2.2 M1Bill RandleIN PROGRESS REVIEW15
8724Automate information collection for runtime errorsenhancementMedium+2.2 M1Bill RandleIN PROGRESS DESIGN410
 4       
He Zhe
6945kernel-dev: multiple kernel buildenhancementMedium+2.2 M1He ZheIN PROGRESS REVIEW4
 1       


Medium Bugs by Owner !(Future,1.7)

IDSummary (408 tasks) SeverityPMilestoneAssigneeStatusWhiteboardE
 0       
Armin Kuster
9601meta-qt5 Krogoth Branch Building Error During 'do_qa_staging'normalMedium2.1.1Armin KusterNEW
 1       
Alejandro del Castillo
8166[libsolv] libsolv's upgrade will not automatically remove orphaned dependantsenhancementMedium0.3.2Alejandro del CastilloNEW
8163opkg don't resume big upgrades (old issue #17)normalMedium1.0Alejandro del CastilloNEW
8165[libsolv] opkg_list_upgradable_cmd() does not work with an external solver enabled.normalMedium---Alejandro del CastilloNEW
 3       
Alejandro Hernandez
8613udev-extraconf: automount does not work with systemd >= 219normalMedium1.8.3Alejandro HernandezIN PROGRESS REVIEWCheck 2.0 also
9461upm PACKACGECONFIG fails to enable either python or nodejsnormalMedium2.2Alejandro HernandezACCEPTED1
8397ROOTLESS_X should be used as default for Poky BSPnormalMedium2.2 M1Alejandro HernandezACCEPTED3
7254PATCHRESOLVE's devshell opens up multiple new terminalsminorMedium2.2 M3Alejandro HernandezIN PROGRESS DESIGN7
8730separate code generating python manifest file from manifest information and improve the manifest generationnormalMedium2.2 M3Alejandro HernandezNEW4
 5       
Alexander Kanavin
6020should libmad be replaced with libmpg123 as the default mp3 decoder?enhancementMedium2.2Alexander KanavinNEW5
9212rework oe-core's handling of python and sysrootsnormalMedium2.2Alexander KanavinNEW10
9486security_flags.inc has many exception packages compiled without -PIE security flagnormalMedium2.2Alexander KanavinNEW5
9489security_flags.inc has exception packages compiled without any -fstack-protectornormalMedium2.2Alexander KanavinNEW5
 4       
Alexandru Roman
9484Port QA UI tests to Toaster's Django+Selenium frameworknormalMedium2.2 M1Alexandru RomanNEW25
 1       
Aníbal Limón
8667populate_sdk task fails when Debian packaging used in FIDOnormalMedium1.8.3Aníbal LimónACCEPTED3
9349Jethro build fails for core-image-x11 with package_debnormalMedium2.0.2Aníbal LimónIN PROGRESS DESIGN2
9017Sync and Upgrade AB configurationenhancementMedium2.2 M1Aníbal LimónNEW4
7557distrodata/distro_check should use BPNenhancementMedium2.2 M2Aníbal LimónNEW2
7588devtool: improve devtool build outputenhancementMedium2.2 M2Aníbal LimónNEW5
8727fetcher: should not log errors but pass them for handlingnormalMedium2.2 M2Aníbal LimónNEW2
9602Run automated tests on alternative C librariesnormalMedium2.2 M2Aníbal LimónNEW2
6996cyclic symlinks in rootfs cause user-space qemu to infinite loop on startupnormalMedium2.2 M3Aníbal LimónNEW10
7494AUH: Parallelize running bitbake inside AUH scriptenhancementMedium2.2 M3Aníbal LimónNEW5
8156lib/bb/fetch2/svn.py should support latest_versionstring()enhancementMedium2.2 M3Aníbal LimónNEW1
8735AUH: Use tinfoil instead of parse the recipe itselfenhancementMedium2.2 M3Aníbal LimónNEW5
 11       
Belen Barros Pena
7744Improve messaging in empty states when Toaster does not have any layer informationenhancementMedium2.2Belen Barros PenaNEWGUI design pending3
8034typeahead search cneeds words to indicate it is constrained to the added layers.normalMedium2.2Belen Barros PenaNEW2
9611Under Project->Bitbake variable, We disallow variables with a '/' in themnormalMedium2.2Belen Barros PenaNEW
6233Design model for project owner / userenhancementMedium2.3Belen Barros PenaACCEPTEDGUI design pending4
6701Provide an option to select layers from different branches within a Toaster projectenhancementMedium2.3Belen Barros PenaNEWGUI design pending7
 5       
brian avery
7972lsof needed by start/stop toaster script but not needed on system to run Yocto builds.normalMedium2.2brian averyNEW2
8189Variable history shows full paths to files inside the /bitbake directorynormalMedium2.2brian averyNEW2
9597swtbot initial implementation so that we can automate testing of the pluginnormalMedium2.2brian averyNEW
9621ostro.layers not copied from conf to workspacenormalMedium2.2 M1brian averyNEW
 4       
Bruce Ashfield
9656NFS boot failed due No working init found kernel panic on qemunormalMedium1.8.3Bruce AshfieldNEW
7096Document how to use initramfs featuresenhancementMedium2.2Bruce AshfieldIN PROGRESS DESIGN2
9480linux-yocto: make it work with arm big endianenhancementMedium2.2Bruce AshfieldACCEPTED7
96094.1.x: musb fails to compilenormalMedium2.2Bruce AshfieldWaitForUpstream
8289kernel_configme step should use "oldnoconfig" instead of "allnoconfig" when silently upgrading user defconfignormalMedium2.2 M1Bruce AshfieldIN PROGRESS DESIGN COMPLETE4
8743configme --allnoconfig breaks defconfig generated with kconfig / make savedefconfignormalMedium2.2 M1Bruce AshfieldIN PROGRESS IMPLEMENTATION3
3420Audit *-standard.scc and move non-hardware items up into standard.sccenhancementMedium2.2 M2Bruce AshfieldIN PROGRESS DESIGN6
6022kernel-dev: How do I know which features are available for KERNEL_FEATURES ?enhancementMedium2.2 M2Bruce AshfieldACCEPTED2
6630linux-yocto: kernel-dev package does not include target arch scripts binariesenhancementMedium2.2 M2Bruce AshfieldIN PROGRESS IMPLEMENTATION3
6767kernel version mismatched on some BSPsminorMedium2.2 M2Bruce AshfieldIN PROGRESS IMPLEMENTATION2
7418Perf/kernel-devsrc racenormalMedium2.2 M2Bruce AshfieldIN PROGRESS DESIGN3
7646KBUILD_DEFCONFIG does not work if config file is created as a result of patch to be appliednormalMedium2.2 M3Bruce AshfieldIN PROGRESS IMPLEMENTATION3
8970test_kernel_module fails with AssertionError: 137 != 0 : cd /usr/src/kernel && make scriptsnormalMedium2.2 M3Bruce AshfieldACCEPTED5
9125arm64 dmesg test fails show dmi Firmware registration failednormalMedium2.2 M3Bruce AshfieldACCEPTED2
9069perf: missing python modules for scripts in 'perf report'normalMedium2.2 M4Bruce AshfieldIN PROGRESS REVIEW3
 15       
California Sullivan
9462Boot and install from USB failed getting a xhci_hcd error after booting kernel panic is displayedmajorMedium2.1.1California SullivanACCEPTED3
9202[Test Case 898] Piglit 3D testing NUC (6i5SYH) s getting stuck when running script.normalMedium2.2California SullivanWaitForUpstream3
9267test_parselogs (oeqa.runtime.parselogs.ParseLogsTest) failed on NUC 6i5SYH, firmware load for i915/skl_guc_ver4.bin failednormalMedium2.2California SullivanACCEPTED3
9271[Test Case 1059] test_parselogs (oeqa.runtime.parselogs.ParseLogsTest)minorMedium2.2California SullivanACCEPTED3
9406dmesg test_parseLogs failed corei7-64 on NUC error BAR 14 and 15normalMedium2.2California SullivanACCEPTED2
9525Make install prompt available on all consolesenhancementMedium2.2California SullivanNEW4
95874.1.x: gpio-pca953x.c fails to compile without CONFIG_ACPInormalMedium2.2California SullivanNEW
 7       
Cristina Agurida
8961sudoku-savant does not get downloaded correctlynormalMedium2.0.2Cristina AguridaNEW
 1       
Daniel Istrate
6370QA/oe-selftest: add test suite for recipe testingenhancementMedium2.2Daniel IstrateIN PROGRESS REVIEW10
8332Add a broken recipe for testing purposesenhancementMedium2.2Daniel IstrateNEW2
 2       
David Anders
6866No GPIO controlled LED availablenormalMediumA4 ReleaseDavid AndersIN PROGRESS DESIGN COMPLETE
6869MinnowMax can not be powered via LSEnormalMediumA4 ReleaseDavid AndersIN PROGRESS DESIGN COMPLETE
7027Connecting HDMI cable to the Minnowboard Max doesn't get the monitor ONnormalMediumA4 ReleaseDavid AndersIN PROGRESS IMPLEMENTATION
6727Feature request: provide an option to configure any of the HDR26 GPIO_S5[2:0] pins for wakeenhancementMediumProduction ReleaseDavid AndersIN PROGRESS DESIGN
 4       
David_Wei
6532uEFI Networking booting lacks clear indication of what's going onnormalMediumA1 ReleaseDavid_WeiIN PROGRESS IMPLEMENTATION
6867No GPIO controlled "Reset" JumpernormalMediumA4 ReleaseDavid_WeiIN PROGRESS DESIGN COMPLETE
6182Currently takes more then 2 secs to get the the EFI. Need <.5 sec.normalMediumProduction ReleaseDavid_WeiIN PROGRESS DESIGN
 3       
dengke
8810Some strace ptests failnormalMedium2.2dengkeACCEPTED3
 1       
Darren Hart
7682acpitz-virtual-0 thermal device always returns 26.8 deg CnormalMediumProduction ReleaseDarren HartIN PROGRESS REVIEW
 1       
Ed Bartosh
7973stopping toaster kills ALL django apps running on the machine.normalMedium2.2Ed BartoshNEW2
8719Ensure bootable images can be supported by wic for all reference BSPsenhancementMedium2.2Ed BartoshIN PROGRESS DESIGN
8806Refactor localhostbecontrollernormalMedium2.2Ed BartoshNEW20
8886Toaster thinks do_shared_workdir is a shared state tasknormalMedium2.2Ed BartoshNEW3
8918Change the way we handle queued buildsnormalMedium2.2Ed BartoshNEW
9076The detection of the image type is incorrectly matching a wrong typenormalMedium2.2Ed BartoshIN PROGRESS REVIEW3
9518Rationalise the directory structure generated by ToasterenhancementMedium2.2Ed BartoshNEW
9585verify/fix eventreplaynormalMedium2.2Ed BartoshNEW
 8       
 
7572SOURCE_DEBUG_ENABLE fails on .76 MinnowMaxmajorMediumProduction Release IN PROGRESS REVIEW
 1       
Plauchu Edwin
7909RRS: Track patches and Upstream-Status informationenhancementMedium2.2 M1Plauchu EdwinNEW5
8133RRS should handle upstream repositories without version tagsenhancementMedium2.2 M1Plauchu EdwinIN PROGRESS DESIGNGUI design available2
8400rrs: add the cause of an unknown recipe versionenhancementMedium2.2 M1Plauchu EdwinNEW3
8943add a function hook that would process upstream and recipe versionsenhancementMedium2.2 M1Plauchu EdwinNEW2
9081RRS should respect DEFAULT_PREFERENCE when multiple versions of the same recipe are availablenormalMedium2.2 M1Plauchu EdwinIN PROGRESS DESIGN2
9204Cleanup should be made after testing smartnormalMedium2.2 M1Plauchu EdwinNEW1
9551Resolve string formatting issues in unzipnormalMedium2.2 M1Plauchu EdwinNEW1.5
8200Add acl to default DISTRO_FEATURES?enhancementMedium2.2 M2Plauchu EdwinNEW1
 8       
Beth Flanagan
9604nightly-wic invokes wic with options that aren't available in fido/1.8.xnormalMedium1.8.3Beth FlanaganNEW
8044Stop building lsb-qt3 imagesnormalMedium2.2Beth FlanaganNEW2
6284Random package/image builder (fuzzy build)enhancementMedium2.2 M1Beth FlanaganNEW4
7693Convert Autobuilder docs to docbookenhancementMedium2.2 M1Beth FlanaganNEW5
8760Autobuilder additional task log availabilitynormalMedium2.2 M1Beth FlanaganNEW2
9018Extend existing AutoBuilder script to schedule buildsenhancementMedium2.2 M1Beth FlanaganACCEPTED3
1789[Autobuilder] Optionally generate a HTML logenhancementMedium2.2 M2Beth FlanaganACCEPTED2
7568Create an image to run regular build tests for no-X11 caseenhancementMedium2.2 M2Beth FlanaganNEW3
7695Automated QA tests for the autobuilderenhancementMedium2.2 M2Beth FlanaganNEW5
7963Release process needs to generate correct toasterconf.json files for tar.gz releasesnormalMedium2.2 M2Beth FlanaganNEW2
8193add wiki reporting to public ABenhancementMedium2.2 M2Beth FlanaganNEW3
8841COPY_LIC_DIRS should use beginline and endline from LIC_FILES_CHKSUMenhancementMedium2.2 M2Beth FlanaganNEW1
9315nightly-world & nightly-world-lsb failed at PublishingArtifactsnormalMedium2.2 M2Beth FlanaganNEW2
9596Build "minimal" extensible SDK installers instead of "full" onesenhancementMedium2.2 M2Beth FlanaganNEW
7691Locking of branch/repoenhancementMedium2.2 M3Beth FlanaganNEW1
4183Reference material for how a user creates a build that meets GPL obligations given a reference BSP, standard rootfs/kernel...etc.enhancementMedium2.2 M4Beth FlanaganNEW2
 16       
Elliot Smith
8188The variable history is missing the layer namenormalMedium2.2Elliot SmithNEW10
8190The 'set in file' filters in the BitBake variables table seem to return the wrong informationnormalMedium2.2Elliot SmithNEW6
8363Assess which non-ToasterTable pages need refactoring and howenhancementMedium2.2Elliot SmithNEW2
9395Cleanly support unicode throughout ToasterenhancementMedium2.2Elliot SmithNEW15
9485Fix typeaheads for Bootstrap 3normalMedium2.2Elliot SmithNEW3
9494Custom images created from the build history pages fail to buildnormalMedium2.2Elliot SmithNEW3
9500In multitarget builds, Toaster shows software recipes in the list of imagesnormalMedium2.2Elliot SmithNEW4
9514Builds of software recipes should not show a "New custom image" buttonnormalMedium2.2Elliot SmithNEW2
9530Arrows in directory structure do not expand directoriesnormalMedium2.2Elliot SmithNEW
9630Show tasks currently running as part of progress bar updateenhancementMedium2.2Elliot SmithNEWGUI design pending5
 10       
Francisco Pedraza
7202Test for linux-dummyenhancementMedium2.2Francisco PedrazaIN PROGRESS REVIEW1
8502Store BSPs Firmware and HW info for BSP test casesenhancementMedium2.2Francisco PedrazaNEW2
8504Identify and add if needed BSP test cases specific to meta-intelenhancementMedium2.2Francisco PedrazaNEW5
 3       
Heinz Wrobel
9407bitbake reports log_check warning without stating in which log/recipe the problem occurrednormalMedium2.2 M1Heinz WrobelNEEDINFO3
 1       
Hongxu Jia
7600syslinux: port extX support patches to syslinux communityenhancementMedium2.2 M2Hongxu JiaIN PROGRESS IMPLEMENTATION15
8832pTest - bash tests fail for 2.1_M1.rc1normalMedium2.2 M2Hongxu JiaNEW
7018archiver missing tasks between do_unpack and do_patchnormalMedium2.2 M3Hongxu JiaIN PROGRESS REVIEW3
7149rpm: print which pkgname for warningenhancementMedium2.2 M3Hongxu JiaNEW5
8446fix .pyc/.pyo buildpaths issueenhancementMedium2.2 M3Hongxu JiaNEW5
8784IMAGE_LINGUAS did not support multilib correctlynormalMedium2.2 M3Hongxu JiaACCEPTED
9169add fix_buildpaths.bbclass to fix build pathenhancementMedium2.2 M3Hongxu JiaNEW
6420Detect and error when required packages are not producedenhancementMedium2.2 M4Hongxu JiaNEW5
 8       
Humberto Ibarra
8321yocto-bsp script should use argparse instead of optparse libraryenhancementMedium2.2 M1Humberto IbarraACCEPTED2
8919Code coverage: add ability to create coverage-based test exclusion reportsenhancementMedium2.2 M1Humberto IbarraNEW6
8921Code coverage: add ability to create missing 'coverage area' reportsenhancementMedium2.2 M1Humberto IbarraNEW5
 3       
Ivan Rouzanov
7396MBI should be removed from DSDTnormalMediumProduction ReleaseIvan RouzanovIN PROGRESS REVIEW
 1       
Jianxun Zhang
5351genericx86 auth.err getty[615]: tcgetattr: Input/outputnormalMedium2.2Jianxun ZhangNEW2
9205Add functionality to the formfactor to check for keyboard and/or touchscreenenhancementMedium2.2Jianxun ZhangIN PROGRESS REVIEW0.1
9419Enabling systemd-boot to replace gummibootenhancementMedium2.2 M1Jianxun ZhangIN PROGRESS REVIEW0.1
 3       
jingwang
8483Compatible to run generic pyunit test cases by test runnerenhancementMedium2.2 M1jingwangIN PROGRESS DESIGN
 1       
Jose Lamego
9389oeqa: split configuration from the codeenhancementMedium2.2 M1Jose LamegoNEW2
7823Convert Eclipse projects to Yocto recipes with devtoolenhancementMedium2.2 M2Jose LamegoIN PROGRESS DESIGNGUI design available1
7824Add functionality to modify existing Yocto recipes with devtoolenhancementMedium2.2 M2Jose LamegoACCEPTED5
8873Create an appropriate Yocto Project Workspace from an existing Eclipse projectenhancementMedium2.2 M2Jose LamegoNEW5
8874Create a new Yocto recipe from an existing Eclipse project using devtoolnormalMedium2.2 M2Jose LamegoNEW5
9390oeqa: don't write anything to local.conf or bblayers.confenhancementMedium2.2 M2Jose LamegoNEW10
 6       
Jose Perez C
7526add test for checking if fontcache is created inside an imageenhancementMedium2.2Jose Perez CNEW1
8087eglibc patch bugnormalMedium2.2Jose Perez CNEW2
8146ptest - some test cases are failing for aclnormalMedium2.2Jose Perez CNEW2
 3       
Joshua Lock
1882Verify and document package feed creation for each package management backendnormalMedium2.2Joshua LockACCEPTED5
9115Added packages filter seems to show the wrong package listnormalMedium2.2Joshua LockACCEPTED4
9297Toaster: Simplify building extensible SDKenhancementMedium2.2Joshua LockNEWGUI design pending5
9539Resolve string formatting issues in busyboxnormalMedium2.2Joshua LockNEW3
9540Resolve string formatting issues in console-toolsnormalMedium2.2Joshua LockNEW1.5
9541Resolve string formatting issues in cmakenormalMedium2.2Joshua LockNEW2
9542Resolve string formatting issues in expectnormalMedium2.2Joshua LockNEW1.5
9543Resolve string formatting issues in gccnormalMedium2.2Joshua LockNEW4
9544Resolve string formatting issues in gettextnormalMedium2.2Joshua LockNEW1.5
9545Resolve string formatting issues in kexec-toolsnormalMedium2.2Joshua LockNEW1.5
9612functions used in recipes and recipe examples (like bb.utils.contains) not documented.normalMedium2.2Joshua LockNEW0.5
9224[meta-swupd] Try to speed up update generation by parallelising calls to swupd_make_packenhancementMedium2.2 M1Joshua LockNEW1
9321[meta-swupd] Enhancements for use within a continuous integration systemenhancementMedium2.2 M1Joshua LockIN PROGRESS DESIGN4
9322[meta-swupd] Improve the algorithm for determining previous versionenhancementMedium2.2 M1Joshua LockNEW1.5
9325[meta-swupd] Copy only required bundle contents, rather than copying the entire mega image and then pruning unwanted filesenhancementMedium2.2 M1Joshua LockIN PROGRESS IMPLEMENTATION2
9187[meta-swupd] implement generic versions of the update helper scripts in oe-swupd-helpersnormalMedium2.2 M2Joshua LockNEW3
9188[meta-swupd] Remove hard-coded paths from swupd-clientnormalMedium2.2 M2Joshua LockWaitForUpstream1
9190[meta-swupd] Try to consolidate OS_VERSION and DISTRO_VERSIONnormalMedium2.2 M2Joshua LockNEW0.5
9511Provide support for swupd manifest includesenhancementMedium2.2 M2Joshua LockNEW5
9192[meta-swupd] Support virtual images generated from a virtual recipenormalMedium2.2 M3Joshua LockNEW5
9189[meta-swupd] Creates a lot of duplicate filesenhancementMedium2.2 M4Joshua LockNEW1
 21       
Juro Bystricky
9357nativesdk-python3 does not buildnormalMedium2.0.2Juro BystrickyIN PROGRESS REVIEW
3898kernel menuconfig unusablenormalMedium2.2Juro BystrickyWaitForUpstream
8072Document using Build Appliance using Virtual BoxenhancementMedium2.2Juro BystrickyIN PROGRESS DESIGN15 Jan 2016: NEEDINFO1
8074Graphic display using Virtual Box differs from VMwarenormalMedium2.2Juro BystrickyIN PROGRESS REVIEW1
9442Please add virtio console to qemux86-64.confenhancementMedium2.2 M1Juro BystrickyACCEPTED
 5       
Jussi Kukkonen
9650Eject icon is displayed as "file" on SATO sdk NUC when plugging USBminorMedium1.8.3Jussi KukkonenNEW
9473bind: CVE-2016-2088 (jethro)majorMedium2.0.2Jussi KukkonenNEW0.5
1985matchbox-panel doesn't build battery status appletenhancementMedium2.2Jussi KukkonenNEW5
2646Windows switching failurenormalMedium2.2Jussi KukkonenIN PROGRESS IMPLEMENTATION0.5
6077piglit depends on libx11enhancementMedium2.2Jussi KukkonenACCEPTED2
6378libfakekey patch to allow shift-ed version of symbol not already in keymapnormalMedium2.2Jussi KukkonenNEW1
8380multiple pointer devices in qemunormalMedium2.2Jussi KukkonenACCEPTED2
8586multilib build includes 32bit connman without good reasonnormalMedium2.2Jussi KukkonenIN PROGRESS REVIEW1
8643GTK+3 depends on libepoxy which depends on eglnormalMedium2.2Jussi KukkonenACCEPTED3
9350As a developer, I want a global variable exist for choosing the default SSL/TLS provider.enhancementMedium2.2Jussi KukkonenNEW
9356piglit needs to be updated to run newer testsnormalMedium2.2Jussi KukkonenNEW
9365Remove xtscal in preference of xinput-calibratorenhancementMedium2.2Jussi KukkonenNEW
9523openssl: dangling libcrypto.a symlinknormalMedium2.2Jussi KukkonenNEW
9524Drop libxsettings-clientenhancementMedium2.2Jussi KukkonenNEW
9668libarchive doesn't respect disable-aclnormalMedium2.2Jussi KukkonenNEW
9082Display network information on log-in screensenhancementMedium2.2 M1Jussi KukkonenACCEPTED0.5
 16       
Christopher Larson
6372Feature request: recipe hook for source tree preparationenhancementMedium2.2Christopher LarsonNEW
7670Proposal: make TOPDIR or BUILDDIR available to the devshellenhancementMedium2.2Christopher LarsonIN PROGRESS REVIEW
7671Feature request: integrate task-level exports supportenhancementMedium2.2Christopher LarsonNEW
7958Implement shallow git clone functionalityenhancementMedium2.2Christopher LarsonIN PROGRESS IMPLEMENTATION2
 4       
Kevin Hao
9176Default u-boot script is not able boot from eMMC on BeagleBone BlacknormalMedium2.2Kevin HaoNEW
 1       
Leonardo Sandoval Gonzalez
6618Make the layer name searchable and show item page when search returns only one resultenhancementMedium2.2 M1Leonardo Sandoval GonzalezIN PROGRESS REVIEW2
7724useradd.bbclass users cannot be safely referred to by dependent recipes due to sstate-induced race with base-passwdmajorMedium2.2 M1Leonardo Sandoval GonzalezIN PROGRESS IMPLEMENTATIONTC needed7
7855Show blacklist information in layer indexenhancementMedium2.2 M1Leonardo Sandoval GonzalezIN PROGRESS REVIEWGUI design available2
9308patchtest: improve signal handling when the process is interruptedenhancementMedium2.2 M1Leonardo Sandoval GonzalezACCEPTED1
5654Add EFI to qemux86 and qemux86-64enhancementMedium2.2 M2Leonardo Sandoval GonzalezWaitForUpstream5
8676devtool: extend oe-selftest testing for devtool upgradeenhancementMedium2.2 M2Leonardo Sandoval GonzalezACCEPTED2
3276PulseAudio isn't testedenhancementMedium2.3Leonardo Sandoval GonzalezNEW3
5399Sharing PR server between builders with different metadataenhancementMedium2.3Leonardo Sandoval GonzalezNEW9
8455Add tests to empty imageminorMedium2.3Leonardo Sandoval GonzalezNEW3
9070Add test that locales are workingenhancementMedium2.3Leonardo Sandoval GonzalezNEW1
9080Autobuilder/oe-selftest: Have a way to specify a which oe-self tests get run on a forced AB jobnormalMedium2.3Leonardo Sandoval GonzalezNEW2
9085Build QA Warnings: add a test for unlisted dependenciesnormalMedium2.3Leonardo Sandoval GonzalezNEW2
9129Enhance Test Suite scanning and executionenhancementMedium2.3Leonardo Sandoval GonzalezNEW4
9140Eclipse plugin testing enable work on other distrosenhancementMedium2.3Leonardo Sandoval GonzalezNEW3
 14       
Libertad
8497Continuous Toaster exploratory testingenhancementMedium2.2LibertadNEW
8678Testing coverage of non-poky Toaster setupenhancementMedium2.2LibertadIN PROGRESS DESIGN1
 2       
Robert Yang
4827runqemu shouldn't hard-code machine knowledgeenhancementMedium2.2 M1Robert YangIN PROGRESS IMPLEMENTATION15
7610[Multilib] Can't install 64bit packages to 32bit rootfsenhancementMedium2.2 M1Robert YangACCEPTED10
8592smart: make it can understand MLPREFIXenhancementMedium2.2 M1Robert YangNEW10
9048Failed to build iptables with extensible sdk on Fedora 23 i686normalMedium2.2 M1Robert YangACCEPTED5
9408create-pull-request: auto push the branch if not presentenhancementMedium2.2 M1Robert YangNEW3
9409create-pull-request: add the ability to read env varenhancementMedium2.2 M1Robert YangNEW2
9410create-pull-request: automatically add the subject when there is only one patchenhancementMedium2.2 M1Robert YangNEW2
9436lib/bb/fetch2/git.py: print more friendly errors messages when failedlib/bb/fetch2/git.pyenhancementMedium2.2 M1Robert YangNEW3
9512insane.bbclass: package_qa_check_license -> do_qa_populate_licnormalMedium2.2 M1Robert YangIN PROGRESS IMPLEMENTATION5
6120perf top command does not work on QemuPPCnormalMedium2.2 M2Robert YangACCEPTED5
7436kbd build racenormalMedium2.2 M2Robert YangIN PROGRESS DESIGN1
9404Smart will remove RECOMMENDS during a remove commandnormalMedium2.2 M2Robert YangNEW3
9495Can't boot efi image (iso or vmdk) in virtualboxnormalMedium2.2 M2Robert YangNEW5
7984RPM backend does not honor package overrides for PACKAGE_ARCHnormalMedium2.2 M3Robert YangNEW5
8740LTP and LSB NG casesnormalMedium2.2 M3Robert YangIN PROGRESS REVIEW5
8967Need a way to cleanup DEPENDS and RDEPENDSenhancementMedium2.2 M3Robert YangNEW5
9423devshell: export CONFIGUREOPTS to envenhancementMedium2.2 M3Robert YangNEW5
7950gcc-cross-canadian-i586 doesn't work PREFERRED_VERSIONnormalMedium2.2 M4Robert YangIN PROGRESS REVIEW2
 18       
Ming Liu
9233As a developer, I want initramfs bundled kernel could be installed into rootfsnormalMedium2.2Ming LiuIN PROGRESS REVIEW
 1       
Mang Guo
9062Firmware - Upgrade to UDK2015normalMediumProduction ReleaseMang GuoIN PROGRESS DESIGN COMPLETE
 1       
Marcel Holtmann
6679Trusted Execution Engine (TXE) exposed over PCInormalMediumProduction ReleaseMarcel HoltmannIN PROGRESS REVIEW
 1       
Mariano Lopez
8650RRS: track ptest-enabled and potentially ptest-enabled statusenhancementMedium2.2 M1Mariano LopezACCEPTEDGUI design available3
9468Export Tests execution (Runexport.py) execution log needs improvementsenhancementMedium2.2 M2Mariano LopezNEW3
9294Error Reporting Tool: Add a 'solutions' relationship to the error entriesenhancementMedium2.2 M4Mariano LopezNEWGUI design pending3
 3       
Mark Hatle
8779update-alternatives.bbclass automatic renaming doesn't happen in sysrootsnormalMedium2.2Mark HatleNEW
9208createrepo fails to correctly update the repodata, image generation then failsnormalMedium2.2Mark HatleNEW
 2       
Markus Lehtonen
6926Create yocto-bsp testsuiteenhancementMedium2.2Markus LehtonenNEW15
9663do_populate_lic assumes that license basenames are uniquenormalMedium2.2Markus LehtonenNEW
 2       
Martin Jansa
9217Many unsolveable QA warnings from build-deps and file-rdepsnormalMedium2.2 M3Martin JansaNEEDINFO10
 1       
Maxin B. John
8471ptest - some valgrind ptests fail on 2.0.rc1normalMedium2.2Maxin B. JohnACCEPTED2
 1       
Michael Wood
7502Show image information if rootfs files are generatednormalMedium2.2Michael WoodNEW4
8051Importing layer fails silently if the layer name already existsnormalMedium2.2Michael WoodNEW2
8131All builds page "Errors"/"Warnings" filters doesn't worknormalMedium2.2Michael WoodACCEPTED4
8275Toaster: Suitable message and build box does not appear in build tab for a project with no buildsnormalMedium2.2Michael WoodNEW4
8456Add feature to add layers to Toaster from external sourceenhancementMedium2.2Michael WoodNEW
8953Toaster ignores the subdirectory when cloning imported layersnormalMedium2.2Michael WoodNEW
9582Replace toasterconf.json with Django fixturesenhancementMedium2.2Michael WoodNEW14
9586document and verify production setup for jenkins ci interactionnormalMedium2.2Michael WoodNEW
9641In the custom image recipe page, the last build information only shows successful buildsnormalMedium2.2Michael WoodNEW
9645The image recipe details does not show "Last build" informationnormalMedium2.2Michael WoodNEW
9651Error report web: Optimize searching timesenhancementMedium2.2Michael WoodNEW
9274Port oe build selftest tests to django test frameworknormalMedium2.2 M1Michael WoodIN PROGRESS REVIEW4
9093Hide scary errors while importing recipe information from the layer indexnormalMedium2.2 M3Michael WoodNEW2
9097Remove validation messages when layers checkout directory and build directory are correctly setnormalMedium2.2 M3Michael WoodNEW4
9164The toaster-custom-images layer should not show like any other layer, and should not be removablenormalMedium2.2 M4Michael WoodNEWGUI design available4
 15       
Michael Halstead
8162patchwork: clear out the superseded and already merged patchesenhancementMedium2.2 M1Michael HalsteadNEW4
 1       
Mike Wu
9063Firmware - Support for Capsule update mechanismnormalMediumProduction ReleaseMike WuIN PROGRESS DESIGN COMPLETE
 1       
Paul Eggleton
5057Conflict when building SDK for image containing dropbear and openssh-sftp-servernormalMedium2.2Paul EggletonACCEPTEDRelease Note4
5546Optimise away meta-oe X init mechanismenhancementMedium2.2Paul EggletonACCEPTED2
6128Incorrect wildcard unpack behaviour in fetchernormalMedium2.2Paul EggletonNEW2
6129Local directories unpack to a different location than local filesnormalMedium2.2Paul EggletonNEW2
6626Add an example for debugging software with the corresponding -dbg packagenormalMedium2.2Paul EggletonNEW1
6661devtool: add ability to submit changes for reviewenhancementMedium2.2Paul EggletonNEW10
6972breaks build of software using cmake packages due to hardcoded pathsnormalMedium2.2Paul EggletonNEW1
7142cmake.bbclass fails when rebuilding after MACHINE changesnormalMedium2.2Paul EggletonNEW3
7240Add declaration of image output file globs for ToasterenhancementMedium2.2Paul EggletonNEW1
7336buildhistory-diff reports recipe-wide changes per-subpackageenhancementMedium2.2Paul EggletonNEW1
7617devtool: detect need to re-run configureenhancementMedium2.2Paul EggletonNEW3
7636recipetool: basic spec file conversionenhancementMedium2.2Paul EggletonNEW
7637devtool: add: interactive recipe creationenhancementMedium2.2Paul EggletonNEW5
7852bitbake-layers layerindex-fetch doesn't respect branch (-b|--branch) optionnormalMedium2.2Paul EggletonIN PROGRESS DESIGN1
8278devtool: update compressed patches gracefullynormalMedium2.2Paul EggletonNEW0.5
8325devtool modify could handle patch failure more usefullynormalMedium2.2Paul EggletonNEW3
8582Error message not in log filenormalMedium2.2Paul EggletonNEW2
8594devtool: provide easy means of moving a recipe in the workspace to a real layerenhancementMedium2.2Paul EggletonNEW3
8703PATCHTOOL = git, triggers error user.name/user.email unsetnormalMedium2.2Paul EggletonIN PROGRESS IMPLEMENTATION0.5
8732Branch Support for BuildhistoryenhancementMedium2.2Paul EggletonNEW2
8840Failure to build 32 bit eSDK on a 64 bit hostenhancementMedium2.2Paul EggletonNEW4
9220buildhistory should track native recipesenhancementMedium2.2Paul EggletonNEW2
9360devtool: update-recipe ignores SRC_URI_appendnormalMedium2.2Paul EggletonNEW4
9367Extensible SDK: avoid double invocation of bitbake on installenhancementMedium2.2Paul EggletonIN PROGRESS IMPLEMENTATION4
9479Extensible SDK breaks if python-dependent items added to TOOLCHAIN_HOST_TASKnormalMedium2.2Paul EggletonNEW2
9627devtool seems to mangle incorrectly the .bb file, when modifying the set of patches for a componentnormalMedium2.2Paul EggletonNEW
9638devtool changes the format of the SRC_URI unnecessarilynormalMedium2.2Paul EggletonNEW
9647Refactor the update scriptenhancementMedium2.2Paul EggletonNEW
8223bbwarn warnings during do_rootfs printed twiceminorMedium2.2 M1Paul EggletonIN PROGRESS IMPLEMENTATION1
9257extensible SDK: need an easy way of installing toolchainsnormalMedium2.2 M1Paul EggletonNEW1
 30       
Chen Qi
8939Lots of [host-user-contaminated] warningnormalMedium1.4.5Chen QiACCEPTED
4420No init scripts in core-image-sato with systemd if 'sysvinit' is not in DISTRO_FEATURESenhancementMedium2.2Chen QiIN PROGRESS IMPLEMENTATION10
5359[Yocto 1.5] su - USER -c 'COMMAND' env variable issuenormalMedium2.2Chen QiNEW
5427Extend and tidy up layer sanity checkingenhancementMedium2.2Chen QiIN PROGRESS REVIEW5
6016CrossTap has issues on running scheduler script against qemuppcnormalMedium2.2Chen QiNEW5
6132Have persistent log data (/var/log)enhancementMedium2.2Chen QiIN PROGRESS REVIEW4
6660Compare sstate packages within SDK publishing toolenhancementMedium2.2Chen QiACCEPTED6
7710devtool: deploy-target: interact with target packaging where availableenhancementMedium2.2Chen QiIN PROGRESS DESIGN10
8314warn when ALTERNATIVE_PRIORITY are the sameenhancementMedium2.2Chen QiNEW10
8812Some util-linux ptests failnormalMedium2.2Chen QiACCEPTED2
8834pTest - attr test fail ln -s fnormalMedium2.2Chen QiACCEPTED2
9053pTest - util-linux (NUC) failed tested on NUC 5425WYK for YP 2.1_M2.rc1normalMedium2.2Chen QiACCEPTED2
9055pTest - acl (NUC) failed tested on NUC 5425WYK for YP 2.1_M2.rc1normalMedium2.2Chen QiACCEPTED2
 13       
Khem Raj
6882Can't log in to successfully built mipsel virtual imagemajorMedium1.6.4Khem RajACCEPTED
8870uclibc fails to build occasionallynormalMedium2.2Khem RajNEW
9417Bring clang/llvm compiler infrastructure to OE-CoreenhancementMedium2.2Khem RajNEW
 3       
Randy Witt
5866Reproducible builds: identical binariesenhancementMedium2.2Randy WittNEW5
8560xserver fails with xf86OpenConsole: Cannot open /dev/tty0 (No such file or directory)normalMedium2.2Randy WittNEW2
8789extensible SDK: command disable devtool subcommands based on capabilitiesenhancementMedium2.2Randy WittNEW2
8928extensible SDK - add a way to prepare the sdk for offline usageenhancementMedium2.2Randy WittNEW3
9173extensible sdk: Create a way that sstate will automatically be removed after setsceneenhancementMedium2.2Randy WittNEW1
9503Add a way to add docker metadata to container imagesenhancementMedium2.2Randy WittNEW3
9504knotty doesn't delete lines if the number of output lines is larger than then number of lines in the terminalnormalMedium2.2Randy WittNEW2
9595Extensible sdk: error early if tasks to be ran cannot be provided from sstatenormalMedium2.2Randy WittNEW
7552Generated SDK has "expect" headers in wrong locationnormalMedium2.2 M3Randy WittNEW1
 9       
Randy MacLeod
3388perf: enable man pages for basic 'help' functionalitynormalMedium2.2Randy MacLeodACCEPTED2
7314Audit all recipes for proper CONFFILES assignmentenhancementMedium2.2Randy MacLeodNEW
 2       
Richard Purdie
4143Support real-time logging when using bitbake interactivelyenhancementMedium2.2Richard PurdieNEW5
4389kernel: Remove "make scripts" requirement for module building from SDK/on targetenhancementMedium2.2Richard PurdieACCEPTED5
5280For tested hosts, we should use a wild card or other translations to group compatible sstate-cache (and other items)enhancementMedium2.2Richard PurdieNEW3
5395Nativesdk postinstalls directory issues.normalMedium2.2Richard PurdieNEW5
7298packagegroups are not rebuilt when rdependency pkg name changesnormalMedium2.2Richard PurdieNEW5
7846devshell cannot be kept open across rebuildsenhancementMedium2.2Richard PurdieNEW1
7877Depending on the error found, inconsistent line reported.normalMedium2.2Richard PurdieNEW3
7879Depending on the name of a recipe, the build succeeds or fails.normalMedium2.2Richard PurdieNEW3
7960Feature Request: to enable poky to support building multilib native commandsenhancementMedium2.2Richard PurdieNEW5
7985Variable typing support within BitBakeenhancementMedium2.2Richard PurdieNEW15
8161Can't use "\" characters in SRC_URI entries - not even escapednormalMedium2.2Richard PurdieNEW2
8173Wrong dynamic loader because of missing -mfloat-abi=hard in LDFLAGS (in scons)normalMedium2.2Richard PurdieNEW2
8805Detect and warn people naming functions something_remove_somethingnormalMedium2.2Richard PurdieNEW1
8828pTest - lttng-tools tests fail for 2.1_M1.rc1normalMedium2.2Richard PurdieNEW3
9061git fetcher inconsistency for working with PREMIRRORS.normalMedium2.2Richard PurdieNEW5
9175Remove os.chdir from fetch/unpack logicenhancementMedium2.2Richard PurdieNEW5
9272BBCLASSEXTEND="cross" overrides do_install()normalMedium2.2Richard PurdieNEW1
9279Issue with PREFERRED_PROVIDER interaction with overridesnormalMedium2.2Richard PurdieNEW1
9603bitbake example class uses old getVarFlag() syntaxnormalMedium2.2Richard PurdieNEW
9251Need flowchart style documentation showing progress of tasks and what they touch in a setscene vs non setscene setting.enhancementMedium2.2 M1Richard PurdieNEW1
 20       
LiRongQing
7554Ownership issue in package contentsmajorMedium2.2LiRongQingACCEPTED
 1       
Ross Burton
9158Cannot build openjdk-8 on fido due to missing autotools patchnormalMedium1.8.3Ross BurtonNEW1
2415connman doesn't provide a 3g configuration utilityenhancementMedium2.2Ross BurtonNEW5
3488Enable Mesa's llvmpipe?enhancementMedium2.2Ross BurtonACCEPTED2
5322Global DNS fallback mechanism not present in poky distroenhancementMedium2.2Ross BurtonACCEPTED3
6278runqemu without /etc/resolv.confenhancementMedium2.2Ross BurtonNEW3
6700systemd's resolved conflicts with connmanenhancementMedium2.2Ross BurtonNEW2
7010systemd-serialgetty cannot create a serial-getty@.service that is not enablednormalMedium2.2Ross BurtonNEWBackport to 1.7.31
7054OprofileUI needs to be updated to reflect new oprofile functionalitynormalMedium2.2Ross BurtonACCEPTED2
7800systemd.bbclass doesn't check for services in systemd/user/ directoryenhancementMedium2.2Ross BurtonNEW3
8064ptest fails tracker bugnormalMedium2.2Ross BurtonNEW
8302sstate_create_package fails to chmod filenormalMedium2.2Ross BurtonNEW1
8430inaccurate 'du' usage in Image::_get_rootfs_sizeenhancementMedium2.2Ross BurtonACCEPTED1
8454archiver.bbclass does not create subfolder per licensenormalMedium2.2Ross BurtonNEW1
8593The head files of ncurses installing into sysroot seems different in multiple times compilationnormalMedium2.2Ross BurtonNEW2
8688busybox syslog not update-alternatives awarenormalMedium2.2Ross BurtonNEW2
9110Move some oe-pkgdata-util logic into lib/oeenhancementMedium2.2Ross BurtonNEW2
9119ptest fails tracker bug (Cont.)normalMedium2.2Ross BurtonNEW
9171Consider limiting the scope of depchains to runtime depsnormalMedium2.2Ross BurtonNEW5
9207Need to fix prelink to iterate mulitlibsnormalMedium2.2Ross BurtonNEW4
9213Enable thumb for ARM buildsnormalMedium2.2Ross BurtonNEW1
9259The rpm database costs lots of disk space after install a packagenormalMedium2.2Ross BurtonNEW3
9288depexp does not show bitbake errorsnormalMedium2.2Ross BurtonNEW1
9346Rename COMPRESS_CMD_* to IMAGE_POSTPROCESS_*?enhancementMedium2.2 M1Ross BurtonNEW1
7136Default PACKAGES value prevents packaging of prebuilt shared librariesnormalMedium2.2 M2Ross BurtonNEW1
6142we need general documentation on Systemd vs SysV related issuesenhancementMedium2.2 M4Ross BurtonACCEPTEDNIR 05/01, 05/08, 5/151
 25       
Saul Wold
7459Implement the use of host USB devices on Linux for qemu machinesenhancementMedium2.2Saul WoldNEW3
 1       
YONG LI
7255The CPU is very hot if break into EFI shellnormalMediumProduction ReleaseYONG LIIN PROGRESS REVIEW
 1       
Lu_Shifei
6723hpet: number irqs doesn't agree with number of timersnormalMediumProduction ReleaseLu_ShifeiIN PROGRESS DESIGN
 1       
Scott Rifenbark
9380The manual does not mention automatically added version restrictionsnormalMedium2.2Scott RifenbarkNEW04 April 2016: NEEDINFO1
9553INHIBIT_PACKAGE_STRIP docs need to be expandednormalMedium2.2Scott RifenbarkNEW
9580Missing package dependency in quick start guide for FedoranormalMedium2.2Scott RifenbarkNEW
9671UPSTREAM_CHECK_* variables needs documentationenhancementMedium2.2Scott RifenbarkNEW
9672Add documentation for package installation during runtime testingenhancementMedium2.2Scott RifenbarkNEW
7718target:task syntax not mentioned in --helpminorMedium2.2 M1Scott RifenbarkNEW0.5
3442Eclipse-plugin for Windows should be documentedenhancementMedium2.2 M4Scott RifenbarkACCEPTED04 May 2015 - ACCEPTED3
7477runqemu should support running poky tinyenhancementMedium2.2 M4Scott RifenbarkNEW2
7546Streamline application development manualenhancementMedium2.2 M4Scott RifenbarkACCEPTED09 April 2015: ACCEPTED3
8596Document proper way of adding a userspace header for the kernelenhancementMedium2.2 M4Scott RifenbarkACCEPTED1
8631Fully document sysroot populationenhancementMedium2.2 M4Scott RifenbarkNEW3
8909Mention standard fetcher options also in fetcher seaction (not only in SRC_URI in the glossary)enhancementMedium2.2 M4Scott RifenbarkACCEPTED2
9001bootimg.bbclass does not ducument GRUB boot lodader supportnormalMedium2.2 M4Scott RifenbarkNEW27 Jan 2016: NEEDINFO2
9376Enhance descriptions for kernel tasks in the reference manual.enhancementMedium2.2 M4Scott RifenbarkNEW10
9451Document a cookbook procedure on how to change kernel versionnormalMedium2.2 M4Scott RifenbarkNEW2
 15       
Stephano Cetola
9497systemd usersnormalMedium2.2Stephano CetolaIN PROGRESS DESIGN1
9578INHIBIT_PACKAGE_STRIP breaks -dbgnormalMedium2.2Stephano CetolaACCEPTED1
 2       
Stephen K Jolley
78833G/4G mobile hardware supportenhancementMedium2.2Stephen K JolleyACCEPTED0.1
 1       
Sujith H
9646The validation for DL_DIR and SSTATE_DIR variables fires for valid charactersnormalMedium2.2Sujith HACCEPTED
9598SSTATE_MIRRORS should not be on the list of restricted "Bitbake variables"normalMedium2.2 M2Sujith HACCEPTED
 2       
He, Tim
7497Add "save" option back to the boot ordering screennormalMediumProduction ReleaseHe, TimACCEPTED
 1       
Tim Orling
9561[Mars] Minimum required Java version is 1.7 for Eclipse Mars (4.5)normalMedium2.1.1Tim OrlingACCEPTED0.2
9649New Yocto Bitbake Commander Project: No error shown when invalid directory givennormalMedium2.1.1Tim OrlingNEW
7819Support multi-image debuggingenhancementMedium2.2Tim OrlingNEW5
9562[Neon] Minimum required Java version is 1.8 for Eclipse Neon (4.6)normalMedium2.2Tim OrlingNEW0.2
9615yocto-bsp: The design for the yocto-bsp wizard needs some workenhancementMedium2.2Tim OrlingNEW
9616yocto-bsp wizard sources the Build location folder every time the field loses focusnormalMedium2.2Tim OrlingNEW
9622build.sh: error trying to generate doc for adt-manualnormalMedium2.2Tim OrlingNEW
 7       
Toaster default assignee
9418Support using existing OE setupsenhancementMedium2.3Toaster default assigneeNEW
 1       
Todor Minchev
9590Cannot update Zephyr project configenhancementMedium2.2Todor MinchevNEW
9591Zephyr project configuration should allow kernel and app to be in different folder hierachiesenhancementMedium2.2Todor MinchevNEW
9593Enable workspace folder to be changedenhancementMedium2.2Todor MinchevNEW
9570Need a simple way of configuring Zephyr development environment at start of docker sessionnormalMedium2.2 M1Todor MinchevNEW
9571Allow CROPS to install host tools in specified locationnormalMedium2.2 M1Todor MinchevNEW
 5       
Tom Zanussi
6156[crosstap] no trace message output on qemuarmnormalMedium2.2Tom ZanussiACCEPTED5
9531Need a proper way to fix mismatched arch generated with bare-bone kernel recipenormalMedium2.2Tom ZanussiNEW
5520poky-tiny enhancementsenhancementMedium2.2 M2Tom ZanussiACCEPTED40
 3       
Tracy Graydon
6683Produce a script to automate release preparation tasksmajorMedium2.2Tracy GraydonNEW3
6287Release scripts for BSPs/images.enhancementMedium2.2 M1Tracy GraydonNEW5
7476Improve license manifest descriptionenhancementMedium2.2 M1Tracy GraydonNEW2
8083Add n32 test case to autobuilder nightly-multilibenhancementMedium2.2 M1Tracy GraydonNEW1
9107Update spdx.bbclass to work with FOSSology 3.0.0 releasenormalMedium2.2 M2Tracy GraydonACCEPTED5
6469Host system profiler tool.enhancementMedium2.2 M3Tracy GraydonNEW10
8158INCOMPATIBLE_LICENSES has unexpected results with GNU librariesnormalMedium2.2 M3Tracy GraydonNEW10
 7       
Troy D. Hanson
9665quoting bug in poky/scripts/contrib/mkefidisk.shnormalMedium2.2Troy D. HansonNEW
 1       
Unassigned
6234Implement model for project owner / userenhancementMedium2.3UnassignedNEW2
 1       
Vaduva Alexandru
7067Integrate 'grsecurity' package inside meta-cglenhancementMedium2.1Vaduva AlexandruNEW2
 1       
John 'Warthog9' Hawley
6533uEFI Network booting should be default to last prioritynormalMediumA1 ReleaseJohn 'Warthog9' HawleyIN PROGRESS REVIEW
6719Gummiboot "Reboot Into Firmware Interface" does not worknormalMediumProduction ReleaseJohn 'Warthog9' HawleyIN PROGRESS REVIEW
9300AFTER POWER ON, LED(D1)ON BUT LED(D2)flickernormalMediumProduction ReleaseJohn 'Warthog9' HawleyNEEDINFO
 3       
Bill Randle
8656ptest - perl tests fail for genericx86-64 on NUC - 2.0.rc3normalMedium2.2Bill RandleIN PROGRESS DESIGN4
9424systemd tmpfiles.d warnings (volatile, resolv.conf)minorMedium2.2 M1Bill RandleIN PROGRESS REVIEW1
 2       

Other High Bugs

IDSummary (21 tasks) SeverityPMilestoneAssigneeStatusWhiteboardE
4078A method to validate the contents of changes to recipes, configuration files and classesenhancementHigh2.2 M1Michael HalsteadNEWNIR 04/24, 05/01, 05/085
4431Set up buildhistory-web for autobuilderenhancementHigh2.2 M1Michael HalsteadACCEPTED3
7518Build multiple machines in the same bitbake invocationenhancementHigh2.2 M1Richard PurdieNEW15
7583Gather and allow reporting all types of errors, not just task failuresenhancementHigh2.2 M1Aníbal LimónIN PROGRESS DESIGN5
7658patchwork: provide means of recording additional patch statusesenhancementHigh2.2 M1Michael HalsteadNEWNIR 04/24, 05/01, 05/084
8648Automatic testing of incoming patchesenhancementHigh2.2 M1Michael HalsteadNEWNIR 04/24, 05/01, 05/0810
8649Script to assemble patches for autobuilder testingenhancementHigh2.2 M1Michael HalsteadNEWNIR 04/24, 05/01, 05/0815
9112pseudo connection startup/reworkenhancementHigh2.2 M1SeebsNEW
9130Update OE patchwork instanceenhancementHigh2.2 M1Michael HalsteadACCEPTED
9131Prelink breaks fork IFUNCmajorHigh2.2 M1Mark HatleIN PROGRESS IMPLEMENTATION10
9293bitbake: Add support for trigger event on errors like exceptionsenhancementHigh2.2 M1Aníbal LimónIN PROGRESS IMPLEMENTATION5
9298Autobuilder enable KVM on the cluster for x86, x86-64enhancementHigh2.2 M1Beth FlanaganNEW4.5
9394bootstrap v2 License is not compatible with bitbake/toaster license.criticalHigh2.2 M1brian averyNEW
9457patchtest: security check on incoming patchesenhancementHigh2.2 M1Leonardo Sandoval GonzalezACCEPTED5
9517Move to Bootstrap 3enhancementHigh2.2 M1Belen Barros PenaNEW
9559test reporting tool planenhancementHigh2.2 M1Benjamin EsquivelNEW5
9581CVE-2016-2107, CVE-2016-2108, CVE-2016-2105, CVE-2016-2106, CVE-2016-2109, CVE-2016-2176majorHigh2.2 M1Jussi KukkonenIN PROGRESS REVIEW
9588Create a method for describing builds and desired output. aka a build descriptorenhancementHigh2.2 M1Randy WittNEW5
9592Add a mechanism for creating build appliance as a container imageenhancementHigh2.2 M1Randy WittNEW4
9383Move to LSB 5enhancementHigh2.2 M2Ross BurtonNEW3
8647Script to analyse what areas a patch changes and what tests need runningenhancementHigh2.2 M3Leonardo Sandoval GonzalezACCEPTED13
 21       

Major or Critical

IDSummary (36 tasks) SeverityPMilestoneAssigneeStatusWhiteboardE
8931replaces field does not support version constrainsmajorUndecided0.3.2Alejandro del CastilloNEW
8946opkg install does not appear to fail on file overwritemajorUndecided0.4Alejandro del CastilloNEW
6882Can't log in to successfully built mipsel virtual imagemajorMedium1.6.4Khem RajACCEPTED
9652boot and install from USB failed getting [sdc] error messagemajorMedium+1.8.3Jianxun ZhangNEW
9473bind: CVE-2016-2088 (jethro)majorMedium2.0.2Jussi KukkonenNEW0.5
9462Boot and install from USB failed getting a xhci_hcd error after booting kernel panic is displayedmajorMedium2.1.1California SullivanACCEPTED3
9472[NO USB support ] Beaglebone black latest yoctomajorMedium+2.1.1Kevin HaoIN PROGRESS REVIEW1
6683Produce a script to automate release preparation tasksmajorMedium2.2Tracy GraydonNEW3
7554Ownership issue in package contentsmajorMedium2.2LiRongQingACCEPTED
8078useradd.bbclass: useradd_preinst not run when rebuilding on second MACHINEmajorMedium+2.2Maxin B. JohnACCEPTED3
9394bootstrap v2 License is not compatible with bitbake/toaster license.criticalHigh2.2 M1brian averyNEW
9575Test SDK EXT failed on core-image-sato for MIPS architecturecriticalMedium+2.2 M1Robert YangNEW5
9608pkg-config 0.29 compilation error after gcc update (5.3 -> 6.1)criticalMedium+2.2 M1Khem RajIN PROGRESS REVIEW
7724useradd.bbclass users cannot be safely referred to by dependent recipes due to sstate-induced race with base-passwdmajorMedium2.2 M1Leonardo Sandoval GonzalezIN PROGRESS IMPLEMENTATIONTC needed7
8616arm64's multilib SDK is brokenmajorMedium+2.2 M1Chen QiIN PROGRESS REVIEW3
8879opkg-utils is built when build lib32-imagemajorMedium+2.2 M1Robert YangIN PROGRESS IMPLEMENTATION5
9064do_unpack does not wipe old source treemajorMedium+2.2 M1Markus LehtonenIN PROGRESS REVIEW1
9131Prelink breaks fork IFUNCmajorHigh2.2 M1Mark HatleIN PROGRESS IMPLEMENTATION10
9177Failed to install jethro eSDK image from AutobuildermajorMedium+2.2 M1Paul EggletonNEW1
9581CVE-2016-2107, CVE-2016-2108, CVE-2016-2105, CVE-2016-2106, CVE-2016-2109, CVE-2016-2176majorHigh2.2 M1Jussi KukkonenIN PROGRESS REVIEW
9659hidden symbol pthread_atforkmajorMedium+2.2 M1Khem RajNEW
9673perl ptest package tries to include generate_uudmap host executablemajorMedium+2.2 M2Aníbal LimónNEW1
8576QemuRunner logging for qemu start failure does not log anything to the console in oe-selftestmajorMedium+2.2 M4Jose Perez CNEW2
6927I2C Controller Intermittently Timeout and Lost ArbitrationmajorMedium+A4 ReleaseDavid AndersIN PROGRESS DESIGN COMPLETE
7719HDMI not working with TFP-401 DVI based devicesmajorMedium+A4 ReleaseDavid AndersACCEPTED
5331error play video via gstreamer with "mfw_isink"criticalMediumFutureOtavio SalvadorNEW
4155i.MX6: VPU plugins for GStreamer do not work with appsinkmajorMediumFutureOtavio SalvadorIN PROGRESS REVIEW
6806Smart failure when running bitbake over and overmajorMediumFutureRobert YangACCEPTED5
7945Toaster startup script assumes it's in a git repositorymajorMediumFutureToaster default assigneeNEW2
8391vncserver setup/tear down not concurrency safemajorMediumFuturebrian averyACCEPTED8
7572SOURCE_DEBUG_ENABLE fails on .76 MinnowMaxmajorMediumProduction Release IN PROGRESS REVIEW
9372Ptest for acl hang because of lack of two user bin and daemoncriticalUndecided---Alexandru GeorgescuNEW
9373ptest for perl hangcriticalUndecided---Alexandru GeorgescuNEW
8947opkg conffile resolution cannot detect unmodified conffiles modified in upgraded packagemajorUndecided---Alejandro del CastilloNEW
9073When local path for src/gz is provided and temp directory is also provided opkg creates mutiple copies of debian packagesmajorUndecided---Alejandro del CastilloNEW
9348Opkg requires root privileges for all operationsmajorUndecided---Alejandro del CastilloNEW
 36       

1.4 & 1.5 Enhancements !(1.4.1, 1.4.2, 1.4.3, 1.5, 1.5.1, 1.5.2)

IDSummarySeverityPMilestoneAssigneeStatusWhiteboardE
 0       

1.6 Enhancement List !

IDSummarySeverityPMilestoneAssigneeStatusWhiteboardE
 0       

1.7 Enhancement List! (no Low's & Medium's )

IDSummary (158 tasks) SeverityPMilestoneAssigneeStatusWhiteboardE
2398make bitbake work using python 3.xenhancementMedium+2.2 M1Richard PurdieIN PROGRESS IMPLEMENTATION
3169Implement Shuku proposalenhancementMedium+2.2 M1Jussi KukkonenIN PROGRESS IMPLEMENTATION15
3433Create Interactive bitbake commandline modeenhancementMedium+2.2Richard PurdieNEW15
4078A method to validate the contents of changes to recipes, configuration files and classesenhancementHigh2.2 M1Michael HalsteadNEWNIR 04/24, 05/01, 05/085
4144Runtime performance testingenhancementMedium+2.2 M3Jose Perez CNEW2
4209Extend our developer experience to enable system and app development on Windows or MacOSenhancementMedium+2.2Tim OrlingNEWThis is a placeholder bug for Eclipse for non Linux platform bug, the estimate will be reflected in the blocking bugs25
4284Presenting information provided by the diffsigs toolenhancementMedium+FutureUnassignedNEW5
4431Set up buildhistory-web for autobuilderenhancementHigh2.2 M1Michael HalsteadACCEPTED3
4527create a Runtime performance test layer to enable runtime performance testsenhancementMedium+2.2 M2Jose Perez CNEW3
4528boot time should be tracked for systemd and SysVinitenhancementMedium+2.2 M3Jose Perez CNEW2
4634BitBake default 'dirs' in exec_func (${B}) causes build failuresenhancementMedium+2.2 M1Ross BurtonNEW5
5369Create test plan to do performance analysis of x32 runtimeenhancementMedium+2.2 M2Jose Perez CNEW3
5477Check for any performance degradations with gcc security flags enabledenhancementMedium+2.2 M3Jose Perez CIN PROGRESS IMPLEMENTATION2
5478test build time performance degradations with gcc security flags enabledenhancementMedium+2.2 M3Jose Perez CIN PROGRESS IMPLEMENTATION2
5534Bitbake resident server autoloading/unloadingenhancementMedium+2.2 M1Richard PurdieACCEPTED3
6238delete projects/builds through the toaster UIenhancementMedium+2.2Belen Barros PenaNEWGUI design pending2
6296Add support for runtime performance tests to image_testsenhancementMedium+2.2 M3Jose Perez CNEW2
6319Automated storage and graphing of build performance metricsenhancementMedium+2.2Benjamin EsquivelNEW5
6359Include QA tests for kernel-dev manual tasksenhancementMedium+2.2 M3Jose Perez CNEW10
6362Runtime machine configurationenhancementMedium+2.2Jianxun ZhangACCEPTED10
6428Improve the ability to isolate changes that have caused a rebuildenhancementMedium+2.2 M2Richard PurdieNEW5
6432Document an example SDK usage workflowenhancementMedium+2.2 M1Paul EggletonACCEPTED2
6437Document how to set up the Yocto Project for production workenhancementMedium+2.2 M1Paul EggletonACCEPTED2
6640Customise BitBake and layer versions in a projectenhancementMedium+2.3Belen Barros PenaNEWGUI design pending7
6707Add ptest for curlenhancementMedium+2.2 M3Ross BurtonNEW3
6803Comprehensive large file supportenhancementMedium+2.2 M2Ross BurtonNEW5
6862input subsystem testingenhancementMedium+2.2 M3Ross BurtonNEW5
6945kernel-dev: multiple kernel buildenhancementMedium+2.2 M1He ZheIN PROGRESS REVIEW4
7376oe-selftest doesn't run lib/oe/tests/*enhancementMedium+2.2 M4Jose Perez CIN PROGRESS DESIGN3
7515Add CVE testing toolenhancementMedium+2.2 M2Mariano LopezIN PROGRESS REVIEW10
7518Build multiple machines in the same bitbake invocationenhancementHigh2.2 M1Richard PurdieNEW15
7555make oe-init-build-env-memres default for 2.2enhancementMedium+2.2Richard PurdieNEW3
7561Port beaglebone BSP to use xf86-video-modesettingsenhancementMedium+2.2 M1Plauchu EdwinIN PROGRESS REVIEW1
7583Gather and allow reporting all types of errors, not just task failuresenhancementHigh2.2 M1Aníbal LimónIN PROGRESS DESIGN5
7654patchwork: ensure superseded patches are marked as suchenhancementMedium+2.2 M1Jose LamegoIN PROGRESS IMPLEMENTATION2
7658patchwork: provide means of recording additional patch statusesenhancementHigh2.2 M1Michael HalsteadNEWNIR 04/24, 05/01, 05/084
7683Provide means of turning a recipe change into a bbappendenhancementMedium+2.2 M2Paul EggletonNEW4
7820Replace Hob with Toaster in EclipseenhancementMedium+2.2Tim OrlingIN PROGRESS IMPLEMENTATION10
7850Handle native and target test dependency binaries in build test and export testenhancementMedium+2.2 M1Mariano LopezIN PROGRESS DESIGN10
7981Set up procedure for layer index database upgradesenhancementMedium+2.2 M1Michael HalsteadIN PROGRESS REVIEW2
8132Implement deleting custom imagesenhancementMedium+2.2 M3Michael WoodNEWGUI design available4
8179It should be possible to disable kernel features using config fragmentsenhancementMedium+2.2 M3Bruce AshfieldIN PROGRESS IMPLEMENTATION10
8318Avoid unnecessary package feed churn due to packages rebuildingenhancementMedium+2.2Stephano CetolaACCEPTED4
8337Make opkg translatable (old issue #42)enhancementUndecided---Alejandro del CastilloNEW
8338ManpagesenhancementUndecided---Alejandro del CastilloNEW
8339Manpages (old issue #56)enhancementUndecided1.0Alejandro del CastilloNEW
8340libopkg needs a better error reporting mechanism (old issue #63)enhancementUndecided0.4Alejandro del CastilloNEW
8343Downgrade to Prefer (old issue #111)enhancementUndecided0.4Alejandro del CastilloNEW
8345Install package(s) only after download of all needed packages. (old issue #116)enhancementUndecided0.4Alejandro del CastilloNEW
8346Check for package list update before downloading (old issue #117)enhancementUndecided1.0Alejandro del CastilloNEW
8347Review performance of algorithms using pkg_vec (old issue #120)enhancementUndecided1.0Alejandro del CastilloNEW
8349dist-upgrade feature (old issue #126)enhancementUndecided1.0Alejandro del CastilloNEW
8350Customisable uid/gid translation during installation (old issue #129)enhancementUndecided0.4Alejandro del CastilloNEW
8353Add multiple compression algorithms support (old issue #148)enhancementUndecided0.4Alejandro del CastilloNEW
8384Exported tests needs a test suiteenhancementMedium+2.2 M1Mariano LopezNEW2
8433Add test for package postinstsenhancementMedium+2.2 M3Leonardo Sandoval GonzalezNEW4
8478Decoupling export test with Yocto build environmentenhancementMedium+2.2 M1Mariano LopezIN PROGRESS REVIEW5
8480Extendable structure for test controller to support kinds of image flash methods and communication methods with DUTenhancementMedium+2.2 M2Aníbal LimónNEW7
8481Generate test tar balls for export testenhancementMedium+2.2 M1Mariano LopezIN PROGRESS REVIEW5
8482Support multi-nodes interoperability testingenhancementMedium+2.2jingwangNEW
8489Update DirectFB to git?enhancementMedium+2.2 M2Jussi KukkonenNEW1
8493Automate manual BSP test casesenhancementMedium+2.3Leonardo Sandoval GonzalezNEW5
8505Add Bluetooth testing suiteenhancementMedium+2.3Leonardo Sandoval GonzalezNEW5
8506Add WiFi testing suiteenhancementMedium+2.3Leonardo Sandoval GonzalezNEW5
8507Add NFC testing suiteenhancementMedium+2.3Leonardo Sandoval GonzalezNEW5
8530runexported.py parameter support for: -m <machine arch>enhancementMedium+2.2 M1jingwangIN PROGRESS IMPLEMENTATION1
8531runexported.py parameter support for: -f <manifest>enhancementMedium+2.2 M1jingwangNEW
8532runexported.py parameter support for: -a <tag>enhancementMedium+2.2 M1Bill RandleACCEPTED15
8533runexported.py parameter support for: -x <xunit>enhancementMedium+2.2 M1jingwangNEW
8534need export manifest files to SDK package under /conf/test/ folders of every layerenhancementMedium+2.2 M1Bill RandleIN PROGRESS REVIEW15
8535export the test scripts under all layers' ./lib/oeqaenhancementMedium+2.2 M1Bill RandleIN PROGRESS REVIEW15
8536support un-extracted package (e.g. rpm) as one type of test binariesenhancementMedium+2.2 M1Mariano LopezIN PROGRESS REVIEW5
8537Feature request: new libopkg APIenhancementUndecided0.4Alejandro del CastilloNEW
8548Document best practises/style guide for selftest tests and update testsenhancementMedium+2.2 M1Ross BurtonNEW2
8554Support for self-contained "baremetal" CPU meta-layersenhancementMedium+2.2 M1Richard PurdieNEW3
8563Improve detection and presentation of build artifactsenhancementMedium+2.2Elliot SmithNEW5
8565Add global preinst/postinst hooks to opkgenhancementUndecided---Alejandro del CastilloNEW
8584Enable building API documentationenhancementMedium+2.2 M3Ross BurtonNEW10
8640Remove vala from oe-core?enhancementMedium+2.2 M1Jussi KukkonenACCEPTED2
8647Script to analyse what areas a patch changes and what tests need runningenhancementHigh2.2 M3Leonardo Sandoval GonzalezACCEPTED13
8648Automatic testing of incoming patchesenhancementHigh2.2 M1Michael HalsteadNEWNIR 04/24, 05/01, 05/0810
8649Script to assemble patches for autobuilder testingenhancementHigh2.2 M1Michael HalsteadNEWNIR 04/24, 05/01, 05/0815
8657extensible SDK: improve handling for sanity checksenhancementMedium+2.2 M1Paul EggletonNEW1
8694Add support for multiple binaries in one testenhancementMedium+2.2 M1Mariano LopezIN PROGRESS REVIEW5
8699offer a way to use sstate-object hashes as dependencies of builds/packagesenhancementMedium+2.2 M2Joshua LockACCEPTED4
8704patchwork: support history tracking of patch statusenhancementMedium+2.2 M1Jose LamegoIN PROGRESS REVIEW3
8714Patchwork frontend page for incoming patch testingenhancementMedium+2.2 M1Jose LamegoNEWGUI design pending6
8715Update patchwork / build status page on patch test build completionenhancementMedium+2.2 M1Jose LamegoACCEPTED2
8716Build summary page for incoming patch testingenhancementMedium+2.2 M1Jose LamegoNEWGUI design pending4
8717patchwork: keep build page up-to-date with important patch status changesenhancementMedium+2.2 M1Jose LamegoNEW2
8724Automate information collection for runtime errorsenhancementMedium+2.2 M1Bill RandleIN PROGRESS DESIGN410
8761[RMC]: Handle machine specific kernel command line differencesenhancementMedium+2.2 M1Jianxun ZhangIN PROGRESS IMPLEMENTATION15
8773refactor yocto-kernel-cache common-pc / intel-common scc/cfg file to reduce delta & overlapenhancementMedium+2.2 M1California SullivanACCEPTED11
8851Add bashism checks for shell script functionsenhancementMedium+2.2 M3Ross BurtonIN PROGRESS IMPLEMENTATION5
8880Need better allarch multilib sanity or automated QA testsenhancementMedium+2.2 M1Robert YangNEW5
8938oe-selftest: refactor command line arguments so usage is simplerenhancementMedium+2.2 M2Humberto IbarraACCEPTED3
8948Implement *.md5sums (or equivalent)enhancementUndecided---Alejandro del CastilloNEW
8962AUH: Add support for meta-intelenhancementMedium+2.2 M2Aníbal LimónNEW3
8974Add eSDK benchmarkingenhancementMedium+2.2 M1Markus LehtonenNEW2
9004Produce container image providing extensible SDKenhancementMedium+2.2 M1Randy WittNEW4
9023Improve the content of the "other artifacts" sectionenhancementMedium+2.2Elliot SmithNEWGUI design pending4
9037Consider alternate methods for maintain Yocto releases after 1yrenhancementMedium+2.2 M1Richard PurdieNEW1
9088Extensible SDK add tests for devtoolenhancementMedium+2.2 M2Aníbal LimónNEW3
9090extensible sdk test compatibility with sdkenhancementMedium+2.2 M2Aníbal LimónNEW1
9112pseudo connection startup/reworkenhancementHigh2.2 M1SeebsNEW
9130Update OE patchwork instanceenhancementHigh2.2 M1Michael HalsteadACCEPTED
9132Toaster integrate testing into AB/buildbotenhancementMedium+2.2 M1Aníbal LimónIN PROGRESS IMPLEMENTATION5
9184Cannot delete layer from toaster databaseenhancementMedium+2.2Michael WoodNEWGUI design pending
9244patchtest-oe: Create tests to validate recipes, classes or config filesenhancementMedium+2.2 M1Leonardo Sandoval GonzalezACCEPTED5
9255Allow rootfs tasks to run in parallel with rpmenhancementMedium+2.2 M1Richard PurdieNEW0.5
9261Can't distinguish between delayed and failed postinstenhancementMedium+2.2 M1Ross BurtonNEW3
9292Update Graphic recipes with candidate versions in planned Graphic Stack 2016Q1 ReleaseenhancementMedium+2.2 M1Jianxun ZhangACCEPTED0.1
9293bitbake: Add support for trigger event on errors like exceptionsenhancementHigh2.2 M1Aníbal LimónIN PROGRESS IMPLEMENTATION5
9298Autobuilder enable KVM on the cluster for x86, x86-64enhancementHigh2.2 M1Beth FlanaganNEW4.5
9299Enable Tracing boot and process times in testing imagesenhancementMedium+2.2 M2Aníbal LimónNEW5
9335[Autobuilder] Add support for display bitbake log errors in buildbot pageenhancementMedium+2.2 M1Beth FlanaganIN PROGRESS DESIGN4
9338Support building optimised Python (with profile-opt make target)enhancementMedium+2.2 M2Markus LehtonenNEW
9361Failed to reconfigure a project in Eclipse with eSDKenhancementMedium+2.2 M2Paul EggletonNEW3
9377Enable automated build performance testing in AutobuilderenhancementMedium+2.2 M1Markus LehtonenACCEPTED
9383Move to LSB 5enhancementHigh2.2 M2Ross BurtonNEW3
9387Extensible SDK: add image customisation functionalityenhancementMedium+2.2 M2Paul EggletonNEW5
9391refactor syslinux.bbclass, grub-efi.bbclass and gummiboot.bbclassenhancementMedium+2.2 M2Robert YangNEW10
9401patchtest: show assertion messages on summaryenhancementMedium+2.2 M1Leonardo Sandoval GonzalezACCEPTED1
9403patchtest-oe: show the solution on the assertion messageenhancementMedium+2.2 M1Leonardo Sandoval GonzalezACCEPTED1
9432Add test for exported test functionalityenhancementMedium+2.2 M1Mariano LopezNEW3
9439Verify that the REST API works with httpsenhancementMedium+2.2 M2Elliot SmithIN PROGRESS REVIEW1
9448Add mechanism for running image level QA checksenhancementMedium+2.2 M2Joshua LockACCEPTED1
9449[meta-swupd] Add libarchive backend to swupd-server to improve runtime of do_swupd_updateenhancementMedium+2.2 M1Joshua LockNEW5
9450Add automated runtime tests that use the musl libc rather than glibcenhancementMedium+2.2 M1Beth FlanaganNEW2
9454improve on why a recipe is builtenhancementMedium+2.2 M1Robert YangNEW10
9457patchtest: security check on incoming patchesenhancementHigh2.2 M1Leonardo Sandoval GonzalezACCEPTED5
9460Provide a way to automate testing of meta-mingw and meta-darwin layers.enhancementMedium+2.2 M2Beth FlanaganNEW3
9466enhance kernel configuration audit to include reasons for missing configs, and required config checkingenhancementMedium+2.2 M2Bruce AshfieldIN PROGRESS DESIGN COMPLETE7
9481Add example to "5.23. Debugging With the GNU Project Debugger (GDB) Remotely"enhancementMedium+2.2 M1Scott RifenbarkNEW
9493Support dummy/empty bundlesenhancementMedium+2.2 M1Joshua LockIN PROGRESS IMPLEMENTATION1
9502Add a way to build container images using oe-coreenhancementMedium+2.2 M1Randy WittNEW3
9515update-rcd class should add build dependencies if requiredenhancementMedium+2.2 M2Mariano LopezNEW1
9517Move to Bootstrap 3enhancementHigh2.2 M1Belen Barros PenaNEW
9519Consolidate used API into it's own viewenhancementMedium+2.2 M2Michael WoodNEW
9527Implement initial support for a stateless OSenhancementMedium+2.2 M1Joshua LockNEW10
9537recipetool: support node.js code outside of npmenhancementMedium+2.2 M1Paul EggletonNEW
9538Review common security hardening flags and expand security_flags.incenhancementMedium+2.2 M2Joshua LockNEW10
9556The EFI bootloaders should deploy startup.nsh for wicenhancementMedium+2.2 M2Christopher LarsonIN PROGRESS REVIEW
9559test reporting tool planenhancementHigh2.2 M1Benjamin EsquivelNEW5
9563yocto-kernel script should use argparse instead of optparse libraryenhancementMedium+2.2 M1Humberto IbarraACCEPTED5
9564yocto-layer script should use argparse instead of optparse libraryenhancementMedium+2.2 M1Humberto IbarraACCEPTED5
9588Create a method for describing builds and desired output. aka a build descriptorenhancementHigh2.2 M1Randy WittNEW5
9589Create a script for consuming a "build descriptor"enhancementMedium+2.2 M1Randy WittNEW5.34
9592Add a mechanism for creating build appliance as a container imageenhancementHigh2.2 M1Randy WittNEW4
9599Reduce bundle overheads by not depending on os-core when generating bundle sysrootsenhancementMedium+2.2 M1Joshua LockIN PROGRESS IMPLEMENTATION4
9613Extensible SDK: Improve perceived performance of preparation during installenhancementMedium+2.2 M2Paul EggletonNEW
9623Rewrite build-perf-test.sh in pythonenhancementMedium+2.2 M1Markus LehtonenNEW4
9624build-perf-test: store test results in GitenhancementMedium+2.2 M1Markus LehtonenNEW
9625build-perf-test: re-organize test output dataenhancementMedium+2.2 M1Markus LehtonenNEW
9631add state Transitions to progress bar as well as build progress.enhancementMedium+2.2Elliot SmithNEWGUI design pending10
9633Content of INSTALL file is incompatible with release source codeenhancementUndecided0.3.2Alejandro del CastilloNEW
9635buildhistory-diff script should use argparse instead of optparse libraryenhancementMedium+2.2 M1Humberto IbarraACCEPTED5
9636wic script should use argparse instead of optparse libraryenhancementMedium+2.2 M1Humberto IbarraACCEPTED5
 158       

NEEDINFO

IDSummary (9 tasks) RequesterAssigneeStatusSeverityPMilestone
9434Running testimage test_parselogs failed getting the following error message failed to retrieve link info, disabling eDP on Minnowboard Max 32 and 64Francisco PedrazaCalifornia SullivanNEEDINFOnormalUndecided2.1 M4
9407bitbake reports log_check warning without stating in which log/recipe the problem occurredHeinz WrobelHeinz WrobelNEEDINFOnormalMedium2.2 M1
9513Failed to install sdk_ext for i686Yi ZhaoRichard PurdieNEEDINFOnormalMedium+2.2 M1
9536oe-selftest: test_sstate_noop_samesigs failed due qmmp LICENSE_FLAGS_WHITELISTFrancisco PedrazaFrancisco PedrazaNEEDINFOnormalMedium+2.2 M1
8652meta/recipes-devtools/ruby/ uses --disable-versioned-paths, but no such option exists  NEEDINFOminorLow2.2 M1
9217Many unsolveable QA warnings from build-deps and file-rdepsMartin JansaMartin JansaNEEDINFOnormalMedium2.2 M3
2442feature request: manifest files per licenseFrans MeulenbroeksFrans MeulenbroeksNEEDINFOenhancementLowFuture
9300AFTER POWER ON, LED(D1)ON BUT LED(D2)flickerkeralJohn 'Warthog9' HawleyNEEDINFOnormalMediumProduction Release
9392When running testimage test_syslog_startup_config failed getting test log string not found output grep: /var/log/test error messageFrancisco PedrazaFrancisco PedrazaNEEDINFOnormalUndecided---
 9      

Old Milestone

IDSummary (8479 tasks) RequesterAssigneeStatusSeverityPMilestone
8166[libsolv] libsolv's upgrade will not automatically remove orphaned dependantsEric YuAlejandro del CastilloNEWenhancementMedium0.3.2
8341Allow installation of a specified version of a package (old issue #76)Alejandro del CastilloAlejandro del CastilloRESOLVEDenhancementUndecided0.3.2
8351double entries in the info file (old issue #142)Alejandro del CastilloAlejandro del CastilloNEWnormalUndecided0.3.2
8354[libsolv] conflicts+replaces+provides causes untracked files (old issue #156)Alejandro del CastilloAlejandro del CastilloRESOLVEDnormalUndecided0.3.2
8361opkg compare_versions is broken (old issue #166)Alejandro del CastilloAlejandro del CastilloRESOLVEDnormalUndecided0.3.2
8362[internalsolv] With circular dependencies, all installed packages are marked as autoinstalled (old issue #167)Alejandro del CastilloAlejandro del CastilloRESOLVEDminorUndecided0.3.2
8601[internalsolv] entry of a package which is not installed and it does not let other package get installed on which it is dependentjatin jainAlejandro del CastilloRESOLVEDnormalUndecided0.3.2
8931replaces field does not support version constrainsAlejandro del CastilloAlejandro del CastilloNEWmajorUndecided0.3.2
9059[internalsolv]"Provides" doesn't seem to work if package also "Conflicts" with the package it providesScot SalmonAlejandro del CastilloRESOLVEDnormalUndecided0.3.2
9218[internalsolv] opkg installation order is backwardsAlejandro del CastilloAlejandro del CastilloRESOLVEDcriticalUndecided0.3.2
9456opkg-build does not return error when Version is missing from control fileThomas De SchampheleireAlejandro del CastilloRESOLVEDnormalUndecided0.3.2
9477Conflicted packages get installed incorrectlyRoss BurtonAlejandro del CastilloRESOLVEDmajorUndecided0.3.2
9533Opkg does not report a conflict when installing a pkg that provides/conflicts with an installed pkgAlejandro del CastilloAlejandro del CastilloRESOLVEDnormalUndecided0.3.2
9557opkg fails to parse some feeds whose Packages file was created with a 3rd party toolJosh PrewittAlejandro del CastilloRESOLVEDnormalUndecided0.3.2
9633Content of INSTALL file is incompatible with release source codeOleg GashevAlejandro del CastilloNEWenhancementUndecided0.3.2
8340libopkg needs a better error reporting mechanism (old issue #63)Alejandro del CastilloAlejandro del CastilloNEWenhancementUndecided0.4
8342[internalsolv] Opkg fails to attempt all satisfying dependencies after installing the first one fails (old issue #85)Alejandro del CastilloAlejandro del CastilloNEWminorUndecided0.4
8343Downgrade to Prefer (old issue #111)Alejandro del CastilloAlejandro del CastilloNEWenhancementUndecided0.4
8344update-alternatives: Support change of link path during upgrade (old issue #113)Alejandro del CastilloAlejandro del CastilloNEWnormalUndecided0.4
8345Install package(s) only after download of all needed packages. (old issue #116)Alejandro del CastilloAlejandro del CastilloNEWenhancementUndecided0.4
8348opkg removes package provider on upgrade (old issue #121)Alejandro del CastilloAlejandro del CastilloRESOLVEDnormalUndecided0.4
8350Customisable uid/gid translation during installation (old issue #129)Alejandro del CastilloAlejandro del CastilloNEWenhancementUndecided0.4
8352Needs a more detailed error message if an upgarde is not possible (old issue #143)Alejandro del CastilloAlejandro del CastilloNEWnormalUndecided0.4
8353Add multiple compression algorithms support (old issue #148)Alejandro del CastilloAlejandro del CastilloNEWenhancementUndecided0.4
8355Not possible to build static opkg 0.3 (old issue #158)Alejandro del CastilloAlejandro del CastilloNEWnormalUndecided0.4
8356Opkg flag always returns successAlejandro del CastilloAlejandro del CastilloNEWminorUndecided0.4
8357Add comman line option to skip package signature check (old issue #161)Alejandro del CastilloAlejandro del CastilloNEWnormalUndecided0.4
8358[internalsolv] package with both non-conflicting and conflicting dependencies will result in installation of orphaned pakages (old issue #162)Alejandro del CastilloAlejandro del CastilloRESOLVEDnormalUndecided0.4
8359[internalsolv] --force-removal-of-dependent-packages does not remove packages depending on the removed package (old issue #163)Alejandro del CastilloAlejandro del CastilloNEWnormalUndecided0.4
8360[internalsolv] Packages fail to install when Recommends can't be installed (old issue #165)Alejandro del CastilloAlejandro del CastilloNEWnormalUndecided0.4
8537Feature request: new libopkg APIJinAlejandro del CastilloNEWenhancementUndecided0.4
8946opkg install does not appear to fail on file overwriteRichard TollertonAlejandro del CastilloNEWmajorUndecided0.4
47Depends on GTK+ 2.12Ross Burton - DisabledRob BradfordRESOLVEDnormalHigh0.9 M1
83Remove experimental status from gdb integrationJoshua Lock - DisabledJoshua Lock - DisabledVERIFIEDnormalHigh0.9 M1
84Deploy action cannot be cancelledJoshua Lock - DisabledJoshua Lock - DisabledVERIFIEDnormalHigh0.9 M1
86Remote debug failsGary Thomasliping KeVERIFIEDnormalHigh0.9 M1
88Which host/cross GDB to use?Gary ThomasJoshua Lock - DisabledRESOLVEDnormalHigh0.9 M1
91after successful Deploy, error message still printingliping Keliping KeVERIFIEDnormalHigh0.9 M1
179when parse netbook environment script, error happens when creating c projectliping KeJessicaVERIFIEDnormalUndecided0.9 M1
214oprofile recipe is failing to build on armNitin KambleKevin TianRESOLVEDnormalUndecided0.9 M1
223gcc-cross-canadian compile failed (qemux86)Kevin TianJoshua Lock - DisabledVERIFIEDmajorHigh0.9 M1
123Wrong qemu binary is used if qemu-native isn't builtRichard PurdieJoshua Lock - DisabledRESOLVEDnormalMedium0.9 M2
126Both booting/install poky-image-sdk-live on notebook on HP mini failsliping KeRichard PurdieVERIFIEDcriticalHigh0.9 M2
131Yocto SDK plugin set the wrong environment variables for cross autotoolLianhao LuJessicaVERIFIEDmajorMedium0.9 M2
141Mouse/Keyboard cannot work with poky-image-sato-live on netbookJiajun XuJeff DikeVERIFIEDcriticalHigh0.9 M2
142emenlow live image cannot boot/installJiajun XuJeff DikeVERIFIEDcriticalHigh0.9 M2
157shared library libXdamage.so is missing which prevents the latencytop to be functionalLianhao LuDexuan CuiVERIFIEDcriticalMedium0.9 M2
159[emenlow] X not bootable of image poky-image-sato-live-emenlowLianhao LuJeff DikeVERIFIEDcriticalHigh0.9 M2
161[toolchain] Cannot build LTP with ppc/arm toolchainJiajun XuNitin KambleVERIFIEDcriticalHigh0.9 M2
167wrong "root location" directory not caughtLianhao LuJessicaVERIFIEDnormalMedium0.9 M2
171[Netbook] Xserver version mismatch makes mouse/keyboard not workJiajun XuJeff DikeVERIFIEDcriticalHigh0.9 M2
174[eclipse] autogen.sh failed with error optionsLianhao LuJessicaVERIFIEDcriticalHigh0.9 M2
178[eclipse] can NOT launch qemu in the eclipse IDELianhao LuJessicaVERIFIEDcriticalUndecided0.9 M2
98Turn host triplet into option listJessicaJessicaVERIFIEDenhancementLow0.9 M3
125Qemu (sdk-qemux86) often enters non-responsive stageliping KeRichard PurdieVERIFIEDmajorMedium0.9 M3
127libgthread is not include in SDK tool chainliping KeNitin KambleVERIFIEDmajorMedium0.9 M3
132dhcp fails in netbookliping KeQing HeVERIFIEDnormalMedium0.9 M3
135Build failure while importing sudoku testing projectliping KeNitin KambleVERIFIEDmajorMedium0.9 M3
147i586-poky-linux-gdb is missing in poky_root/build/tmp/sysroots/i686-linux/usr/binliping KeNitin KambleVERIFIEDnormalMedium0.9 M3
148[Netbook] pcmanfm no response after I click File Manager iconJiajun XuEdwin ZhaiVERIFIEDmajorMedium0.9 M3
150[Netbook] Application Video cannot play ogg format fileJiajun XuDongxiao XuVERIFIEDcriticalMedium0.9 M3
151[Netbook] Music Player cannot play WAV format fileJiajun XuDongxiao XuVERIFIEDmajorMedium0.9 M3
152matched oprofile ui viewer should be provided.liping KeDexuan CuiVERIFIEDnormalMedium0.9 M3
153binutils build failure when target is ARM on x86-64 build systemKevin TianNitin KambleVERIFIEDnormalMedium0.9 M3
156Oprofile not supported by the kernelLianhao LuBruce AshfieldVERIFIEDmajorMedium0.9 M3
158tcf-agent launched with misleading optionsLianhao LuDexuan CuiVERIFIEDnormalMedium0.9 M3
162finalize poky build tree sysroot directory structureJessicaRichard PurdieRESOLVEDmajorHigh0.9 M3
163mesa-dri recipe build fails on 64bit hostNitin KambleKe YuVERIFIEDnormalMedium0.9 M3
164latencytop NOT functional due to the kernel configurationLianhao LuBruce AshfieldVERIFIEDmajorMedium0.9 M3
165enchant lacks DEPENDS of glib-2.0Dexuan CuiDongxiao XuVERIFIEDnormalMedium0.9 M3
168wrong debug/optimization settings for Yocto SDK C++ projectLianhao LuJessicaVERIFIEDcriticalMedium0.9 M3
175c++ standard lib is not included in poky-sdk-image-live on netbook.liping KeNitin KambleVERIFIEDnormalMedium0.9 M3
177no output from powertop due to the lack of kernel supportLianhao LuBruce AshfieldVERIFIEDmajorMedium0.9 M3
180'at' requires a mail system on targetKevin TianNitin KambleVERIFIEDnormalMedium0.9 M3
181[eclipse] build failure of org.Yocto.sdk.ide due to incorrect java annotationLianhao LuJessicaVERIFIEDmajorUndecided0.9 M3
182[eclipse] build failure of org.eclipse.tm.tcf.terminals due to incorrect java annotationLianhao LuLianhao LuVERIFIEDmajorUndecided0.9 M3
184Environment script specification field is not neededJessicaJessicaVERIFIEDenhancementHigh0.9 M3
187Remote deploy can only deploy one fileJessicaJessicaVERIFIEDcriticalHigh0.9 M3
189Qemu launchers should be per architecture typeJessicaJessicaVERIFIEDenhancementMedium0.9 M3
192automatically configure cross-gdb for remote debugginJessicaJessicaVERIFIEDenhancementMedium0.9 M3
193missing component in org.Yocto.sdk.ide source buildingLianhao LuJessicaVERIFIEDnormalUndecided0.9 M3
194"No init found" error when booting x86-64 qemu imageKevin TianRichard PurdieVERIFIEDcriticalUndecided0.9 M3
201[toolchain] lack of libGL.so to run qemu/qemu-system-* from toolchain tarballJiajun XuEdwin ZhaiVERIFIEDmajorHigh0.9 M3
203Remote debug will fail if not reset remote shell launchJessicaliping KeVERIFIEDcriticalHigh0.9 M3
204gdb has apparently host-contaminationMark HatleNitin KambleRESOLVEDnormalMedium0.9 M3
208[matchbox] X window fails to start up with matchbox-panel/desktop segfaultJiajun XuNitin KambleVERIFIEDcriticalHigh0.9 M3
209prelink-native failures to build, due to missing libiberty from binutilsMark HatleNitin KambleRESOLVEDmajorHigh0.9 M3
210tcl: tcl installation is using the target version of tclsh, not the nativeSaul WoldNitin KambleVERIFIEDmajorHigh0.9 M3
218qemu-native does not generate qemu-i386 binaryNitin KambleEdwin ZhaiRESOLVEDnormalHigh0.9 M3
220kernel panic during booting the poky-image-sdk for qemux86Lianhao LuSaul WoldVERIFIEDcriticalUndecided0.9 M3
224[Netbook/emenlow] matchbox-panel segfault after X startupJiajun XuEdwin ZhaiVERIFIEDnormalMedium0.9 M3
233error in fetching WR kernel in poky masterLianhao LuJoshua Lock - DisabledVERIFIEDcriticalHigh0.9 M3
234X fail to start on x86-64 targetEdwin ZhaiEdwin ZhaiVERIFIEDmajorHigh0.9 M3
243poky-image-lsb build failure on qemu ppcDongxiao XuDongxiao XuVERIFIEDmajorHigh0.9 M3
244poky-image-lsb build failure on qemu mipsDongxiao XuSaul WoldVERIFIEDmajorHigh0.9 M3
248When poky root directory changes, the target combo box is not correctliping Keliping KeVERIFIEDnormalMedium0.9 M3
249when deactivate poky plugin, project could be compiled correctly in nativeliping Keliping KeVERIFIEDnormalMedium0.9 M3
253env script file PATH length execeeds 1000liping Keliping KeVERIFIEDnormalMedium0.9 M3
255oprofile-server can NOT be launched within Qemu through Eclipse IDELianhao LuLianhao LuVERIFIEDmajorUndecided0.9 M3
258[Qemu] All qemu targets fail to get network accessJiajun XuKevin TianVERIFIEDcriticalHigh0.9 M3
260[Graphics] No QT built in imagesJiajun XuSaul WoldVERIFIEDcriticalHigh0.9 M3
264generate locale error for meta-toolchain for all archsKevin TianKevin TianVERIFIEDcriticalHigh0.9 M3
299qemuarm images can not boot upxianchao zhangBruce AshfieldVERIFIEDcriticalHigh0.9 M3
303[qemux86] No enough disk space with qemux86 sdk imageJiajun XuDexuan CuiVERIFIEDmajorHigh0.9 M3
306[qemux86-64] No e1000 module built in qemux86-64 imageJiajun XuBruce AshfieldVERIFIEDcriticalHigh0.9 M3
81SRC_URI with http or ftp path having "/download" at end fails to retrieve sourceLevant TinazJoshua Lock - DisabledRESOLVEDmajorMedium0.9 M4
82Dismissing the dialog asking for sudo password breaks interactionJoshua Lock - DisabledScott GarmanVERIFIEDnormalMedium0.9 M4
97create target images to contain perf/ftraceJessicaBruce AshfieldVERIFIEDnormalMedium0.9 M4
99No mouse action response in X window with qemumips imagesJiajun XuBruce AshfieldVERIFIEDmajorHigh0.9 M4
100qemuarm and qemuppc images cannot shutdown entirelyJiajun XuBruce AshfieldVERIFIEDnormalMedium0.9 M4
111Ongoing qemugl issuesJoshua Lock - DisabledEdwin ZhaiVERIFIEDnormalHigh0.9 M4
118Switch to using eglibcJoshua Lock - DisabledNitin KambleVERIFIEDnormalMedium0.9 M4
133tools (oprofile viewer/client) does not match with tools (oprofile) serverliping KeScott RifenbarkVERIFIEDnormalMedium0.9 M4
143Generate locales at build time to speed up first bootJiajun XuNitin KambleVERIFIEDenhancementLow0.9 M4
144avahi-daemon fail to start with qemumips sdk imageJiajun XuSaul WoldVERIFIEDminorMedium0.9 M4
155Need a 5-minute newbie user guideDave StewartScott RifenbarkRESOLVEDmajorMedium0.9 M4
160[emenlow] command reboot cannot make system reboot entirelyJiajun XuTom ZanussiVERIFIEDnormalMedium0.9 M4
170Mouse shadow in qemux86Dongxiao XuKe YuVERIFIEDnormalMedium0.9 M4
190Setup update capability for Yocto Linux Eclipse Plug-inJessicaLianhao LuRESOLVEDenhancementMedium0.9 M4
197[emenlow] amixer cannot enable audio on emenlowJiajun XuQing HeVERIFIEDmajorMedium0.9 M4
198CONFIG_FB is disabled in x86-64 kernel on QemuKevin TianBruce AshfieldVERIFIEDnormalMedium0.9 M4
199some NETFILTER options missing in current WR kernel configsKevin TianBruce AshfieldVERIFIEDnormalMedium0.9 M4
219dpkg does not build properlyMark HatleDongxiao XuRESOLVEDnormalLow0.9 M4
226qemu binaries break after this commit : 940c2b470af70b40fc6506823cd9c43e9b621075Nitin KambleMark HatleRESOLVEDnormalMedium0.9 M4
228[toolchain] qemu/qemu-system-* not work even with libGL.so installedJiajun XuEdwin ZhaiVERIFIEDnormalMedium0.9 M4
230runqemu scripts break when more than one tun/tap device is createdliping KeScott GarmanVERIFIEDnormalMedium0.9 M4
231Meet error message prompt when extracting qemu root fsliping KeMark HatleVERIFIEDminorMedium0.9 M4
232Give better error prompt when user don't use root privilege to run poky-qemu-ifupliping KeScott GarmanVERIFIEDnormalMedium0.9 M4
235enable more kernel options to make PowerTop work betterDexuan CuiJoshua Lock - DisabledVERIFIEDnormalMedium0.9 M4
242X hang when starting on x86-64 targetEdwin ZhaiEdwin ZhaiVERIFIEDmajorHigh0.9 M4
245binutils missing the point host directories patchMark HatleNitin KambleRESOLVEDnormalMedium0.9 M4
247Meet sysroot not found error with scenario2: poky tree modeliping KeScott GarmanVERIFIEDnormalMedium0.9 M4
252Meet a strange problem when compiling vim7.3 if set --build=iX86-linuxliping KeJoshua Lock - DisabledVERIFIEDnormalMedium0.9 M4
257enhance update-alternative.bbclass to support multiple alternativesKevin TianKevin TianVERIFIEDnormalMedium0.9 M4
261kernel in eMenlow target does NOT support various SDK toolsLianhao LuTom ZanussiVERIFIEDmajorMedium0.9 M4
262guilt is missing when patching x86-64 wr kernelKevin TianBruce AshfieldVERIFIEDcriticalHigh0.9 M4
263Improve Yocto Setting UI user input experiencesliping Keliping KeVERIFIEDenhancementMedium0.9 M4
266[Connman] AP state change does not show up in ConnmanJiajun XuDongxiao XuVERIFIEDnormalMedium0.9 M4
267[Connman] Not able to disconnect from power-off AP in ConnmanJiajun XuDongxiao XuVERIFIEDnormalMedium0.9 M4
268Fetcher speed enhancements when a vcs update required (i.e. git with fullclone)Joshua Lock - DisabledJoshua Lock - DisabledVERIFIEDenhancementLow0.9 M4
269sstate manifests need to be orderedJeff PolkRichard PurdieRESOLVEDnormalMedium0.9 M4
271Qt-X11-Free on MIPS gets link error during final phaseSaul WoldKe YuVERIFIEDmajorHigh0.9 M4
272Add Zypper and Openssh to task-poky-lsbSaul WoldSaul WoldVERIFIEDnormalMedium0.9 M4
273remove meta-moblin from conf/bblayers.conf.sampleSaul WoldScott GarmanVERIFIEDnormalMedium0.9 M4
274libzypp fails to compile for ppcSaul WoldKevin TianVERIFIEDcriticalHigh0.9 M4
276at: fails to build correctly, possibly parallelism issueSaul WoldNitin KambleVERIFIEDmajorMedium0.9 M4
277libzypp fails to compile for mipsKevin TianKevin TianVERIFIEDnormalMedium0.9 M4
278POKY_NATIVE_SYSROOT error for sdk tarballliping KeJoshua Lock - DisabledVERIFIEDmajorMedium0.9 M4
279[Qemux86-64] v86d segfault in libc-2.10.1.soJiajun XuBruce AshfieldVERIFIEDnormalMedium0.9 M4
281Cleanup userspace packages description/summaryMark HatleMark HatleRESOLVEDenhancementLow0.9 M4
286libzypp fails on x86-64 targetKevin TianKevin TianVERIFIEDnormalMedium0.9 M4
287connmand segfault with qemumips sato/sdk imagesxianchao zhangQing HeVERIFIEDnormalMedium0.9 M4
288avahi-daemon load shared libraries error with qemux86 imagexianchao zhangQing HeVERIFIEDminorMedium0.9 M4
289X server can not start successfully with sato/sdk in qemux86xianchao zhangKe YuVERIFIEDnormalHigh0.9 M4
291Bitbake logging is brokenJoshua Lock - DisabledRichard PurdieVERIFIEDnormalMedium0.9 M4
294runqemu script can fail to shut down tap devicesScott GarmanScott GarmanVERIFIEDnormalLow0.9 M4
295consolidate runqemu-nfs and poky-qemu scriptsJessicaScott GarmanVERIFIEDnormalMedium0.9 M4
296[Netbook] Music Player may crash when adding multiple filesKunwei TianDongxiao XuVERIFIEDnormalMedium0.9 M4
297[Netbook] No sound from headphone when playing audio fileKunwei TianDongxiao XuVERIFIEDnormalMedium0.9 M4
298groff fails on x86-64 targetKevin TianXiaofeng YanVERIFIEDnormalMedium0.9 M4
300Adjust the layout of Yocto remote tools' setting dialogueLianhao LuLianhao LuVERIFIEDnormalUndecided0.9 M4
301[QT] qmmp not built in imagesJiajun XuKe YuVERIFIEDnormalMedium0.9 M4
302early detection of the prior requirement to run yocto remote toolsLianhao LuLianhao LuVERIFIEDmajorMedium0.9 M4
305qemu-native does not provide qemu-mipsel binaryNitin KambleBruce AshfieldRESOLVEDnormalMedium0.9 M4
307cstlib is not found with latest sdk image running in netbookliping KeNitin KambleVERIFIEDmajorMedium0.9 M4
308[qemux86-64] keyboard pop up when clicking terminal iconJiajun XuEdwin ZhaiVERIFIEDnormalMedium0.9 M4
309Improve progress monitor of Eclipse tool plugin org.yocto.sdk.remotetoolsLianhao LuLianhao LuVERIFIEDnormalMedium0.9 M4
311fixes for perfTom ZanussiTom ZanussiRESOLVEDnormalMedium0.9 M4
312Section NumberingDarren HartScott RifenbarkVERIFIEDnormalMedium0.9 M4
313PDF orphans image captionsDarren HartScott RifenbarkVERIFIEDnormalMedium0.9 M4
314Handbook references Ubuntu 7.04 (old)Darren HartScott RifenbarkVERIFIEDnormalMedium0.9 M4
315Additional package requirementsDarren HartScott RifenbarkRESOLVEDnormalMedium0.9 M4
316QuickStart claims 20 GB of space (I needed 49)Darren HartScott RifenbarkVERIFIEDnormalMedium0.9 M4
318QuickStart: /dev/fb0 write permission requiredDarren HartScott RifenbarkVERIFIEDnormalMedium0.9 M4
319Time showing on matchbox-panel not sync with system timeKunwei TianEdwin ZhaiVERIFIEDnormalLow0.9 M4
321avahi-daemon with qemuarm sato image load shared libraries errorxianchao zhangQing HeVERIFIEDminorLow0.9 M4
323unfs-qemu arm failed to bootliping KeDongxiao XuVERIFIEDcriticalHigh0.9 M4
324runqemu command not found after source /opt/poky/environment-setup-armv5teXXXliping KeScott GarmanVERIFIEDnormalMedium0.9 M4
325the arm gdb tool name convention is not target-triplet + "-gdb"liping KeRichard PurdieVERIFIEDnormalMedium0.9 M4
326gdb need to set solib-search-path or sysroot and need setup script file export target_sysrootliping KeRichard PurdieVERIFIEDnormalMedium0.9 M4
327rpm package installation failure in targetQing HeMark HatleVERIFIEDnormalMedium0.9 M4
328zypper fails to find rpmdb2solvQing HeQing HeVERIFIEDnormalMedium0.9 M4
329"bitbake poky-image-sdk" will fail if eglibc is used.Dexuan CuiDexuan CuiVERIFIEDmajorMedium0.9 M4
330/dev/fb0 missing on x86Saul WoldDarren HartVERIFIEDnormalMedium0.9 M4
331Ensure python output from tasks is always saved to log filesMark HatleRichard PurdieRESOLVEDenhancementLow0.9 M4
332rpm installation shows messaeg "error: LOOP:"Qing HeMark HatleVERIFIEDnormalMedium0.9 M4
333perf application is missing in the qemux86 SDK target in the M3 milestone 20100911-1Lianhao LuSaul WoldVERIFIEDmajorMedium0.9 M4
334qemu-arm fails whilst building locales (Ubuntu 10.04 )liping KeJoshua Lock - DisabledRESOLVEDnormalMedium0.9 M4
335Bitbake of ncurses fails with undefined symbol: _PyUnicodeUCS4_AsDefaultEncodedStringDaniel DíazSaul WoldVERIFIEDnormalMedium0.9 M4
337SUMMARY field is not automatically populated by the DESCRIPTION fieldMark HatleSaul WoldRESOLVEDnormalMedium0.9 M4
338on qemux86-64, "bitbake poky-image-minimal" will fail if eglibc is used.Dexuan CuiDexuan CuiVERIFIEDmajorHigh0.9 M4
340SUDOKU C++ GTK project build failure when in poky tree mode in ARM archliping KeRichard PurdieVERIFIEDmajorMedium0.9 M4
341Two gtk libs are not found (arm)liping KeJoshua Lock - DisabledRESOLVEDnormalMedium0.9 M4
342GCC should report error if there are poison parametersDongxiao XuDongxiao XuVERIFIEDenhancementMedium0.9 M4
343unfs-qemu ppc fails to bootliping KeDongxiao XuRESOLVEDmajorHigh0.9 M4
344qemu command is often locked recently because tap0 still exists after successfully shutdownliping KeScott GarmanVERIFIEDmajorHigh0.9 M4
345rsync is missing in ppc qemuliping KeQing HeRESOLVEDmajorHigh0.9 M4
346arm gdb poky_tree mode client and server communication failsliping KeSaul WoldVERIFIEDnormalMedium0.9 M4
347[QT] libQtGui.so on qemux86-64 uses SSSE3 instructions and crashes QemuQing HeQing HeVERIFIEDnormalMedium0.9 M4
351Can't build e2fsprogs-nativeGary ThomasKevin TianRESOLVEDnormalMedium0.9 M4
352"bitbake poky-image-sdk" fails because eglibc-initial can't unpackDexuan CuiDexuan CuiVERIFIEDmajorHigh0.9 M4
354connmand can not start up with qemux86 with sato imagexianchao zhangDongxiao XuVERIFIEDnormalMedium0.9 M4
356upstream rpm location is changingMark HatleMark HatleRESOLVEDnormalLow0.9 M4
359Some icons broken in qemux86 imagesxianchao zhangSaul WoldRESOLVEDnormalLow0.9 M4
360When switching to the package_deb format, the system errors earlyMark HatleSaul WoldRESOLVEDmajorHigh0.9 M4
362When do_fetch attempts to pull from a "git" source, a failure is not detectedMark HatleJoshua Lock - DisabledVERIFIEDmajorHigh0.9 M4
363dmesg error from uvesafb with qemux86 with sato imagexianchao zhangEdwin ZhaiVERIFIEDnormalMedium0.9 M4
364network shutdown by connman caused the NFS hang during qemu poweroff/rebootLianhao LuDongxiao XuVERIFIEDnormalMedium0.9 M4
365[busybox] date command does not accept linux time setting formatJiajun XuSaul WoldVERIFIEDnormalMedium0.9 M4
366building meta-toolchain-sdk fails: undefined reference to __stack_chk_guardDexuan CuiDexuan CuiVERIFIEDmajorHigh0.9 M4
367[qemu-x86-64-sato]connection refused when run ssh commandKunwei TianSaul WoldVERIFIEDnormalMedium0.9 M4
368SDK install incorrectly prompt "Do you want to install moblin there ?"Ke YuKe YuVERIFIEDnormalMedium0.9 M4
369can't build attrDexuan CuiDexuan CuiVERIFIEDnormalMedium0.9 M4
370on 32-bit Fedora 13, can't build ncurses-native for qemuarmDexuan CuiDexuan CuiVERIFIEDnormalMedium0.9 M4
371"runqemu qemux86-64" failed due to tap settingDexuan CuiScott GarmanVERIFIEDnormalMedium0.9 M4
373kernel: allow BSP boostrappingBruce AshfieldBruce AshfieldVERIFIEDnormalMedium0.9 M4
374binutils and gcc do not have the poison patch enabledMark HatleMark HatleRESOLVEDmajorHigh0.9 M4
375It can be difficult to find the log filesMark HatleMark HatleRESOLVEDenhancementMedium0.9 M4
376Update the insane bbclass to search for bad include and library pathsMark HatleMark HatleRESOLVEDenhancementMedium0.9 M4
379siteconfig can fail if the directory already existsMark HatleMark HatleRESOLVEDnormalMedium0.9 M4
381augeas package fails to build if readline is not presentMark HatleMark HatleRESOLVEDnormalMedium0.9 M4
383Log files are generated in the build.py exec_funcMark HatleRichard PurdieRESOLVEDnormalMedium0.9 M4
385python has host system contaminationMark HatleNitin KambleRESOLVEDnormalMedium0.9 M4
386qemugl has host system contamination issuesMark HatleKe YuRESOLVEDnormalMedium0.9 M4
387the progress dialog for oprofile-view, lttv-viewer needs improvementJessicaLianhao LuVERIFIEDnormalMedium0.9 M4
388kernel/build: cannot patch a auto-created branchBruce AshfieldBruce AshfieldVERIFIEDnormalMedium0.9 M4
389Use a more common lockfile utility for poky's qemu scriptsScott GarmanScott GarmanVERIFIEDnormalMedium0.9 M4
390incremental kernel configuration cannot be doneBruce AshfieldBruce AshfieldVERIFIEDnormalMedium0.9 M4
391Create a script to generate a "bank" of tap devices for Poky QEMU sessions to useScott GarmanScott GarmanVERIFIEDnormalMedium0.9 M4
392Add psuedo-native, qemu-helper-native, and unfs-server-native to qemu-native DEPENDSScott GarmanScott GarmanVERIFIEDnormalMedium0.9 M4
393Allow running of multiple QEMU nfs instancesScott GarmanScott GarmanVERIFIEDnormalMedium0.9 M4
395i915 options are ignored by configme (any choice marked as optional)Darren HartDarren HartVERIFIEDnormalMedium0.9 M4
396Make linux-wrs the default kernel for emenlowTom ZanussiTom ZanussiRESOLVEDnormalHigh0.9 M4
397PR is not properly parsed when a .bbappend is usedSaul WoldRichard PurdieVERIFIEDnormalMedium0.9 M4
398The emenlow formfactor file is named incorrectlySaul WoldSaul WoldVERIFIEDnormalMedium0.9 M4
401dpkg needs to be updated to support pseudoSaul WoldDongxiao XuVERIFIEDcriticalHigh0.9 M4
404RPM segfaults on targetMark HatleMark HatleRESOLVEDcriticalHigh0.9 M4
408poky-qemu is missing an option to disable graphicsScott GarmanScott GarmanVERIFIEDnormalMedium0.9 M4
410Add method to not build licensed bitsSaul WoldSaul WoldVERIFIEDnormalMedium0.9 M4
411lockfile-create 0.1.11 in Ubuntu9.04 doesn't provide "--use-pid" optionKevin TianScott GarmanVERIFIEDcriticalHigh0.9 M4
415poky-qemu does not accept a ROOTFS argument of poky-image-xyzScott GarmanScott GarmanVERIFIEDnormalMedium0.9 M4
416zypper does not build in new imageKunwei TianSaul WoldVERIFIEDmajorHigh0.9 M4
419Meet internal error when building c++ project sudoku in arm-qemu targetliping KeNitin KambleRESOLVEDmajorHigh0.9 M4
420tasks can not start up with qemux86xianchao zhangEdwin ZhaiVERIFIEDnormalMedium0.9 M4
421beagleboard: create a beagle board BSPBruce AshfieldBruce AshfieldVERIFIEDnormalMedium0.9 M4
422routerstation: create initial routerstation pro BSPBruce AshfieldBruce AshfieldVERIFIEDnormalMedium0.9 M4
423fsl-mpc8315e-rdb: create initial BSPBruce AshfieldBruce AshfieldVERIFIEDnormalMedium0.9 M4
424/bin/sh can't ccess tty: job control turned offJiajun XuSaul WoldVERIFIEDcriticalHigh0.9 M4
425libust is missing in meta-toolchain & meta-toolchain-sdkLianhao LuDexuan CuiVERIFIEDnormalMedium0.9 M4
426X server can not startup with sato/sdk with qemuarm/qemumipsxianchao zhangSaul WoldVERIFIEDnormalMedium0.9 M4
427poky-qemu fails when full path to rootfs image is given with -image- in its nameScott GarmanScott GarmanVERIFIEDnormalMedium0.9 M4
428Need recipe to support build poky-image-sdk-directdisk imageJessicaJessicaVERIFIEDnormalMedium0.9 M4
430poky-extract-sdk failsliping KeScott GarmanVERIFIEDnormalMedium0.9 M4
431start x86 unfs qemu fails after source /opt/poky/envrionment-i586-XXX filesliping KeScott GarmanVERIFIEDmajorHigh0.9 M4
432[Netbook][Emenlow]fail to install latest live imageKunwei TianDarren HartVERIFIEDcriticalHigh0.9 M4
433If set memory=256 for ARM, qemu arm will fail to bootliping KeScott GarmanVERIFIEDnormalMedium0.9 M4
435[RPM] Segfault when rpm/zypper remove packagesJiajun XuMark HatleVERIFIEDmajorHigh0.9 M4
436Updating linux-wrs checkouts failingRichard PurdieRichard PurdieVERIFIEDcriticalHigh0.9 M4
437eth0 is missing in the atom-pc directdisk sdk imageJessicaDarren HartVERIFIEDmajorHigh0.9 M4
438atom-pc: missing wireless driver for Toshiba NB305 and the eee901Darren HartDarren HartVERIFIEDmajorHigh0.9 M4
442libtasn1 shared library is miss on the targetLianhao LuQing HeVERIFIEDnormalMedium0.9 M4
444avahi-daemon NOT startup due to permission issue with all non-x86 archxianchao zhangEdwin ZhaiVERIFIEDnormalMedium0.9 M4
445[Netbook] directdisk image can not boot from harddiskJiajun XuDarren HartVERIFIEDnormalHigh0.9 M4
447[eMenlow] keyboard pop up when clicking terminal iconJiajun XuTom ZanussiVERIFIEDnormalMedium0.9 M4
449[Netbook] dmesg error from uvesafbJiajun XuBruce AshfieldVERIFIEDnormalMedium0.9 M4
450[atom-pc] Undefined video mode message on bootTom ZanussiTom ZanussiRESOLVEDnormalMedium0.9 M4
451poky-image-sdk-live-emenlow 'install' fails with nonsensical partition sizeTom ZanussiSaul WoldRESOLVEDnormalMedium0.9 M4
455Contacts doesn't work well on RC1 imageEdwin ZhaiEdwin ZhaiRESOLVEDnormalMedium0.9 M4
457Can't login via tty console in LSB imageEdwin ZhaiSaul WoldVERIFIEDnormalMedium0.9 M4
458No shutdown icon on the desktop for qemux86-64 imageEdwin ZhaiEdwin ZhaiRESOLVEDnormalMedium0.9 M4
459we should set filestyle to be unix in TCFFileServiceliping Keliping KeVERIFIEDnormalMedium0.9 M4
462[QT] Qt lib and app are not built in MIPS archKe YuSaul WoldVERIFIEDnormalMedium0.9 M4
463Wrong directory/file access permission in pokyDongxiao XuSaul WoldVERIFIEDnormalMedium0.9 M4
466shared-mime-info native requires host to have shared-mime-info installedJoshua Lock - DisabledSaul WoldVERIFIEDnormalMedium0.9 M4
467Poky build fails on F14Joshua Lock - DisabledJoshua Lock - DisabledVERIFIEDnormalMedium0.9 M4
468atom-pc: setup serial and tty consoles for netbooks and dev boardsDarren HartDarren HartVERIFIEDmajorHigh0.9 M4
469SRC_URIs for gupnp-related packages are brokenScott GarmanScott GarmanVERIFIEDnormalMedium0.9 M4
470Eclipse plug-in installation issues:JessicaLianhao LuVERIFIEDnormalMedium0.9 M4
473shared libraries libtasn1.so loading errorxianchao zhangSaul WoldRESOLVEDnormalMedium0.9 M4
474Video player will hang if adding unknown type filesDongxiao XuDongxiao XuVERIFIEDnormalMedium0.9 M4
475[qemux86]fail to rebootKunwei TianScott GarmanVERIFIEDnormalMedium0.9 M4
476No video codec is built into pokyDongxiao XuDongxiao XuVERIFIEDnormalMedium0.9 M4
479"cannot execute bin/sh" when changing user in lsb imageKevin TianKevin TianVERIFIEDnormalMedium0.9 M4
482syslog startup script is brokenMark HatleQing HeRESOLVEDnormalMedium0.9 M4
483NFS server initscript does not workMark HatleQing HeRESOLVEDnormalMedium0.9 M4
494user is unaware of the launching failure of oprofile-viewer & lttv-guiLianhao LuLianhao LuVERIFIEDnormalMedium0.9 M4
497[qemux86-64] No icons showing at the first time bootJiajun XuKe YuVERIFIEDnormalMedium0.9 M4
499OProfile-viewer failure with exit value: 134JessicaLianhao LuVERIFIEDmajorHigh0.9 M4
508linux-2.6-windriver repository sizeBruce AshfieldBruce AshfieldVERIFIEDmajorHigh0.9 M4
681[routerstation]kernel uses incorrect cmdline on Laverne release build.Liang WangBruce AshfieldRESOLVEDmajorLow0.9.1
685mpc8315e-rdb kernel of nightly build (20110121-1,Laverne release) boot failedliang liBruce AshfieldRESOLVEDnormalLow0.9.1
690[core] quilt-native do_configure fail on opensuse 11.3 with laverne 4.0Jiajun XuQing HeRESOLVEDnormalUndecided0.9.1
693Live image booting pauses indefinitely with 'waiting for removable media' messageTom ZanussiTom ZanussiRESOLVEDnormalMedium0.9.1
632gcc 4.2.4 (ubuntu) goes into busyloop on building elfutils_0.148Aleksandr KoltsoffNitin KambleRESOLVEDnormalMedium0.9.2
682[qemumips] keyboard pop up when clicking terminal icon on qemumips image with Laverne build 20110121.Liang WangSaul WoldVERIFIEDnormalLow0.9.2
683There are 2 'Connection Manage' icons on qemumips/qemuarm desktop with Laverne build 20110121Liang WangDongxiao XuVERIFIEDnormalLow0.9.2
8163opkg don't resume big upgrades (old issue #17)Alejandro del CastilloAlejandro del CastilloNEWnormalMedium1.0
8336[internalsolv] Problem when upgrading a package which depends on a new package (old issue #32)Alejandro del CastilloAlejandro del CastilloNEWminorUndecided1.0
8339Manpages (old issue #56)Alejandro del CastilloAlejandro del CastilloNEWenhancementUndecided1.0
8346Check for package list update before downloading (old issue #117)Alejandro del CastilloAlejandro del CastilloNEWenhancementUndecided1.0
8347Review performance of algorithms using pkg_vec (old issue #120)Alejandro del CastilloAlejandro del CastilloNEWenhancementUndecided1.0
8349dist-upgrade feature (old issue #126)Alejandro del CastilloAlejandro del CastilloNEWenhancementUndecided1.0
48Should use qemu hibernation to avoid constant bootingRoss Burton - Disabledliping KeRESOLVEDenhancementLow1.0 M1
87toolchain triplet should be project specificGary Thomasliping KeRESOLVEDenhancementLow1.0 M1
112Improve error reportingJoshua Lock - DisabledJoshua Lock - DisabledVERIFIEDnormalLow1.0 M1
119Ensure the correct (bash) shell is used when spawning shellsJoshua Lock - DisabledJoshua Lock - DisabledVERIFIEDnormalLow1.0 M1
120Handle unbuildable targets betterJoshua Lock - DisabledRichard PurdieVERIFIEDnormalLow1.0 M1
124Stackable checksum.iniJeff DikeRichard PurdieRESOLVEDnormalLow1.0 M1
128bitbake fails to execute with Python 2.4.3Mark HatleRichard PurdieRESOLVEDnormalLow1.0 M1
169[LTP] LTP default test suite cannot fully passJiajun XuKevin TianRESOLVEDnormalLow1.0 M1
176versioned RRECOMMENDS not workingQing HeQing HeRESOLVEDminorLow1.0 M1
206lttng-ust: Inconsistent license info in manual and source codeDexuan CuiDexuan CuiVERIFIEDnormalLow1.0 M1
222poky-image-sato-live build failureKevin TianMark HatleVERIFIEDmajorHigh1.0 M1
236linux-libc-headers do_install task failed.Dongxiao XuDexuan CuiRESOLVEDnormalLow1.0 M1
246non root install patch is not necessaryKe YuMei LeiVERIFIEDenhancementMedium1.0 M1
254Should really use GIOJoshua Lock - Disabledliping KeVERIFIEDnormalMedium1.0 M1
259[Connman] wpa_supplicant not start by defaultJiajun XuDongxiao XuVERIFIEDnormalMedium1.0 M1
265"date: invalid date xxxx" error at every bootKevin TianKevin TianRESOLVEDnormalLow1.0 M1
283QEMU - more dynamic QEMU configurationMark Hatleliping KeRESOLVEDenhancementLow1.0 M1
285Improve overlay appending to FILESPATH syntaxRichard PurdieRichard PurdieRESOLVEDenhancementLow1.0 M1
322qemumips shutdown cause host console warningxianchao zhangEdwin ZhaiRESOLVEDminorLow1.0 M1
350Clean up poky-doc-toolsRichard PurdieScott RifenbarkVERIFIEDenhancementMedium1.0 M1
361'bitbake -c listtasks' doesn't output to stdoutDarren HartKevin TianRESOLVEDnormalLow1.0 M1
377When building there are too many messagesMark HatleRichard PurdieRESOLVEDenhancementMedium1.0 M1
394qemumips should use usb wacom mouse input, not mousedevRichard PurdieBruce AshfieldRESOLVEDenhancementLow1.0 M1
409poky-qemu script needs a way to override default memory sizeScott Garmanliping KeRESOLVEDnormalMedium1.0 M1
446Potential bug: anjuta QEMU IP is statically 192.168.7.2liping KeJessicaRESOLVEDenhancementLow1.0 M1
460Include qemu images into sdk tar ballliping KeScott GarmanVERIFIEDenhancementMedium1.0 M1
465emenlow/atom-pc kernel log buffer too smallTom ZanussiTom ZanussiRESOLVEDminorLow1.0 M1
478running postinst /etc/rpm-postinsts/sed.sh error in lsb imageKevin TianKevin TianVERIFIEDnormalMedium1.0 M1
484ps / dbus / hal uid problemMark HatleQing HeRESOLVEDnormalMedium1.0 M1
492[QT] many qtdemo has no description documentKe YuPaul EggletonRESOLVEDminorLow1.0 M1
495"tar xf" in target can't extract sudoku-savant-1.3.tarDexuan CuiDexuan CuiVERIFIEDnormalMedium1.0 M1
496[QT] I18N issue: qtdemo webbrowser can not display Chinese page correctlyKe YuKe YuRESOLVEDnormalMedium1.0 M1
502[Netbook]In S3 mode,system reboot automatically when try resume backKunwei TianTom ZanussiVERIFIEDnormalMedium1.0 M1
505exit lttv-gui report errorJessicaLianhao LuRESOLVEDnormalMedium1.0 M1
510"rpm -e libnss-mdns" gets errorDexuan CuiQing HeVERIFIEDnormalMedium1.0 M1
511ldconfig: Can't open configuration file /etc/ld.so.conf: No such fileDexuan CuiDexuan CuiVERIFIEDnormalMedium1.0 M1
514some packages were removed but also exist in distro_tracking_fields.incMei LeiMei LeiRESOLVEDnormalMedium1.0 M1
517RPM complains if host /boot partition is less than 125MBRob WoolleyMark HatleRESOLVEDminorMedium1.0 M1
521quilt-native doesn't buildAlex deVriesNitin KambleRESOLVEDminorLow1.0 M1
522enable sstate prebuilt for different build directoryKevin TianRichard PurdieRESOLVEDnormalMedium1.0 M1
523Incorrect MACHINE= setting should be detected earlyAlex deVriesRichard PurdieRESOLVEDnormalMedium1.0 M1
527Partial application of user contributed patchBarrett Heynemanliping KeRESOLVEDnormalMedium1.0 M1
528gcc-cross-canadian package names should include the target architectureJoshua Lock - DisabledLianhao LuVERIFIEDnormalMedium1.0 M1
530Preferences:clicking "restore defaults", then "OK" leads to the error dialogAnna Dushistovaliping KeRESOLVEDnormalMedium1.0 M1
532INC_PR is not documentedDarren HartScott RifenbarkVERIFIEDnormalMedium1.0 M1
534Target dropdown is not updated automatically and contains empty string as defaultAnna DushistovaJessicaRESOLVEDnormalMedium1.0 M1
535poky-qemu does not detect MACHINE correctly from yocto 0.9 release imagesScott GarmanScott GarmanVERIFIEDnormalMedium1.0 M1
536SDK install of poky-qemu will not run with yocto 0.9 release images unless filesystem type is explicitly givenScott GarmanScott GarmanVERIFIEDnormalMedium1.0 M1
537cannot build the "Hello World" Yocto SDK projectAnna DushistovaJessicaRESOLVEDnormalMedium1.0 M1
538Could not display mouse cursor on qemumipsChanghui LiuBruce AshfieldVERIFIEDnormalMedium1.0 M1
540rpm version compare works incorrectlyKe YuQing HeVERIFIEDnormalLow1.0 M1
546libreadlines clash when installing gdb cross ipkliping KeSaul WoldRESOLVEDnormalMedium1.0 M1
552autobuild missing the non-x86 realboard imagesxianchao zhangBeth FlanaganVERIFIEDnormalMedium1.0 M1
554Can't build meta-toolchain-sdk as libart-lgpl_2.3.21.bb fails on unpackGary ThomasDongxiao XuRESOLVEDnormalMedium1.0 M1
556do_unpack failed for libart-lgpl_2.3.21.bb for MACHINE qemuppcLianhao LuDexuan CuiVERIFIEDnormalMedium1.0 M1
568poky-qemu fails under common usage scenarioScott GarmanScott GarmanVERIFIEDnormalMedium1.0 M1
597kernel manual: preempt_rt now named preempt-rtDarren HartScott RifenbarkVERIFIEDnormalMedium1.0 M1
117Track access to host systemJoshua Lock - DisabledJoshua Lock - DisabledVERIFIEDnormalMedium1.0 M2
382oprofile-viewer connect to oprofile-server takes forever for PPCJessicaLianhao LuVERIFIEDnormalMedium1.0 M2
439audio mixer on BlackSand is muted on bootDarren HartSaul WoldVERIFIEDnormalMedium1.0 M2
461As an emulator device for developer, qemu should expose some developer editable attributesliping Keliping KeRESOLVEDenhancementMedium1.0 M2
493OProfileServer spawning of oprofilectl failure will show through OProfile-viewerJessicaJessicaVERIFIEDnormalMedium1.0 M2
506connman-gnome installs a duplicate desktop fileJoshua Lock - DisabledDongxiao XuVERIFIEDnormalMedium1.0 M2
509Xorg and matchbox-window will SegFault when there are too many windowsDexuan CuiEdwin ZhaiRESOLVEDnormalMedium1.0 M2
512Very slow response after login the system on arm real hardware boardChanghui LiuKe YuRESOLVEDmajorMedium1.0 M2
541On poky laverne-4.0, poky-image-sato for the igep0020 does not start XDavid BarksdaleQing HeRESOLVEDnormalMedium1.0 M2
565need a new package for environment files for installerLianhao LuLianhao LuVERIFIEDnormalMedium1.0 M2
566[Netbook] Installer no response after loading from live imageKunwei TianDarren HartVERIFIEDcriticalHigh1.0 M2
572elfutils-native-0.148 build fails: ./ld: unrecognized option '--no-add-needed'Wolfgang DenkNitin KambleRESOLVEDmajorHigh1.0 M2
578Unable to build a Laverne image on Fedora 14Joshua Lock - DisabledJoshua Lock - DisabledVERIFIEDnormalMedium1.0 M2
585PPC is failing to buildSaul WoldBruce AshfieldVERIFIEDcriticalHigh1.0 M2
587gnome-desktop: do_compile failedDexuan CuiDexuan CuiVERIFIEDcriticalHigh1.0 M2
590Gnome-Desktop Failing due to doc failuresSaul WoldEdwin ZhaiVERIFIEDmajorHigh1.0 M2
596No mouse action response in X window with qemuarm imagesYi ZhaoBruce AshfieldVERIFIEDmajorHigh1.0 M2
599[poky] qemu running with KVM needs root permissionJiajun XuEdwin ZhaiVERIFIEDnormalHigh1.0 M2
1082[x86_64] No icons shown on X desktop with sato imageJiajun XuTom ZanussiRESOLVEDnormalLow1.0 M2
62poky-qemu fails for spitzRoss Burton - DisabledRichard PurdieRESOLVEDnormalLow1.0 M3
227meta/packages/meta/*toolchain*Mark HatleLianhao LuVERIFIEDnormalMedium1.0 M3
239Toolchain bootstrapping process overwrites files in the sysrootRichard PurdieDexuan CuiRESOLVEDenhancementMedium1.0 M3
284Enhance plugin UI's to make chroot requirement more explicitJoshua Lock - DisabledJessicaVERIFIEDenhancementLow1.0 M3
336[QT] fotowall display abnormal on eMenlowJiajun XuPaul EggletonRESOLVEDnormalMedium1.0 M3
353Add libtool 2.4 sysroot support and remove libtool hacks/workaroundsRichard PurdieScott GarmanRESOLVEDenhancementMedium1.0 M3
355Refactor fetch's go() methodJoshua Lock - DisabledKe YuVERIFIEDenhancementMedium1.0 M3
357Update RPM to 5.2.2 or newerMark HatleMark HatleRESOLVEDenhancementMedium1.0 M3
384perl has host system contaminationMark HatleNitin KambleRESOLVEDnormalMedium1.0 M3
417gcc compile in sdk image failed with qemuppcxianchao zhangDexuan CuiRESOLVEDnormalMedium1.0 M3
434[wishlist] rpm repository creationQing HeQing HeRESOLVEDenhancementLow1.0 M3
452[Qt] qtdemo warning: missing Qt database driverKe YuPaul EggletonRESOLVEDenhancementMedium1.0 M3
480soft lockup warnings pop up after idle for a whileKevin TianKevin TianVERIFIEDnormalMedium1.0 M3
488No audio on qemux86 machineJoshua Lock - DisabledEdwin ZhaiRESOLVEDenhancementMedium1.0 M3
515PPC libraries incorrectly linkedJoshua Lock - DisabledMark HatleRESOLVEDnormalMedium1.0 M3
516Change Dynamic Shared Object (DSO) linking to be explicitJoshua Lock - DisabledNitin KambleVERIFIEDenhancementMedium1.0 M3
524Crazy Qt packagingGary ThomasKe YuRESOLVEDnormalMedium1.0 M3
526LD_PRELOAD missing libpseudo.soGary ThomasRichard PurdieRESOLVEDnormalMedium1.0 M3
550two machines armv4t and armv5te, toolchain problem.João HenriqueNitin KambleRESOLVEDnormalMedium1.0 M3
555After untar sdk tarball to /opt/poky, My root folder's user info is changed!liping KeDexuan CuiVERIFIEDnormalMedium1.0 M3
561BitBake None server never returns events to UI's when using getEvent()Joshua Lock - DisabledPaul EggletonVERIFIEDnormalMedium1.0 M3
562Enhance sanity tests such that 'invasive' tests aren't run with each bitbake invocationJoshua Lock - DisabledPaul EggletonVERIFIEDnormalMedium1.0 M3
567LSB: Desktop Test - desktop-cairoXiaofeng YanKe YuRESOLVEDnormalMedium1.0 M3
569LSB: Desktop Test - desktop-qt4Xiaofeng YanKe YuRESOLVEDnormalMedium1.0 M3
570LSB: Desktop Test - desktop-gtkvtsXiaofeng YanEdwin ZhaiRESOLVEDnormalMedium1.0 M3
573http fetcher cannot handle ';' in the urlNitin KambleKe YuRESOLVEDnormalMedium1.0 M3
581blktrace build fails with internal BFD errorTom ZanussiTom ZanussiRESOLVEDnormalHigh1.0 M3
583Detect whether user is setup for using poky tree modeJessicaliping KeVERIFIEDnormalMedium1.0 M3
584Change the permission and ownership of target sysroot to userJessicaliping KeVERIFIEDnormalMedium1.0 M3
586poky sdk version can't be decided simply by build dateliping KeJessicaRESOLVEDnormalMedium1.0 M3
589Yocto ADT installerJessicaJessicaVERIFIEDenhancementHigh1.0 M3
592bitbake meta-toolchain-sdk failed on top of master (9ad383525657b44dc7eeb347e888deebb501b00)liping KeDexuan CuiRESOLVEDminorLow1.0 M3
594Display an error when IMAGETEST is set but DISPLAY is not.Scott GarmanJiajun XuVERIFIEDnormalMedium1.0 M3
600rpm building fails with autoconf upgradeNitin KambleMark HatleRESOLVEDcriticalHigh1.0 M3
601linux-yocto recipe fetch failsNitin KambleRichard PurdieRESOLVEDnormalHigh1.0 M3
602Copying sstate-cache to another system results in build error due to perl library path (autoconf-native build)Scott GarmanKevin TianRESOLVEDnormalMedium1.0 M3
603[Netbook]Connection preferences did not enable wireless networksKunwei TianDongxiao XuVERIFIEDmajorMedium1.0 M3
604[toolchain]Build c program failed with arm toolchainYi ZhaoNitin KambleVERIFIEDmajorHigh1.0 M3
605GCC-cross uses incorrect paths making sstate copy unusableGary ThomasKevin TianRESOLVEDnormalMedium1.0 M3
606Build hangs if $DL_DIR is read-onlyGary ThomasKe YuRESOLVEDnormalMedium1.0 M3
610no rootfs and dtb file in qemumpc8315e-rdb milestone buildliang liBruce AshfieldVERIFIEDnormalMedium1.0 M3
611Sanity Test Boot test returns invalid results.Beth FlanaganJiajun XuRESOLVEDnormalMedium1.0 M3
617[routerstation]kernel uses incorrect cmdlineYi ZhaoBruce AshfieldVERIFIEDnormalMedium1.0 M3
619[Connman] No services item under Connection PreferencesLiang WangDongxiao XuVERIFIEDnormalMedium1.0 M3
620unfs-qemu x86 failed to bootliping KeBruce AshfieldRESOLVEDnormalMedium1.0 M3
621libglib-2.0: g_mem_profle() return a error resultXiaofeng YanDongxiao XuRESOLVEDnormalMedium1.0 M3
622[toolchain] no "qemu-ppc" command after toolchain running environment setupliang liSaul WoldVERIFIEDnormalMedium1.0 M3
625no need to build pseudo for all invoking of bitbakeLianhao LuLianhao LuVERIFIEDnormalUndecided1.0 M3
628Yocto Project Quick Start does not mention dependency on python 2.6Aleksandr KoltsoffScott RifenbarkVERIFIEDnormalMedium1.0 M3
629poky-init-build-env should check for python version >= 2.6 before doing muchAleksandr KoltsoffRichard PurdieRESOLVEDnormalMedium1.0 M3
631rm_work should be mentioned somewhereAleksandr KoltsoffScott RifenbarkVERIFIEDnormalMedium1.0 M3
645wrong output of "bitbake -e"Lianhao LuLianhao LuVERIFIEDmajorMedium1.0 M3
648QEMU Fails to start with 'serial' optionMark HatleEdwin ZhaiRESOLVEDmajorHigh1.0 M3
651no longer need standard c++ include path included in the CXXFLAGS in the environment fileLianhao LuLianhao LuVERIFIEDnormalMedium1.0 M3
652need to adjust package content of libtool and add libtool-nativesdk into meta-toolchainLianhao LuLianhao LuVERIFIEDmajorMedium1.0 M3
654[qemuarm]kernel panic when booting qemuarm images of nightly build 20110114-1Yi ZhaoBruce AshfieldVERIFIEDcriticalHigh1.0 M3
661util-linux ends up in images due to problematic dependenciesAleksandr KoltsoffQing HeRESOLVEDnormalMedium1.0 M3
665gnome-mime-data fails configure for missing perl XML on ARMDarren HartEdwin ZhaiRESOLVEDcriticalHigh1.0 M3
677Serial console unusable with poky-image-sato-sdkWolfgang DenkSaul WoldRESOLVEDnormalMedium1.0 M3
1261meta-rt: linux-yocto-rt fails to buildDarren HartBruce AshfieldRESOLVEDnormalHigh1.0 M3
154libtool has incorrect paths embeddedRichard PurdieNitin KambleRESOLVEDnormalMedium1.0 M4
211docs in iputils package can not be madeKe YuScott GarmanRESOLVEDenhancementLow1.0 M4
213libuser missing the html/txt doc filesEdwin ZhaiScott GarmanRESOLVEDenhancementLow1.0 M4
241Can't build kernel modules outside of virtual/kernel recipeGary ThomasDarren HartRESOLVEDmajorMedium1.0 M4
282Expand debug packages to include corresponding source codeMark HatleMark HatleRESOLVEDenhancementLow1.0 M4
358Add a test which scans a non-v3 build for any v3 codeDave StewartJiajun XuVERIFIEDnormalMedium1.0 M4
402Parallel build failures for gcc-cross-intermediate-4.5.0-r10Alex deVriesNitin KambleRESOLVEDminorMedium1.0 M4
429error in compiling gmp-nativesdk for qemumips architecture on x86_64 hostLianhao LuSaul WoldVERIFIEDnormalLow1.0 M4
440Continuously meet MountD error when booting unfs-qemuliping KeScott GarmanRESOLVEDminorLow1.0 M4
441target's /usr/lib/libstdc++.so.6.0.14-gdb.py causes ldconfig's warningLianhao LuNitin KambleVERIFIEDminorLow1.0 M4
443zypper encounter segfault when startup with qemuppcxianchao zhangQing HeVERIFIEDmajorHigh1.0 M4
471More than one connman-applet will be launched by clicking its iconDongxiao XuDongxiao XuRESOLVEDminorLow1.0 M4
472connman-applet menu could not pop up if all the networks are disabled.Dongxiao XuDongxiao XuVERIFIEDminorLow1.0 M4
489[zypper] uname -m and repo arch differenceQing HeQing HeVERIFIEDnormalMedium1.0 M4
490[zypper] installation failure on armQing HeQing HeVERIFIEDnormalMedium1.0 M4
491[zypper] package removal failureQing HeQing HeVERIFIEDnormalMedium1.0 M4
507sstate tracking bugJoshua Lock - DisabledRichard PurdieVERIFIEDnormalMedium1.0 M4
519debug configuration should be able to locate the corrent binaryJessicaLianhao LuVERIFIEDnormalMedium1.0 M4
529fetcher failback fails if trying to access CVS archive and not able to connectKumar GalaKe YuRESOLVEDnormalMedium1.0 M4
543Bitbake complains about mmap_min_addr for an unknown reasonDarren HartEdwin ZhaiRESOLVEDnormalMedium1.0 M4
547libmpfr4 clash when installing gdb cross ipkliping KeQing HeRESOLVEDnormalMedium1.0 M4
553References still exist to pokylinux.orgDave StewartScott RifenbarkVERIFIEDnormalMedium1.0 M4
575mtd-utils_1.4.1 fails to buildWolfgang DenkKe YuRESOLVEDnormalMedium1.0 M4
576COMMERCIAL_LICENSE causes confusionJoshua Lock - DisabledScott RifenbarkRESOLVEDnormalMedium1.0 M4
595Sanity tests do not always kill QEMU once timeout is reachedScott GarmanJiajun XuRESOLVEDnormalMedium1.0 M4
598[poky] kernel interactive build does not work via sshJiajun XuBruce AshfieldVERIFIEDenhancementMedium1.0 M4
608[rpm/zypper] remove_packaging_data_files makes rpm/zypper install/remove not work in minimal imageJiajun XuQing HeVERIFIEDnormalMedium1.0 M4
614LSB: Change of default encoding of python cause python-runtime test failure(test_builtin.py, test_getargs.py)Jingdong LuJingdong LuRESOLVEDnormalMedium1.0 M4
615[multimedia] video player reports error when open video filesKunwei TianDongxiao XuVERIFIEDnormalMedium1.0 M4
616[multimedia] No sound from machine when playing audio filesKunwei TianDongxiao XuVERIFIEDnormalMedium1.0 M4
623gypsy_svn.bb SRC_URI host no longer existKe YuDongxiao XuRESOLVEDnormalMedium1.0 M4
626RPM is much larger than it needs to beRichard PurdieMark HatleRESOLVEDnormalMedium1.0 M4
634swabber is broken with recent bitbake changesRichard PurdieRichard PurdieRESOLVEDnormalHigh1.0 M4
639need manual for ADT installerKevin TianScott RifenbarkVERIFIEDnormalMedium1.0 M4
640update eclipse/anjuta plugin section in handbookKevin TianScott RifenbarkVERIFIEDnormalMedium1.0 M4
642update kernel use manualKevin TianScott RifenbarkVERIFIEDnormalMedium1.0 M4
643extend our FAQ to contain more usage tipsKevin TianScott RifenbarkVERIFIEDnormalMedium1.0 M4
644ParameterError in "bitbake -e"Lianhao LuRichard PurdieVERIFIEDnormalMedium1.0 M4
649QEMU Segfaults with nographic optionMark HatleEdwin ZhaiRESOLVEDmajorHigh1.0 M4
653Build of current master fails with "cannot change ownership" errors.Wolfgang DenkPaul EggletonRESOLVEDmajorHigh1.0 M4
656Error occur when clicking on Contacts icon.Liang WangEdwin ZhaiVERIFIEDminorMedium1.0 M4
658The bottom icons on Applications and All screen are cut-off in qemu.Liang WangKe YuVERIFIEDnormalMedium1.0 M4
660Missing kernel firmwareGary ThomasDongxiao XuRESOLVEDnormalMedium1.0 M4
662qemu /proc/sys/vm/mmap_min_addr check should be removedTom RiniRichard PurdieRESOLVEDnormalMedium1.0 M4
664libtool does not add right libraries to be linked in the .la filesNitin KambleScott GarmanRESOLVEDnormalMedium1.0 M4
666Packaging takes an extremely long timeJoshua Lock - DisabledRichard PurdieVERIFIEDnormalHigh1.0 M4
668rpm "unknown option" error while do_rootfs if build from sstateDongxiao XuDongxiao XuRESOLVEDnormalHigh1.0 M4
669do_populate_sdk failure if build meta-toolchain-sdk from sstateDongxiao XuDongxiao XuRESOLVEDnormalMedium1.0 M4
673[LTP]normal user can't use cronKevin TianKevin TianVERIFIEDnormalMedium1.0 M4
675[LTP]normal user can't use atKevin TianKevin TianVERIFIEDnormalMedium1.0 M4
687qemu X boot failure due to missing of libhal.so.1Dongxiao XuSaul WoldRESOLVEDnormalMedium1.0 M4
688Unable to run OpenGL applications in qemux86 imagesJoshua Lock - DisabledEdwin ZhaiRESOLVEDnormalMedium1.0 M4
689BB_ENV_EXTRAWHITE does not respect CCACHE_DIRWolfgang DenkScott RifenbarkRESOLVEDminorMedium1.0 M4
692kernel: make kernel configuration audit information visibleBruce AshfieldBruce AshfieldRESOLVEDnormalLow1.0 M4
694gtk application compilation errorJessicaLianhao LuVERIFIEDnormalMedium1.0 M4
695BSP developer's guide package title typeDave StewartScott RifenbarkVERIFIEDnormalMedium1.0 M4
696Why is there no copyright on the quick start guide ?Dave StewartScott RifenbarkVERIFIEDnormalMedium1.0 M4
697web2 segfaults - can't start up on SugarBayTom ZanussiEdwin ZhaiRESOLVEDnormalMedium1.0 M4
698QEMU crash when using Ubuntu with NVIDIA proprietary Xorg driverMatiasEdwin ZhaiRESOLVEDnormalMedium1.0 M4
699poky-image-sato-sdk: /usr/include/{asm,asm-generic,linux} header files missingWolfgang DenkNitin KambleRESOLVEDnormalMedium1.0 M4
702Incorrect error when checking for unsafe configurationGary ThomasMark HatleRESOLVEDnormalUndecided1.0 M4
704bitbake parse does not handle # in the beginning of a quoted line correctlySaul WoldRichard PurdieVERIFIEDnormalMedium1.0 M4
 500      
Warnings were generated during the execution of function
  1. Report truncated - count greater than max allowed 501 > 500

Old Queries

Personal tools